<svg width="24" height="23" viewBox="0 0 24 23" fill="none" xmlns="http://www.w3.org/2000/svg">
<path d="M22.3685 7.41652H16.0109V1.05889C16.0109 0.512118 15.5675 0.0687256 15.0207 0.0687256H8.98206C8.43516 0.0687256 7.9919 0.512118 7.9919 1.05889V7.41652H1.63427C1.0875 7.41652 0.644104 7.85978 0.644104 8.40668V14.4453C0.644104 14.9921 1.0875 15.4355 1.63427 15.4355H7.9919V21.7931C7.9919 22.3399 8.43516 22.7832 8.98206 22.7832H15.0207C15.5675 22.7832 16.0109 22.3399 16.0109 21.7931V15.4355H22.3685C22.9153 15.4355 23.3587 14.9922 23.3587 14.4453V8.40668C23.3587 7.85991 22.9153 7.41652 22.3685 7.41652Z" fill="white"/>
</svg>
