<svg width="26" height="26" viewBox="0 0 26 26" fill="none" xmlns="http://www.w3.org/2000/svg">
<path d="M13.275 0.5C6.0125 0.5 0.75 6.425 0.75 13C0.75 15.1 1.3625 17.2625 2.4375 19.2375C2.6375 19.5625 2.6625 19.975 2.525 20.3625L1.6875 23.1625C1.5 23.8375 2.075 24.3375 2.7125 24.1375L5.2375 23.3875C5.925 23.1625 6.4625 23.45 7.10125 23.8375C8.92625 24.9125 11.2 25.4625 13.25 25.4625C19.45 25.4625 25.75 20.675 25.75 12.9625C25.75 6.3125 20.375 0.5 13.275 0.5Z" fill="white"/>
</svg>
