<svg xmlns="http://www.w3.org/2000/svg" width="64.01" height="63.891" viewBox="0 0 64.01 63.891">
  <path id="blogger" d="M62.9,27.5A4.311,4.311,0,0,0,61.2,25a23.776,23.776,0,0,0-3.5-.4c-2.8-.1-3.1-.1-3.9-.7C52.3,23,52,22.2,52,19.8c0-4.5-2-8.9-5.6-12.7a21.419,21.419,0,0,0-9.2-5.6c-.8-.3-2.7-.3-8.7-.4-9.6-.1-11.7.1-15.1,1.4A19.361,19.361,0,0,0,1.5,16.2C1.2,17.5,1,19.5,1,30.7.9,44.8,1,46.8,2,49.6a15.337,15.337,0,0,0,3,5.8c3,3.8,7.2,6.6,11.4,7.3,2.1.3,27.3.4,30,.1h0A18.768,18.768,0,0,0,57.8,57a17.857,17.857,0,0,0,4.8-8.6c.4-1.3.4-2,.4-10.6C63,31.4,63,28.3,62.9,27.5ZM18.2,18.8c1.1-1.1,1.4-1.1,8.2-1.1,6.1,0,6.3,0,7.2.4a2.959,2.959,0,0,1,1.8,3,2.962,2.962,0,0,1-1.7,3c-.6.4-1,.4-7,.4-3.7,0-6.6-.1-7-.1A3.49,3.49,0,0,1,18.2,18.8ZM44.8,46.4l-2,.3L32,46.9c-9.4.1-12.1-.1-12.7-.3a3.458,3.458,0,0,1-2-2.7,4.382,4.382,0,0,1,1.1-3.1c1-.8,1.4-.8,13.5-1,12.4,0,12.3,0,13.5,1.1A3.433,3.433,0,0,1,44.8,46.4Z" transform="translate(0.01 -0.092)" fill="#f1f6fb" stroke="#08a79e" stroke-width="2"/>
</svg>
