====================== Sistem Akademik =======================

Selamat datang di Sistem Akademik Fasilkom!
Banyaknya Matkul di Fasilkom: Masukkan matkul yang ditambah
format: [Kode Matkul] [Nama Matkul] [SKS] [Kapasitas]
Banyaknya Mahasiswa di Fasilkom: Masukkan data mahasiswa
format: [Nama] [NPM]

----------------------------MENU------------------------------

Silakan pilih menu:
1. Add Matkul
2. Drop Matkul
3. Ringkasan Mahasiswa
4. Ringkasan Mata Kuliah
5. Keluar

Pilih: 

--------------------------ADD MATKUL--------------------------

Masukkan NPM Mahasiswa yang akan melakukan ADD MATKUL : Banyaknya Matkul yang Ditambah: Masukkan nama matkul yang ditambah
Nama matakuliah 1 : Nama matakuliah 2 : Nama matakuliah 3 : 
Silakan cek rekap untuk melihat hasil pengecekan IRS.


----------------------------MENU------------------------------

Silakan pilih menu:
1. Add Matkul
2. Drop Matkul
3. Ringkasan Mahasiswa
4. Ringkasan Mata Kuliah
5. Keluar

Pilih: 
Masukkan npm mahasiswa yang akan ditunjukkan ringkasannya : 
--------------------------RINGKASAN--------------------------

Nama: Dek
NPM: 19020110200012
Jurusan: Sistem Informasi
Daftar Mata Kuliah: 
1. Adpro
2. OS
3. PPM
Total SKS: 10
Hasil Pengecekan IRS:
1. Mata kuliah Adpro tidak dapat diambil jurusan Sistem Informasi.

----------------------------MENU------------------------------

Silakan pilih menu:
1. Add Matkul
2. Drop Matkul
3. Ringkasan Mahasiswa
4. Ringkasan Mata Kuliah
5. Keluar

Pilih: 

--------------------------ADD MATKUL--------------------------

Masukkan NPM Mahasiswa yang akan melakukan ADD MATKUL : Banyaknya Matkul yang Ditambah: Masukkan nama matkul yang ditambah
Nama matakuliah 1 : Nama matakuliah 2 : Nama matakuliah 3 : 
Silakan cek rekap untuk melihat hasil pengecekan IRS.


----------------------------MENU------------------------------

Silakan pilih menu:
1. Add Matkul
2. Drop Matkul
3. Ringkasan Mahasiswa
4. Ringkasan Mata Kuliah
5. Keluar

Pilih: 
Masukkan npm mahasiswa yang akan ditunjukkan ringkasannya : 
--------------------------RINGKASAN--------------------------

Nama: Dek
NPM: 19020110200012
Jurusan: Sistem Informasi
Daftar Mata Kuliah: 
1. Adpro
2. OS
3. PPM
4. DDAK
5. PDIB
6. Basdat
Total SKS: 19
Hasil Pengecekan IRS:
1. Mata kuliah Adpro tidak dapat diambil jurusan Sistem Informasi.

----------------------------MENU------------------------------

Silakan pilih menu:
1. Add Matkul
2. Drop Matkul
3. Ringkasan Mahasiswa
4. Ringkasan Mata Kuliah
5. Keluar

Pilih: 

--------------------------ADD MATKUL--------------------------

Masukkan NPM Mahasiswa yang akan melakukan ADD MATKUL : Banyaknya Matkul yang Ditambah: Masukkan nama matkul yang ditambah
Nama matakuliah 1 : Nama matakuliah 2 : 
Silakan cek rekap untuk melihat hasil pengecekan IRS.


----------------------------MENU------------------------------

Silakan pilih menu:
1. Add Matkul
2. Drop Matkul
3. Ringkasan Mahasiswa
4. Ringkasan Mata Kuliah
5. Keluar

Pilih: 
Masukkan npm mahasiswa yang akan ditunjukkan ringkasannya : 
--------------------------RINGKASAN--------------------------

Nama: Dek
NPM: 19020110200012
Jurusan: Sistem Informasi
Daftar Mata Kuliah: 
1. Adpro
2. OS
3. PPM
4. DDAK
5. PDIB
6. Basdat
7. Alin
8. Sister
Total SKS: 25
Hasil Pengecekan IRS:
1. SKS yang diambil lebih dari 24.
2. Mata kuliah Adpro tidak dapat diambil jurusan Sistem Informasi.

----------------------------MENU------------------------------

Silakan pilih menu:
1. Add Matkul
2. Drop Matkul
3. Ringkasan Mahasiswa
4. Ringkasan Mata Kuliah
5. Keluar

Pilih: 

--------------------------ADD MATKUL--------------------------

Masukkan NPM Mahasiswa yang akan melakukan ADD MATKUL : Banyaknya Matkul yang Ditambah: Masukkan nama matkul yang ditambah
Nama matakuliah 1 : Nama matakuliah 2 : Nama matakuliah 3 : [DITOLAK] Maksimal mata kuliah yang dapat diambil hanya 10.

Silakan cek rekap untuk melihat hasil pengecekan IRS.


----------------------------MENU------------------------------

Silakan pilih menu:
1. Add Matkul
2. Drop Matkul
3. Ringkasan Mahasiswa
4. Ringkasan Mata Kuliah
5. Keluar

Pilih: 
Masukkan npm mahasiswa yang akan ditunjukkan ringkasannya : 
--------------------------RINGKASAN--------------------------

Nama: Dek
NPM: 19020110200012
Jurusan: Sistem Informasi
Daftar Mata Kuliah: 
1. Adpro
2. OS
3. PPM
4. DDAK
5. PDIB
6. Basdat
7. Alin
8. Sister
9. PPSI
10. Edagang
Total SKS: 31
Hasil Pengecekan IRS:
1. SKS yang diambil lebih dari 24.
2. Mata kuliah Adpro tidak dapat diambil jurusan Sistem Informasi.

----------------------------MENU------------------------------

Silakan pilih menu:
1. Add Matkul
2. Drop Matkul
3. Ringkasan Mahasiswa
4. Ringkasan Mata Kuliah
5. Keluar

Pilih: 

--------------------------ADD MATKUL--------------------------

Masukkan NPM Mahasiswa yang akan melakukan ADD MATKUL : Banyaknya Matkul yang Ditambah: Masukkan nama matkul yang ditambah
Nama matakuliah 1 : [DITOLAK] OS telah diambil sebelumnya.

Silakan cek rekap untuk melihat hasil pengecekan IRS.


----------------------------MENU------------------------------

Silakan pilih menu:
1. Add Matkul
2. Drop Matkul
3. Ringkasan Mahasiswa
4. Ringkasan Mata Kuliah
5. Keluar

Pilih: 

--------------------------DROP MATKUL--------------------------

Masukkan NPM Mahasiswa yang akan melakukan DROP MATKUL : Banyaknya Matkul yang Di-drop: Masukkan nama matkul yang di-drop:
Nama matakuliah 1 : [DITOLAK] Matdas2 belum pernah diambil.

Silakan cek rekap untuk melihat hasil pengecekan IRS.


----------------------------MENU------------------------------

Silakan pilih menu:
1. Add Matkul
2. Drop Matkul
3. Ringkasan Mahasiswa
4. Ringkasan Mata Kuliah
5. Keluar

Pilih: 
Masukkan nama mata kuliah yang akan ditunjukkan ringkasannya : 
--------------------------RINGKASAN--------------------------

Nama mata kuliah: OS
Kode: CS
SKS: 3
Jumlah mahasiswa: 1
Kapasitas: 2
Daftar mahasiswa yang mengambil mata kuliah ini: 
1. Dek

----------------------------MENU------------------------------

Silakan pilih menu:
1. Add Matkul
2. Drop Matkul
3. Ringkasan Mahasiswa
4. Ringkasan Mata Kuliah
5. Keluar

Pilih: 

--------------------------ADD MATKUL--------------------------

Masukkan NPM Mahasiswa yang akan melakukan ADD MATKUL : Banyaknya Matkul yang Ditambah: Masukkan nama matkul yang ditambah
Nama matakuliah 1 : 
Silakan cek rekap untuk melihat hasil pengecekan IRS.


----------------------------MENU------------------------------

Silakan pilih menu:
1. Add Matkul
2. Drop Matkul
3. Ringkasan Mahasiswa
4. Ringkasan Mata Kuliah
5. Keluar

Pilih: 
Masukkan nama mata kuliah yang akan ditunjukkan ringkasannya : 
--------------------------RINGKASAN--------------------------

Nama mata kuliah: OS
Kode: CS
SKS: 3
Jumlah mahasiswa: 2
Kapasitas: 2
Daftar mahasiswa yang mengambil mata kuliah ini: 
1. Dek
2. Pe

----------------------------MENU------------------------------

Silakan pilih menu:
1. Add Matkul
2. Drop Matkul
3. Ringkasan Mahasiswa
4. Ringkasan Mata Kuliah
5. Keluar

Pilih: 

--------------------------ADD MATKUL--------------------------

Masukkan NPM Mahasiswa yang akan melakukan ADD MATKUL : Banyaknya Matkul yang Ditambah: Masukkan nama matkul yang ditambah
Nama matakuliah 1 : [DITOLAK] OS telah penuh kapasitasnya.

Silakan cek rekap untuk melihat hasil pengecekan IRS.


----------------------------MENU------------------------------

Silakan pilih menu:
1. Add Matkul
2. Drop Matkul
3. Ringkasan Mahasiswa
4. Ringkasan Mata Kuliah
5. Keluar

Pilih: 
Masukkan npm mahasiswa yang akan ditunjukkan ringkasannya : 
--------------------------RINGKASAN--------------------------

Nama: De
NPM: 19010110200023
Jurusan: Ilmu Komputer
Daftar Mata Kuliah: 
Belum ada mata kuliah yang diambil.
Total SKS: 0
Hasil Pengecekan IRS:
IRS tidak bermasalah.

----------------------------MENU------------------------------

Silakan pilih menu:
1. Add Matkul
2. Drop Matkul
3. Ringkasan Mahasiswa
4. Ringkasan Mata Kuliah
5. Keluar

Pilih: 
Sampai jumpa!
