<?xml version="1.0" encoding="UTF-8" standalone="no"?>
<!-- Uploaded to: SVG Repo, www.svgrepo.com, Generator: SVG Repo Mixer Tools -->

<svg
   width="800px"
   height="800px"
   viewBox="0 0 48 48"
   version="1.1"
   id="svg15"
   sodipodi:docname="information-circle-svgrepo-com.svg"
   inkscape:version="1.1.2 (0a00cf5339, 2022-02-04)"
   xmlns:inkscape="http://www.inkscape.org/namespaces/inkscape"
   xmlns:sodipodi="http://sodipodi.sourceforge.net/DTD/sodipodi-0.dtd"
   xmlns="http://www.w3.org/2000/svg"
   xmlns:svg="http://www.w3.org/2000/svg"
   xmlns:rdf="http://www.w3.org/1999/02/22-rdf-syntax-ns#"
   xmlns:cc="http://creativecommons.org/ns#"
   xmlns:dc="http://purl.org/dc/elements/1.1/">
  <defs
     id="defs19" />
  <sodipodi:namedview
     id="namedview17"
     pagecolor="#ffffff"
     bordercolor="#666666"
     borderopacity="1.0"
     inkscape:pageshadow="2"
     inkscape:pageopacity="0.0"
     inkscape:pagecheckerboard="0"
     showgrid="false"
     inkscape:zoom="0.94125"
     inkscape:cx="394.15671"
     inkscape:cy="400"
     inkscape:window-width="1920"
     inkscape:window-height="1029"
     inkscape:window-x="0"
     inkscape:window-y="0"
     inkscape:window-maximized="1"
     inkscape:current-layer="svg15" />
  <title
     id="title2">information-circle</title>
  <path
     d="M 24,2 A 22,22 0 1 0 46,24 21.9,21.9 0 0 0 24,2 Z m 0,40 A 18,18 0 1 1 42,24 18.1,18.1 0 0 1 24,42 Z"
     id="path7"
     style="fill:#72a7cf;fill-opacity:1" />
  <path
     d="m 24,20 a 2,2 0 0 0 -2,2 v 12 a 2,2 0 0 0 4,0 V 22 a 2,2 0 0 0 -2,-2 z"
     id="path9"
     style="fill:#72a7cf;fill-opacity:1" />
  <circle
     cx="24"
     cy="14"
     r="2"
     id="circle11"
     style="fill:#72a7cf;fill-opacity:1" />
  <metadata
     id="metadata836">
    <rdf:RDF>
      <cc:Work
         rdf:about="">
        <dc:title>information-circle</dc:title>
      </cc:Work>
    </rdf:RDF>
  </metadata>
</svg>
