<?xml version="1.0" encoding="UTF-8" standalone="no"?>
<!-- Uploaded to: SVG Repo, www.svgrepo.com, Generator: SVG Repo Mixer Tools -->

<svg
   width="800px"
   height="800px"
   viewBox="0 0 48 48"
   version="1.1"
   id="svg15"
   sodipodi:docname="multiplier.svg"
   inkscape:version="1.3.2 (091e20e, 2023-11-25, custom)"
   xmlns:inkscape="http://www.inkscape.org/namespaces/inkscape"
   xmlns:sodipodi="http://sodipodi.sourceforge.net/DTD/sodipodi-0.dtd"
   xmlns="http://www.w3.org/2000/svg"
   xmlns:svg="http://www.w3.org/2000/svg"
   xmlns:rdf="http://www.w3.org/1999/02/22-rdf-syntax-ns#"
   xmlns:cc="http://creativecommons.org/ns#">
  <defs
     id="defs19">
    <inkscape:path-effect
       effect="skeletal"
       id="path-effect2"
       is_visible="true"
       lpeversion="1"
       pattern="M 0,1.1320755 C 0,0.50716981 0.50716981,0 1.1320755,0 c 0.6249056,0 1.1320754,0.50716981 1.1320754,1.1320755 0,0.6249056 -0.5071698,1.1320754 -1.1320754,1.1320754 C 0.50716981,2.2641509 0,1.7569811 0,1.1320755 Z"
       copytype="single_stretched"
       prop_scale="1"
       scale_y_rel="false"
       spacing="0"
       normal_offset="0"
       tang_offset="0"
       prop_units="false"
       vertical_pattern="false"
       hide_knot="false"
       fuse_tolerance="0" />
    <inkscape:path-effect
       effect="skeletal"
       id="path-effect1"
       is_visible="true"
       lpeversion="1"
       pattern="M 0,1.1320755 C 0,0.50716981 0.50716981,0 1.1320755,0 c 0.6249056,0 1.1320754,0.50716981 1.1320754,1.1320755 0,0.6249056 -0.5071698,1.1320754 -1.1320754,1.1320754 C 0.50716981,2.2641509 0,1.7569811 0,1.1320755 Z"
       copytype="single_stretched"
       prop_scale="1"
       scale_y_rel="false"
       spacing="0"
       normal_offset="0"
       tang_offset="0"
       prop_units="false"
       vertical_pattern="false"
       hide_knot="false"
       fuse_tolerance="0" />
    <rect
       x="180.61089"
       y="421.77955"
       width="103.05445"
       height="122.17795"
       id="rect1" />
  </defs>
  <sodipodi:namedview
     id="namedview17"
     pagecolor="#ffffff"
     bordercolor="#666666"
     borderopacity="1.0"
     inkscape:pageshadow="2"
     inkscape:pageopacity="0.0"
     inkscape:pagecheckerboard="0"
     showgrid="false"
     inkscape:zoom="1.3311285"
     inkscape:cx="562.68046"
     inkscape:cy="370.73806"
     inkscape:window-width="1920"
     inkscape:window-height="986"
     inkscape:window-x="-11"
     inkscape:window-y="-11"
     inkscape:window-maximized="1"
     inkscape:current-layer="svg15"
     inkscape:showpageshadow="2"
     inkscape:deskcolor="#d1d1d1" />
  <path
     d="m 39.556302,8.4435361 a 22,22 0 1 0 0,31.1126989 21.9,21.9 0 0 0 0,-31.1126989 z M 11.27203,36.727807 a 18,18 0 1 1 25.455845,0 18.1,18.1 0 0 1 -25.455845,0 z"
     id="path7"
     style="fill:#72a7cf;fill-opacity:1" />
  <metadata
     id="metadata836">
    <rdf:RDF>
      <cc:Work
         rdf:about="" />
    </rdf:RDF>
  </metadata>
  <rect
     style="fill:#72a7cf;fill-opacity:1;stroke:none;stroke-width:0.03774;stroke-linecap:round;stroke-linejoin:round;stroke-dasharray:none;stroke-opacity:1"
     id="rect3"
     width="3.9622991"
     height="24.930498"
     x="-1.9813116"
     y="-46.406372"
     ry="2.3668194"
     transform="rotate(135)" />
  <rect
     style="fill:#72a7cf;fill-opacity:1;stroke:none;stroke-width:0.03774;stroke-linecap:round;stroke-linejoin:round;stroke-dasharray:none;stroke-opacity:1"
     id="rect3-9"
     width="3.9622991"
     height="24.930498"
     x="-35.922276"
     y="-12.465086"
     ry="2.3668194"
     transform="rotate(-135)" />
</svg>
