digraph examplePDL {
	Conception -> RedactionDoc [arrowhead=vee label=f2f]
	Conception -> RedactionDoc [arrowhead=vee label=s2s]
	Conception -> RedactionTests [arrowhead=vee label=s2s]
	Conception -> Developpement [arrowhead=vee label=f2s]
	Developpement -> RedactionTests [arrowhead=vee label=f2f]
}
