net examplePDL
pl Conception_idle (1)
pl Conception_running (0)
pl Conception_started (0)
pl Conception_finished (0)
pl Developpement_idle (1)
pl Developpement_running (0)
pl Developpement_started (0)
pl Developpement_finished (0)
pl RedactionTests_idle (1)
pl RedactionTests_running (0)
pl RedactionTests_started (0)
pl RedactionTests_finished (0)
pl RedactionDoc_idle (1)
pl RedactionDoc_running (0)
pl RedactionDoc_started (0)
pl RedactionDoc_finished (0)
pl concepteur (3)
pl developpeur (2)
pl machine (4)
pl redacteur (1)
pl testeur (2)
tr Conception_start Conception_idle 			concepteur*2 			machine*2 -> Conception_running Conception_started 
tr Conception_finish Conception_running -> Conception_finished 			concepteur*2 			machine*2 
tr Developpement_start Developpement_idle Conception_finished?1 			developpeur*2 			machine*3 -> Developpement_running Developpement_started 
tr Developpement_finish Developpement_running -> Developpement_finished 			developpeur*2 			machine*3 
tr RedactionTests_start RedactionTests_idle Conception_started?1 			machine*2 testeur -> RedactionTests_running RedactionTests_started 
tr RedactionTests_finish RedactionTests_running Developpement_finished?1 -> RedactionTests_finished 			machine*2 testeur 
tr RedactionDoc_start RedactionDoc_idle Conception_started?1 machine redacteur -> RedactionDoc_running RedactionDoc_started 
tr RedactionDoc_finish RedactionDoc_running Conception_finished?1 -> RedactionDoc_finished machine redacteur 



