[gd_scene load_steps=4 format=3 uid="uid://csbyauwd8xkc0"]

[ext_resource type="Script" path="res://scenes/Score/Score.gd" id="1_fd087"]
[ext_resource type="FontFile" uid="uid://coons24q8dy1m" path="res://assets/font/alarm clock.ttf" id="2_gjt6w"]

[sub_resource type="LabelSettings" id="LabelSettings_eh245"]
font = ExtResource("2_gjt6w")
font_size = 80

[node name="Score" type="StaticBody2D"]
script = ExtResource("1_fd087")
metadata/_edit_group_ = true

[node name="Player1Score" type="Label" parent="."]
offset_left = -200.0
offset_bottom = 43.0
label_settings = SubResource("LabelSettings_eh245")
horizontal_alignment = 1

[node name="Player2Score" type="Label" parent="."]
offset_right = 200.0
offset_bottom = 43.0
label_settings = SubResource("LabelSettings_eh245")
horizontal_alignment = 1

[node name="GoalAudioStream" type="AudioStreamPlayer2D" parent="."]
