<?xml version="1.0" standalone="no"?>
<!DOCTYPE svg PUBLIC "-//W3C//DTD SVG 20010904//EN"
 "http://www.w3.org/TR/2001/REC-SVG-20010904/DTD/svg10.dtd">
<svg version="1.0" xmlns="http://www.w3.org/2000/svg"
 width="700.000000pt" height="700.000000pt" viewBox="0 0 700.000000 700.000000"
 preserveAspectRatio="xMidYMid meet">
<metadata>
Created by potrace 1.11, written by Peter Selinger 2001-2013
</metadata>
<g transform="translate(0.000000,700.000000) scale(0.100000,-0.100000)"
fill="#000000" stroke="none">
<path d="M1977 5525 c-197 -37 -373 -131 -517 -276 -144 -145 -233 -310 -275
-514 -22 -106 -22 -312 0 -429 84 -450 410 -930 1099 -1616 l166 -165 0 103 0
102 -70 0 -70 0 0 303 c0 332 2 347 63 391 27 20 44 21 285 24 283 3 302 0
346 -61 19 -26 21 -46 26 -250 l5 -222 50 -8 c28 -5 138 -9 245 -10 179 0 306
11 417 39 18 5 23 0 32 -33 19 -68 29 -63 -169 -92 l-115 -17 -3 -257 -2 -257
282 2 283 3 3 287 2 288 -27 6 c-216 48 -387 140 -531 285 -132 132 -214 279
-269 479 -27 100 -24 377 5 482 51 184 133 330 261 461 130 134 286 225 471
275 84 22 114 26 255 25 172 0 238 -12 382 -69 303 -120 533 -391 609 -719 29
-124 25 -349 -8 -475 -103 -384 -411 -673 -794 -743 l-69 -13 -3 -258 c-1
-161 1 -257 7 -254 6 1 117 107 247 233 776 752 1130 1255 1219 1731 22 117
22 323 0 429 -41 197 -131 368 -265 505 -136 138 -276 219 -470 272 -74 20
-109 23 -265 23 -197 0 -264 -12 -425 -76 -243 -97 -467 -296 -572 -511 l-43
-87 -272 0 -272 -1 -46 88 c-138 268 -410 477 -732 563 -103 28 -360 35 -476
14z m794 -1523 c187 -98 131 -379 -80 -400 -65 -6 -115 12 -167 60 -48 45 -66
87 -66 157 2 163 167 259 313 183z m637 -887 c15 -19 22 -39 22 -70 0 -36 -5
-47 -31 -69 -19 -17 -43 -26 -64 -26 -21 0 -45 9 -64 26 -26 21 -31 33 -31 68
0 46 20 82 54 97 35 14 89 2 114 -26z"/>
<path d="M3030 2771 l0 -41 -70 0 -70 0 0 -225 0 -225 145 0 145 0 0 254 c0
140 -3 257 -7 259 -5 3 -38 8 -75 12 l-68 7 0 -41z"/>
<path d="M3282 2358 l3 -73 50 0 50 0 3 73 3 72 -56 0 -56 0 3 -72z"/>
</g>
</svg>
