<svg width="1080" height="1080" viewBox="0 0 1080 1080" fill="none" xmlns="http://www.w3.org/2000/svg">
<path d="M166.5 484.5L528.5 887.5L941 450.5L913 280.5L801.5 187H712L528.5 280.5L423.5 204C369.833 204.5 260.7 206.8 253.5 212C246.3 217.2 175.167 273.167 140.5 300.5L166.5 484.5Z" fill="#6F5060"/>
<path d="M531.5 894L421 798L395.5 748L690.5 769L531.5 894Z" fill="#BBDC2F"/>
<path d="M808.901 483.943C808.901 397.029 738.607 326.735 651.693 326.735C564.779 326.735 494.485 397.029 494.485 483.943C494.485 561.873 551.08 626.329 625.417 638.681V727.167H445.75V659.792H468.208V569.958C468.208 557.606 458.102 547.5 445.75 547.5H378.375C366.023 547.5 355.917 557.606 355.917 569.958V659.792H378.375V772.083H737.708V727.167H670.333V640.028C748.264 630.82 808.901 564.568 808.901 483.943ZM412.062 525.042C430.703 525.042 445.75 509.995 445.75 491.354C445.75 472.714 430.703 457.667 412.062 457.667C393.422 457.667 378.375 472.714 378.375 491.354C378.375 509.995 393.422 525.042 412.062 525.042Z" fill="#BBDC2F"/>
<path d="M581.945 625.488C561.251 631.038 536.988 633.417 514.548 633.417C492.109 633.417 467.846 631.038 447.151 625.488L443.187 641.346C457.935 645.31 474.903 647.927 490.761 649.275V752.353H506.619V704.778H522.477V752.353H538.335V649.275C554.194 647.927 571.162 645.31 585.91 641.346L581.945 625.488ZM514.548 625.488C523.27 625.488 530.406 618.352 530.406 609.63C530.406 600.908 523.27 593.771 514.548 593.771C505.826 593.771 498.69 600.908 498.69 609.63C498.69 618.352 505.826 625.488 514.548 625.488Z" fill="#BBDC2F"/>
<path d="M742.5 135C664.2 135 589.05 171.45 540 229.05C490.95 171.45 415.8 135 337.5 135C198.9 135 90 243.9 90 382.5C90 552.6 243 691.2 474.75 901.8L540 960.75L605.25 901.35C837 691.2 990 552.6 990 382.5C990 243.9 881.1 135 742.5 135ZM544.5 834.75L540 839.25L535.5 834.75C321.3 640.8 180 512.55 180 382.5C180 292.5 247.5 225 337.5 225C406.8 225 474.3 269.55 498.15 331.2H582.3C605.7 269.55 673.2 225 742.5 225C832.5 225 900 292.5 900 382.5C900 512.55 758.7 640.8 544.5 834.75Z" fill="#BBDC2F"/>
</svg>
