import { registerInstance as __stencil_registerInstance } from "@stencil/core";
import { h } from "@stencil/core";
export const AppAddCourse = class {
    constructor(hostRef) {
        __stencil_registerInstance(this, hostRef);
    }
    getCourseinput() {
        let courseinfo = {
            "course_name": this.course_name.value,
            "course_number": this.course_number.value,
            "section_number": this.section_number.value,
            "term": this.term.value,
            "instructor": this.instructor.value,
        };
        this.postCourseinfo(courseinfo);
    }
    postCourseinfo(courseinfo) {
        fetch("http://localhost:3000/api/v1/courses", {
            method: 'POST',
            headers: {
                'Content-Type': 'application/json',
                Accept: 'application/json'
            },
            body: JSON.stringify(courseinfo)
        })
            .then(response => response.json())
            .then(json => console.log(json));
    }
    render() {
        return [
            h("ion-header", null, h("ion-toolbar", { color: "purple" }, h("ion-buttons", { slot: "start" }, h("ion-back-button", { defaultHref: "/courses" })), h("ion-title", null, "ADD A COURSE"))),
            h("ion-content", { class: "ion-padding" }, h("ion-item", null, h("ion-label", { position: "stacked" }, " Course Name "), h("ion-input", { ref: (el) => this.course_name = el, required: true, type: "text", placeholder: "Business Administration" }, " ")), h("ion-item", null, h("ion-label", { position: "stacked" }, " Course Number "), h("ion-input", { ref: (el) => this.course_number = el, required: true, type: "text", placeholder: "e.g., MGMT 100" }, " ")), h("ion-item", null, h("ion-label", { position: "stacked" }, " Section Number "), h("ion-input", { ref: (el) => this.section_number = el, required: true, type: "text", placeholder: "e.g., 001" }, " ")), h("ion-item", null, h("ion-label", { position: "stacked" }, " Term "), h("ion-input", { ref: (el) => this.term = el, required: true, type: "text", placeholder: "Fall 2017" }, " ")), h("ion-item", null, h("ion-label", { position: "stacked" }, " Instructor "), h("ion-input", { ref: (el) => this.instructor = el, required: true, type: "text", placeholder: "Dr. Sam Birk" }, " ")), h("ion-button", { href: "/courselist", onClick: () => this.getCourseinput(), expand: "full", style: { marginTop: "30px", marginBottom: "40px" }, color: "yellow" }, " ADD COURSE "))
        ];
    }
    static get style() { return "STYLE_TEXT_PLACEHOLDER:app-addcourse"; }
};
