import { registerInstance as __stencil_registerInstance, createEvent as __stencil_createEvent, getElement as __stencil_getElement } from "@stencil/core";
import { Host, h } from "@stencil/core";
import { getIonMode } from '../../global/ionic-global';
import { findItemLabel, renderHiddenInput } from '../../utils/helpers';
import { createColorClasses, hostContext } from '../../utils/theme';
export const Checkbox = class {
    constructor(hostRef) {
        __stencil_registerInstance(this, hostRef);
        this.inputId = `ion-cb-${checkboxIds++}`;
        /**
         * The name of the control, which is submitted with the form data.
         */
        this.name = this.inputId;
        /**
         * If `true`, the checkbox is selected.
         */
        this.checked = false;
        /**
         * If `true`, the checkbox will visually appear as indeterminate.
         */
        this.indeterminate = false;
        /**
         * If `true`, the user cannot interact with the checkbox.
         */
        this.disabled = false;
        /**
         * The value of the toggle does not mean if it's checked or not, use the `checked`
         * property for that.
         *
         * The value of a toggle is analogous to the value of a `<input type="checkbox">`,
         * it's only used when the toggle participates in a native `<form>`.
         */
        this.value = 'on';
        this.onClick = () => {
            this.setFocus();
            this.checked = !this.checked;
            this.indeterminate = false;
        };
        this.onFocus = () => {
            this.ionFocus.emit();
        };
        this.onBlur = () => {
            this.ionBlur.emit();
        };
        this.ionChange = __stencil_createEvent(this, "ionChange", 7);
        this.ionFocus = __stencil_createEvent(this, "ionFocus", 7);
        this.ionBlur = __stencil_createEvent(this, "ionBlur", 7);
        this.ionStyle = __stencil_createEvent(this, "ionStyle", 7);
    }
    componentWillLoad() {
        this.emitStyle();
    }
    checkedChanged(isChecked) {
        this.ionChange.emit({
            checked: isChecked,
            value: this.value
        });
        this.emitStyle();
    }
    disabledChanged() {
        this.emitStyle();
    }
    emitStyle() {
        this.ionStyle.emit({
            'checkbox-checked': this.checked,
            'interactive-disabled': this.disabled,
        });
    }
    setFocus() {
        if (this.buttonEl) {
            this.buttonEl.focus();
        }
    }
    render() {
        const { inputId, indeterminate, disabled, checked, value, color, el } = this;
        const labelId = inputId + '-lbl';
        const mode = getIonMode(this);
        const label = findItemLabel(el);
        if (label) {
            label.id = labelId;
        }
        renderHiddenInput(true, el, this.name, (checked ? value : ''), disabled);
        let path = indeterminate
            ? h("path", { d: "M6 12L18 12" })
            : h("path", { d: "M5.9,12.5l3.8,3.8l8.8-8.8" });
        if (mode === 'md') {
            path = indeterminate
                ? h("path", { d: "M2 12H22" })
                : h("path", { d: "M1.73,12.91 8.1,19.28 22.79,4.59" });
        }
        return (h(Host, { onClick: this.onClick, role: "checkbox", "aria-disabled": disabled ? 'true' : null, "aria-checked": `${checked}`, "aria-labelledby": labelId, class: Object.assign({}, createColorClasses(color), { [mode]: true, 'in-item': hostContext('ion-item', el), 'checkbox-checked': checked, 'checkbox-disabled': disabled, 'checkbox-indeterminate': indeterminate, 'interactive': true }) }, h("svg", { class: "checkbox-icon", viewBox: "0 0 24 24" }, path), h("button", { type: "button", onFocus: this.onFocus, onBlur: this.onBlur, disabled: this.disabled, ref: btnEl => this.buttonEl = btnEl })));
    }
    get el() { return __stencil_getElement(this); }
    static get watchers() { return {
        "checked": ["checkedChanged"],
        "disabled": ["disabledChanged"]
    }; }
    static get style() { return "STYLE_TEXT_PLACEHOLDER:ion-checkbox"; }
};
let checkboxIds = 0;
