import { registerInstance as __stencil_registerInstance } from "@stencil/core";
import { h } from "@stencil/core";
export const AppSign = class {
    constructor(hostRef) {
        __stencil_registerInstance(this, hostRef);
    }
    render() {
        return [
            h("ion-header", null, h("ion-toolbar", { color: "purple" }, h("ion-buttons", { slot: "start" }, h("ion-back-button", { defaultHref: "/profile" })), h("ion-title", null, "SIGN IN"))),
            h("ion-content", null, h("ion-item", null, h("ion-input", { placeholder: "Email Address" })))
        ];
    }
    static get style() { return "STYLE_TEXT_PLACEHOLDER:app-sign"; }
};
