import { registerInstance as __stencil_registerInstance } from "@stencil/core";
import { h } from "@stencil/core";
export const AppHome = class {
    constructor(hostRef) {
        __stencil_registerInstance(this, hostRef);
    }
    render() {
        return [
            h("ion-content", { color: "purple", class: "ion-padding" }, h("ion-item", { color: "purple" }, h("img", { src: "../assets/icon/sillibi-logo.png", style: { marginTop: "120px" } })), h("ion-button", { class: "Fbutton", href: "https://facebook.com", expand: "full", style: { marginTop: "120px" }, color: "blue" }, " LOGIN USING FACEBOOK "), h("ion-button", { class: "Ebutton", href: "https://gmail.com", expand: "full", style: { marginTop: "10px", marginBottom: "80px" }, color: "yellow" }, " LOGIN USING EMAIL "), h("p", null, " ", h("div", { "text-center": true }, " Don't want to use facebook? "), " "), h("p", null, " ", h("div", { "text-center": true }, " CREATE AN ACCOUNT "), " "))
        ];
    }
    static get style() { return "STYLE_TEXT_PLACEHOLDER:app-home"; }
};
