import { registerInstance as __stencil_registerInstance } from "@stencil/core";
import { h } from "@stencil/core";
export const AppCoursecard = class {
    constructor(hostRef) {
        __stencil_registerInstance(this, hostRef);
    }
    render() {
        return [
            h("ion-content", { class: "ion-padding" }, h("ion-item", null, h("ion-text", null, " Business Administration ")), h("ion-item", null, h("ion-row", null, " ", h("ion-text", { class: "row", color: "medium" }, " MGMT 100 - 001 "), " "), h("ion-row", null, " ", h("ion-text", { color: "medium", style: { marginLeft: "20px" } }, " Dr. Sam Birk "), " ")), h("ion-item", null, h("ion-icon", { name: "document" }, " ")), h("ion-item", null, h("ion-label", { position: "stacked" }, " Term "), h("ion-input", { required: true, type: "text", placeholder: "Fall 2017" })), h("ion-item", null, h("ion-label", { position: "stacked" }, " Instructor "), h("ion-input", { required: true, type: "text", placeholder: "Dr. Sam Birk" })), h("ion-button", { expand: "full", style: { marginTop: "30px", marginBottom: "40px" }, color: "yellow" }, " ADD COURSE "))
        ];
    }
    static get style() { return "STYLE_TEXT_PLACEHOLDER:app-coursecard"; }
};
