import { registerInstance as __stencil_registerInstance } from "@stencil/core";
import { Host, h } from "@stencil/core";
import { getIonMode } from '../../global/ionic-global';
import { safeCall } from '../../utils/overlays';
export const SelectPopover = class {
    constructor(hostRef) {
        __stencil_registerInstance(this, hostRef);
        /** Array of options for the popover */
        this.options = [];
    }
    onSelect(ev) {
        const option = this.options.find(o => o.value === ev.target.value);
        if (option) {
            safeCall(option.handler);
        }
    }
    render() {
        return (h(Host, { class: getIonMode(this) }, h("ion-list", null, this.header !== undefined && h("ion-list-header", null, this.header), (this.subHeader !== undefined || this.message !== undefined) &&
            h("ion-item", null, h("ion-label", { class: "ion-text-wrap" }, this.subHeader !== undefined && h("h3", null, this.subHeader), this.message !== undefined && h("p", null, this.message))), h("ion-radio-group", null, this.options.map(option => h("ion-item", null, h("ion-label", null, option.text), h("ion-radio", { checked: option.checked, value: option.value, disabled: option.disabled })))))));
    }
    static get style() { return "STYLE_TEXT_PLACEHOLDER:ion-select-popover"; }
};
