<svg xmlns="http://www.w3.org/2000/svg" width="85" height="104" viewBox="0 0 85 104">
  <g fill="none" fill-rule="evenodd">
    <circle cx="67.5" cy="58.5" r="17.5" fill="#5CC1AB"/>
    <ellipse cx="34" cy="29.5" fill="#5CC1AB" rx="29" ry="29.5"/>
    <ellipse cx="31.5" cy="72.5" fill="#DBE200" rx="31.5" ry="31.5"/>
    <circle cx="61.5" cy="83.5" r="15.5" fill="#54B961"/>
    <circle cx="57.5" cy="34.5" r="23.5" fill="#F8E200"/>
    <g transform="translate(16 34)">
      <ellipse cx="26.5" cy="26.5" fill="#F1F1F1" rx="26.5" ry="26.5"/>
      <polygon fill="#32134E" points="32.563 27.32 27.133 27.32 27.133 32.75 25.492 32.75 25.492 27.32 20.063 27.32 20.063 25.68 25.492 25.68 25.492 20.25 27.133 20.25 27.133 25.68 32.563 25.68"/>
    </g>
  </g>
</svg>
