import { registerInstance as __stencil_registerInstance } from "@stencil/core";
import { Host, h } from "@stencil/core";
import { getIonMode } from '../../global/ionic-global';
export const Reorder = class {
    constructor(hostRef) {
        __stencil_registerInstance(this, hostRef);
    }
    onClick(ev) {
        ev.preventDefault();
        ev.stopImmediatePropagation();
    }
    render() {
        return (h(Host, { class: getIonMode(this) }, h("slot", null, h("ion-icon", { name: "reorder", lazy: false, class: "reorder-icon" }))));
    }
    static get style() { return "STYLE_TEXT_PLACEHOLDER:ion-reorder"; }
};
