import { registerInstance as __stencil_registerInstance } from "@stencil/core";
import { h } from "@stencil/core";
export const AppCourselist = class {
    constructor(hostRef) {
        __stencil_registerInstance(this, hostRef);
    }
    componentWillRender() {
        fetch("http://localhost:3000/api/v1/courses", {
            method: 'GET',
            headers: {
                'Content-Type': 'application/json',
                Accept: 'application/json'
            },
        })
            .then(response => response.json())
            .then(json => this.courses = json);
        console.log(this.courses);
    }
    render() {
        return [
            h("ion-header", null, h("ion-toolbar", { color: "purple" }, h("ion-buttons", { slot: "start" }, h("ion-back-button", { defaultHref: "/courses" })), h("ion-title", null, "MY COURSES"))),
            h("ion-content", null, h("a", { href: "/addcourse" }, " ", h("img", { src: "../assets/icon/BTN_AddCourse.svg", class: "image" }), " "), h("app-coursecard", null))
        ];
    }
};
