import { registerInstance as __stencil_registerInstance } from "@stencil/core";
import { h } from "@stencil/core";
export const AppCourses = class {
    constructor(hostRef) {
        __stencil_registerInstance(this, hostRef);
    }
    render() {
        return [
            h("ion-header", null, h("ion-toolbar", { color: "purple" }, h("ion-buttons", { slot: "start" }, h("ion-back-button", { defaultHref: "/profile" })), h("ion-title", null, "MY COURSES"))),
            h("ion-content", { class: "ion-padding" }, h("img", { src: "../assets/icon/illo_AddCourse.svg", class: "center" }), h("p", null, " ", h("div", { "text-center": true }, " Don't want to use facebook? "), " "))
        ];
    }
    static get style() { return "STYLE_TEXT_PLACEHOLDER:app-courses"; }
};
