import { registerInstance as __stencil_registerInstance } from "@stencil/core";
import { h } from "@stencil/core";
export const AppCoursecard = class {
    constructor(hostRef) {
        __stencil_registerInstance(this, hostRef);
    }
    async componentWillLoad() {
        this.getCourseinfo();
    }
    async getCourseinfo() {
        const response = await fetch("http://localhost:3000/api/v1/courses");
        const coursesinfo = await response.json();
        this.courses = coursesinfo;
    }
    render() {
        return [
            h("ion-card", { href: true }, h("ion-list", { lines: "full" }, h("ion-item", null, h("ion-text", null, " ", this.course_name, " ")), h("ion-item", { lines: 'full' }, h("ion-label", null, h("ion-note", null, "MGMT 100 - 001 ", h("br", null), " Dr. Sam Birk"))), h("ion-item", null, h("ion-icon", { slot: "start", name: "document" }), h("ion-text", null, " Syllabus "), h("ion-icon", { slot: "end", name: "add-circle-outline" }, " ")), h("ion-item", null, h("ion-icon", { slot: "start", name: "paper" }, " "), " ", h("ion-text", null, " Assignments "), h("ion-icon", { slot: "end", name: "add-circle-outline" }, " "))))
        ];
    }
    static get style() { return "STYLE_TEXT_PLACEHOLDER:app-coursecard"; }
};
