import { registerInstance as __stencil_registerInstance } from "@stencil/core";
import { h } from "@stencil/core";
export const AppAddCourse = class {
    constructor(hostRef) {
        __stencil_registerInstance(this, hostRef);
    }
    render() {
        return [
            h("ion-header", null, h("ion-toolbar", { color: "purple" }, h("ion-buttons", { slot: "start" }, h("ion-back-button", { defaultHref: "/courses" })), h("ion-title", null, "Add Course"))),
            h("ion-content", { class: "ion-padding" }, h("ion-item", null, h("ion-label", { position: "stacked" }, " Course Name "), h("ion-input", { required: true, type: "text", placeholder: "Business Administration" })), h("ion-item", null, h("ion-label", { position: "stacked" }, " Course Number "), h("ion-input", { required: true, type: "text", placeholder: "e.g., MGMT 100" })), h("ion-item", null, h("ion-label", { position: "stacked" }, " Section Number "), h("ion-input", { required: true, type: "text", placeholder: "e.g., 001" })), h("ion-item", null, h("ion-label", { position: "stacked" }, " Term "), h("ion-input", { required: true, type: "text", placeholder: "Fall 2017" })), h("ion-item", null, h("ion-label", { position: "stacked" }, " Instructor "), h("ion-input", { required: true, type: "text", placeholder: "Dr. Sam Birk" })))
        ];
    }
    static get style() { return "STYLE_TEXT_PLACEHOLDER:app-addcourse"; }
};
