import { registerInstance as __stencil_registerInstance } from "@stencil/core";
import { h } from "@stencil/core";
export const AppRoot = class {
    constructor(hostRef) {
        __stencil_registerInstance(this, hostRef);
    }
    render() {
        return (h("ion-app", null, h("ion-router", { useHash: false }, h("ion-route", { url: "/", component: "app-home" }), h("ion-route", { url: "/profile/", component: "app-profile" }), h("ion-route", { url: "/sign/", component: "app-sign" }), h("ion-route", { url: "/courses/", component: "app-courses" }), h("ion-route", { url: "/addcourse/", component: "app-addcourse" }), h("ion-route", { url: "/coursecard", component: "app-coursecard" }), h("ion-route", { url: "/courselist", component: "app-courselist" })), h("ion-nav", null)));
    }
    static get style() { return "STYLE_TEXT_PLACEHOLDER:app-root"; }
};
