import { registerInstance as __stencil_registerInstance, getElement as __stencil_getElement } from "@stencil/core";
import { Build, Host, h } from "@stencil/core";
import { config } from '../../global/config';
import { getIonMode } from '../../global/ionic-global';
import { rIC } from '../../utils/helpers';
import { isPlatform } from '../../utils/platform';
export const App = class {
    constructor(hostRef) {
        __stencil_registerInstance(this, hostRef);
    }
    componentDidLoad() {
        if (Build.isBrowser) {
            rIC(() => {
                const isHybrid = isPlatform(window, 'hybrid');
                if (!config.getBoolean('_testing')) {
                    import('../../utils/tap-click').then(module => module.startTapClick(config));
                }
                if (config.getBoolean('statusTap', isHybrid)) {
                    import('../../utils/status-tap').then(module => module.startStatusTap());
                }
                if (config.getBoolean('inputShims', needInputShims())) {
                    import('../../utils/input-shims/input-shims').then(module => module.startInputShims(config));
                }
                if (config.getBoolean('hardwareBackButton', isHybrid)) {
                    import('../../utils/hardware-back-button').then(module => module.startHardwareBackButton());
                }
                import('../../utils/focus-visible').then(module => module.startFocusVisible());
            });
        }
    }
    render() {
        const mode = getIonMode(this);
        return (h(Host, { class: {
                [mode]: true,
                'ion-page': true,
                'force-statusbar-padding': config.getBoolean('_forceStatusbarPadding')
            } }));
    }
    get el() { return __stencil_getElement(this); }
    static get style() { return "STYLE_TEXT_PLACEHOLDER:ion-app"; }
};
const needInputShims = () => {
    return isPlatform(window, 'ios') && isPlatform(window, 'mobile');
};
