1572	0
1215	1
1632	1
1370	1
1508	1
1322	1
1025	1
1043	0
1364	0
1412	0
1639	1
1730	0
1605	1
1512	1
1432	0
1362	0
1099	0
1013	0
1063	0
1369	0
1211	1
1033	1
1078	0
1049	0
1065	0
1299	1
1044	1
1029	1
1272	0
1102	0
1510	0
1363	0
1262	0
1046	1
1120	0
1059	1
1533	0
1212	0
1516	0
1443	1
1552	0
1593	0
1056	0
1115	0
1193	0
1555	0
1088	0
1585	1
1156	0
1250	0
1718	0
1118	0
1622	0
1479	1
1415	0
1460	0
1526	0
1459	0
1155	0
1720	0
1633	1
1674	0
1068	0
1495	0
1287	0
1507	0
1368	0
1509	1
1488	0
1451	0
1053	0
1174	0
1561	0
1106	1
1034	1
1501	1
1607	1
1070	0
1390	1
1556	0
1405	1
1503	1
1055	0
1491	1
1377	1
1067	1
1439	0
1562	1
1617	0
1045	0
1173	0
1433	0
1098	1
1551	0
1012	0
1116	0
1614	1
1422	1
1484	0
1706	1
1306	0
1131	1
1054	0
1162	0
1475	0
1085	0
1421	0
1707	1
1175	0
1721	0
1527	1
1598	0
1490	0
1165	0
1323	1
1271	0
1015	0
1532	0
1066	1
1426	0
1353	1
