{
  "GovDistrust": [
    "lack of trust in the government",
    "Fuck the government",
    "The government is a total failure",
    "Never trust the government",
    "Biden is a failure",
    "Biden lied people die",
    "The government and Fauci have been dishonest",
    "The government always lies",
    "The government has a strong record of screwing things up",
    "The government is good at screwing things up",
    "The government is screwing things up",
    "The government is lying",
    "The government only cares about money",
    "The government doesn't work logically",
    "Do not trust the government",
    "The government doesn't care about people’s health",
    "The government won't tell you the truth about the vaccine"
  ],
  "GovTrust": [
    "We trust the government",
    "The government cares for people",
    "We are thankful to the government for the vaccine availability",
    "Hats off to the government for tackling the pandemic",
    "It is a good thing to be skeptical of the government, but they are right about the covid vaccine",
    "It is a good thing to be skeptical of the government, but they haven’t lied about the covid vaccine",
    "The government can be corrupt, but they are telling the truth about the covid vaccine",
    "The government can be corrupt, but they are not lying about the covid vaccine"
  ],
  "VaccineDanger": [
    "the vaccine will be dangerous to health",
    "Covid vaccines can cause blood clots",
    "The vaccine is a greater danger to our children’s health than COVID itself",
    "The vaccine will kill you",
    "The experimental covid vaccine is a death jab",
    "The covid vaccine causes cancer",
    "The covid vaccine is harmful for pregnant women and kids",
    "The vaccine increases health risk",
    "The vaccine isn't safe",
    "What are vaccines good for? Nothing, rather it increases risk",
    "I and many others have medical exemptions",
    "The vaccine is dangerous for people with medical conditions",
    "I won't take the vaccine due to medical reasons",
    "The vaccine has dangerous side effects"
  ],
  "VaccineSafe": [
    "The vaccine is safe",
    "Millions have been vaccinated with only mild side effects",
    "Millions have been safely vaccinated against covid",
    "The benefits of the vaccine outweigh its risks",
    "The vaccine has benefits",
    "The vaccine is safe for women and kids",
    "The vaccine won't make you sick",
    "The vaccine isn't dangerous",
    "The vaccine won't kill you",
    "The covid vaccine isn't a death jab",
    "The covid vaccine doesn't harm women and kids"
  ],
  "CovidFake": [
    "COVID-19 disease does not exist",
    "Covid is fake",
    "covid is a hoax",
    "covid is a scam",
    "covid is propaganda",
    "the pandemic is a lie",
    "covid isn't real",
    "I don't think that covid is real",
    "I don't buy that covid is real",
    "I don't think there is a pandemic",
    "I don't think the pandemic is real",
    "I don't buy that there is a pandemic"
  ],
  "CovidReal": [
    "Covid is real",
    "I trust science",
    "Covid death is real",
    "The science doesn't lie about covid",
    "Scientist know what they are doing",
    "Scientist know what they are saying",
    "Covid hospitalizations are on the rise",
    "Covid hospitalizations are climbing as fourth stage surge continues",
    "Covid's death toll has grown faster",
    "Covid is not a hoax",
    "The pandemic is not a lie",
    "The pandemic is not a lie, hospitalizations are on the rise"
  ],
  "VaccineOppression": [
    "Forcing people to take experimental vaccines is oppression",
    "The vaccine has nothing to do with Covid-19, it's about the vaccine passport and tyranny",
    "The vaccine mandate is unconstitutional",
    "I'm not against the vaccine but I am against the mandate",
    "I have freedom to choose not to take the vaccine",
    "I choose not to take the vaccine",
    "I am free to refuse the vaccine",
    "It is not about covid, it is about control",
    "My body my choice",
    "Medical segregation based on vaccine mandates is discrimination",
    "The vaccine mandate violates my rights",
    "Falsely labeling the injection as a vaccine is illegal",
    "Firing over vaccine mandates is oppression",
    "Vaccine passports are medical tyranny",
    "I won't let the government tell me what I should do with my body",
    "I won't have the government tell me what to do"
  ],
  "VaccineNotOppression": [
    "The vaccine mandate is not oppression because vaccines lower hospitalizations and death rates",
    "The vaccine mandate is not oppression because it will help to end this pandemic",
    "The vaccine mandate will help us end the pandemic",
    "We need a vaccine mandate to end this pandemic",
    "I support vaccine mandates",
    "If you don't get the vaccine based on your freedom of choice, don’t come crawling to the emergency room when you get COVID",
    "If you refuse a free FDA-approved vaccine for non-medical reasons, then the government shouldn't continue to give you free COVID tests",
    "You are free not to take the vaccine, businesses are also free to deny you entry",
    "You are free not to take the vaccine, businesses are free to protect their customers and employees",
    "If you choose not to take the vaccine, you have to deal with the consequences",
    "If it is your body your choice, then insurance companies should stop paying for your hospitalization costs for COVID"
  ],
  "BigPharmaAnti": [
    "We are the subjects of massive experiments for the Moderna and Pfizer vaccines",
    "Pharmaceutical companies are corrupt",
    "The pharmaceutical industry is rotten",
    "Big Pharma is evil",
    "How would you trust big pharma with the COVID vaccine? They haven’t been liable for vaccine harm in the past",
    "Covid vaccines are not doing what the pharmaceutical companies promised",
    "Pharmaceutical companies have a history of irresponsible behavior",
    "I don't trust Johnson & Johnson after knowing their baby powder caused cancer for decades"
  ],
  "BigPharmaPro": [
    "I trust the science and pharmaceutical research",
    "Pharmaceutical companies are not hiding anything",
    "The research behind covid vaccines is public",
    "The Pfizer vaccine is saving lives",
    "The Moderna vaccines are helping stop the spread of covid",
    "The Johnson and Johnson vaccine was created to stop covid",
    "Pharmaceutical companies are seeking FDA approval",
    "Pharmaceutical companies are following standard protocols"
  ],
  "NaturalImmunityPro": [
    "natural methods of protection against the disease are better than vaccines",
    "Herd immunity is broad, protective, and durable",
    "Natural immunity has higher level of protection than the vaccine",
    "Embrace population immunity",
    "I trust my immune system",
    "I have antibodies I do not need the vaccine",
    "Natural immunity is effective"
  ],
  "NaturalImmunityAnti": [
    "Only the vaccine will end the pandemic",
    "Vaccines will allow us to defeat covid without death and sickness",
    "The vaccine has better long term protection than to natural immunity",
    "Natural immunity is not effective",
    "Natural immunity would require a lot of people getting sick",
    "Experts recommend the vaccine over natural immunity"
  ],
  "vaccineAgainstReligion": [
    "The vaccine is against my religion",
    "The vaccines are the mark of the beast",
    "The vaccine is a tool of Satan",
    "The vaccine is haram",
    "The vaccine is not halal",
    "I will protect my body from a man made vaccine",
    "I put it all in God's hands",
    "God will decide our fate",
    "The vaccine contains bovine, which conflicts with my religion",
    "The vaccine contains aborted fetal tissue which is against my religion",
    "The vaccine contains pork, muslims can't take the vaccine",
    "Jesus will protect me",
    "The vaccine doesn't protect you from getting or spreading Covid, God does",
    "The covid vaccine is another religion"
  ],
  "vaccineNotAgainstRelition": [
    "The vaccine is not against religion, get the vaccine",
    "No religion ask members to refuse the vaccine",
    "Religious exemptions are bogus",
    "When turning in your religious exemption forms for the vaccine, remember ignorance is not a religion",
    "Disregard for others' lives isn't part of your religion",
    "Jesus is trying to protect us from covid by divinely inspiring scientists to create vaccines"
  ],
  "vaccineDoesntWork": [
    "the vaccine does not work",
    "covid vaccines do not stop the spread",
    "If the vaccine works, why are deaths so high?",
    "Why are vaccinated people dying?",
    "If the vaccine works, why is covid not going away?"
  ],
  "vaccineWorks": [
    "The vaccine works",
    "Vaccines do work, ask a doctor or consult with an expert",
    "The covid vaccine helps to stop the spread",
    "Unvaccinated people are dying at a rapid rate from COVID-19",
    "There is a lot of research supporting that vaccines work",
    "The research on the covid vaccine has been going on for a long time"
  ],
  "VaccineTested": [
    "Covid vaccine research has been going on for a while",
    "Plenty of research has been done on the covid vaccine",
    "The technologies used to develop the COVID-19 vaccines have been in development for years to prepare for outbreaks of infectious viruses",
    "The testing processes for the vaccines were thorough didn't skip any steps",
    "The vaccine received FDA approval"
  ],
  "VaccineNotTested": [
    "the vaccine is not properly tested, it has been developed too quickly",
    "Covid-19 vaccines have not been through the same rigorous testing as other vaccines",
    "The Covid vaccine is experimental",
    "The covid vaccine was rushed through trials",
    "The approval of the experimental vaccine was rushed",
    "How was the vaccine developed so quickly?"
  ],
  "VaccineExperimentsOnDogs": [
    "Animal shelters are empty because Dr Fauci allowed experimenting of various Covid vaccines/drugs on dogs and other domestic pets",
    "Fauci tortures dogs and puppies"
  ],
  "BillGatesMicroChip": [
    "The covid vaccine is a ploy to microchip people",
    "Bill Gates wants to use vaccines to implant microchips in people",
    "Globalists support a covert mass chip implantation through the covid vaccine"
  ],
  "VaccinesContainAbortedFetalTissue": [
    "There is aborted fetal tissue in the Covid Vaccines",
    "the Covid vaccines contain aborted fetal cells"
  ],
  "VaccinesDoNotContainFetalTissue": [
    "Vaccines were tested on fetal tissues, but do not contain fetal cells",
    "Vaccines do not contain aborted fetal cells"
  ],
  "VaccinesMakeYouSterile": [
    "The covid vaccine will make you sterile",
    "Covid vaccine will affect your fertility"
  ],
  "VaccinesDoNotMakeYouSterile": [
    "The vaccine will not make you sterile",
    "The covid vaccine will not affect your fertility",
    "No difference if fertility rate has been found between vaccinated and unvaccinated people"
  ]
}
