[
  {"vrsta": "neprehrambeni",
  "proizvodac": "HyperX",
  "pdv": 25,
  "naziv": "Pulsefire CoreXP",
  "cijena": 299.99,
  "sifraProizvoda": 258024,
  "jamstvo": true,
  "smartUredaj": false

}, {
  "vrsta": "neprehrambeni",
  "proizvodac": "HP",
  "pdv":25,
  "naziv": "LaserJet Pro M102w",
  "cijena": 949,
  "sifraProizvoda": 678903,
  "jamstvo": true,
  "smartUredaj": false
}, {
  "vrsta": "neprehrambeni",
  "proizvodac": "EPSON",
  "pdv":25,
  "naziv": "EPSON ITS L3160",
  "cijena": 1299,
  "sifraProizvoda": 37098109,
  "jamstvo": true,
  "smartUredaj": false
}, {
  "vrsta": "neprehrambeni",
  "proizvodac": "APPLE",
  "pdv": 25,
  "naziv": "iPhone 12 Mini",
  "cijena": 7139,
  "sifraProizvoda": 125786,
  "jamstvo": true,
  "smartUredaj": true
}, {
  "vrsta": "neprehrambeni",
  "proizvodac": "HUAWEI",
  "pdv":25,
  "naziv": "HUAWEI P40 Lite",
  "cijena": 2500,
  "sifraProizvoda": 367092,
  "jamstvo": true,
  "smartUredaj": true
},{
  "vrsta": "prehrambeni",
  "proizvodac": "KUKUKU",
  "pdv": 25,
  "naziv": "Banana",
  "cijena": 11.09,
  "sifraProizvoda": 2679012,
  "alergeni":"banana",
  "rokTrajanja":"5 dana",
  "netoKolicina": "1000 grama"
},{
  "vrsta": "prehrambeni",
  "proizvodac": "Argeta",
  "pdv": 25,
  "naziv": "Paseteta",
  "cijena": 11.09,
  "sifraProizvoda": 1257902,
  "alergeni":"gluten,jaja,pilece meso",
  "rokTrajanja":"14 dana",
  "netoKolicina": "25 grama"
},{
  "vrsta": "prehrambeni",
  "proizvodac": "Euromilk",
  "pdv": 25,
  "naziv": "Jogurt",
  "cijena": 18.09,
  "sifraProizvoda": 763457,
  "alergeni":"mlijeko",
  "rokTrajanja":"14 dana",
  "netoKolicina": "1000 grama"
},{
  "vrsta": "prehrambeni",
  "proizvodac": "Argeta",
  "pdv": 25,
  "naziv": "Paseteta",
  "cijena": 11.09,
  "sifraProizvoda": 1257902,
  "alergeni":"gluten,jaja,pilece meso",
  "rokTrajanja":"14 dana",
  "netoKolicina": "25 grama"
}
]