[
  {
    "Jamstvo": true,
    "SmartUredaj": false,
    "Cijena": 249.99,
    "Naziv": "Pulsefire Core",
    "Proizvodac": "HyperX",
    "PDV": "25",
    "SifraProizvoda": 12345,
    "vrsta": "neprehrambeni"
  },
  {
    "Jamstvo": true,
    "SmartUredaj": false,
    "Cijena": 456.84,
    "Naziv": "Basilisk X HyperSpeed",
    "Proizvodac": "RAZER",
    "PDV": "25",
    "SifraProizvoda": 75353,
    "vrsta": "neprehrambeni"
  },
  {
    "Jamstvo": true,
    "SmartUredaj": false,
    "Cijena": 329.0,
    "Naziv": "Memorija PC-21300",
    "Proizvodac": "KINGSTON",
    "PDV": "25",
    "SifraProizvoda": 745632,
    "vrsta": "neprehrambeni"
  },
  {
    "Jamstvo": true,
    "SmartUredaj": false,
    "Cijena": 1399.0,
    "Naziv": "Memorija PC-25600",
    "Proizvodac": "LC POWER",
    "PDV": "25",
    "SifraProizvoda": 754543,
    "vrsta": "neprehrambeni"
  },
  {
    "Jamstvo": true,
    "SmartUredaj": false,
    "Cijena": 11639.03,
    "Naziv": "RAZER Book 13",
    "Proizvodac": "RAZER",
    "PDV": "25",
    "SifraProizvoda": 89124,
    "vrsta": "neprehrambeni"
  },
  {
    "Jamstvo": true,
    "SmartUredaj": false,
    "Cijena": 4459.0,
    "Naziv": "ACER Swift 3",
    "Proizvodac": "ACER",
    "PDV": "25",
    "SifraProizvoda": 12457,
    "vrsta": "neprehrambeni"
  },
  {
    "Jamstvo": true,
    "SmartUredaj": false,
    "Cijena": 327.0,
    "Naziv": "USB-AC53",
    "Proizvodac": "ASUS",
    "PDV": "25",
    "SifraProizvoda": 165234,
    "vrsta": "neprehrambeni"
  },
  {
    "Alergeni": "mlijeko",
    "RokTrajanja": "14 dana",
    "NetoKolicina": "1000 grama",
    "Cijena": 18.09,
    "Naziv": "Jogurt",
    "Proizvodac": "Dukat",
    "PDV": "25",
    "SifraProizvoda": 23761209,
    "vrsta": "prehrambeni"
  },
  {
    "Alergeni": "mlijeko",
    "RokTrajanja": "14 dana",
    "NetoKolicina": "1000 grama",
    "Cijena": 18.09,
    "Naziv": "Jogurt",
    "Proizvodac": "Euromilk",
    "PDV": "25",
    "SifraProizvoda": 763457,
    "vrsta": "prehrambeni"
  },
  {
    "Alergeni": "gluten,jaja,pilece meso",
    "RokTrajanja": "14 dana",
    "NetoKolicina": "25 grama",
    "Cijena": 11.09,
    "Naziv": "Paseteta",
    "Proizvodac": "Argeta",
    "PDV": "25",
    "SifraProizvoda": 1257902,
    "vrsta": "prehrambeni"
  },
  {
    "Alergeni": "gluten,jaja,mlijeko",
    "RokTrajanja": "14 dana",
    "NetoKolicina": "250 grama",
    "Cijena": 19.29,
    "Naziv": "Cokolada",
    "Proizvodac": "Milka",
    "PDV": "25",
    "SifraProizvoda": 123089,
    "vrsta": "prehrambeni"
  },
  {
    "Alergeni": "Sve",
    "RokTrajanja": "12 mjeseci",
    "NetoKolicina": "700g",
    "Cijena": 40.0,
    "Naziv": "Linolada",
    "Proizvodac": "Kras",
    "PDV": "24",
    "SifraProizvoda": 342423,
    "vrsta": "prehrambeni"
  },
  {
    "Alergeni": "Sve",
    "RokTrajanja": "24 mjeseca",
    "NetoKolicina": "800g",
    "Cijena": 39.0,
    "Naziv": "Bolja Linolada",
    "Proizvodac": "Kras",
    "PDV": "24",
    "SifraProizvoda": 342135,
    "vrsta": "prehrambeni"
  },
  {
    "Jamstvo": true,
    "SmartUredaj": false,
    "Cijena": 249.99,
    "Naziv": "Pulsefire Core",
    "Proizvodac": "Pulsefire Core",
    "PDV": "25",
    "SifraProizvoda": 12345,
    "vrsta": "neprehrambeni"
  },
  {
    "Jamstvo": true,
    "SmartUredaj": false,
    "Cijena": 0.0,
    "Naziv": "Stalak za mobitel",
    "Proizvodac": "Ikea",
    "PDV": "20",
    "SifraProizvoda": 0,
    "vrsta": "neprehrambeni"
  },
  {
    "Jamstvo": true,
    "SmartUredaj": false,
    "Cijena": 0.0,
    "Naziv": "Stalak za mobitel",
    "Proizvodac": "Ikea",
    "PDV": "20",
    "SifraProizvoda": 0,
    "vrsta": "neprehrambeni"
  },
  {
    "Jamstvo": true,
    "SmartUredaj": false,
    "Cijena": 0.0,
    "Naziv": "Stalak za mobitel",
    "Proizvodac": "Ikea",
    "PDV": "20",
    "SifraProizvoda": 0,
    "vrsta": "neprehrambeni"
  },
  {
    "Jamstvo": true,
    "SmartUredaj": false,
    "Cijena": 0.0,
    "Naziv": "Pulsefire Core",
    "Proizvodac": "Pulsefire Core",
    "PDV": "25",
    "SifraProizvoda": 0,
    "vrsta": "neprehrambeni"
  },
  {
    "Jamstvo": true,
    "SmartUredaj": false,
    "Cijena": 0.0,
    "Naziv": "Stalak za mobitel",
    "Proizvodac": "Ikea",
    "PDV": "20",
    "SifraProizvoda": 0,
    "vrsta": "neprehrambeni"
  },
  {
    "Jamstvo": true,
    "SmartUredaj": false,
    "Cijena": 0.0,
    "Naziv": "Stalak za mobitel",
    "Proizvodac": "Ikea",
    "PDV": "20",
    "SifraProizvoda": 0,
    "vrsta": "neprehrambeni"
  },
  {
    "Jamstvo": true,
    "SmartUredaj": false,
    "Cijena": 0.0,
    "Naziv": "Stalak za mobitel",
    "Proizvodac": "Ikea",
    "PDV": "20",
    "SifraProizvoda": 0,
    "vrsta": "neprehrambeni"
  }
]