<svg width="240" height="374" viewBox="0 0 240 374" fill="none" xmlns="http://www.w3.org/2000/svg">
<rect width="240" height="374" rx="5" fill="url(#paint0_linear)"/>
<path fill-rule="evenodd" clip-rule="evenodd" d="M33.9222 30.1176C32.1679 29.2477 29.8293 30.2566 30.8049 32.5562C31.8499 35.0188 35.7136 35.0492 37.8957 35.0004C37.6773 34.9889 36.974 32.7307 36.7332 32.3895C36.0232 31.3829 35.0007 30.6533 33.9222 30.1176ZM54.1349 74.269C54.5775 74.6474 54.1709 74.3045 54.1349 74.269V74.269ZM32.2323 41.2558C31.2057 42.0406 31.1567 43.4262 31.9953 44.364C32.9939 45.4805 34.8173 45.4399 36.1784 45.3311C36.794 45.2818 40.0815 45.0186 39.3023 44.4806C39.3623 44.5032 39.4874 44.5582 39.6214 44.6329C39.6935 44.8963 39.7692 45.1588 39.8481 45.4201C39.8288 45.4314 39.8123 45.4436 39.7916 45.4548C39.814 45.445 39.8297 45.4344 39.8494 45.4244C40.64 48.0365 41.7653 50.5235 43.2388 52.8503C42.6875 52.6332 42.1165 52.4689 41.5374 52.3957C39.8223 52.1788 36.2144 53.5116 38.1328 55.7952C39.9723 57.9843 42.8361 55.6357 44.9237 55.3118C46.9487 58.138 49.1813 60.8464 51.5211 63.4643C51.3777 63.5092 51.2519 63.6028 51.1798 63.7484C50.2411 63.2722 49.263 62.591 48.3943 62.4066C47.1407 62.1408 44.5703 61.9797 43.6228 63.1017C42.4575 64.4814 43.7066 65.6021 45.0834 65.8667C47.0797 66.2505 49.693 65.2751 51.614 64.616C51.8337 64.6549 52.0736 64.5906 52.2169 64.4149C52.2593 64.401 52.3018 64.3873 52.3431 64.374C54.7125 66.9791 57.1726 69.4983 59.6177 71.9622C59.5917 71.9609 59.5656 71.9593 59.5385 71.9579C58.9007 71.5395 58.2165 71.1963 57.475 71.0165C55.7595 70.5984 53.7412 70.5964 52.3491 71.8376C50.9624 73.0735 50.4711 75.235 51.9057 76.6229C54.7773 79.4008 59.0081 73.0668 60.4565 72.8024C62.9413 75.2801 65.5687 77.595 68.2373 79.8632C67.9343 79.7709 67.6235 79.7031 67.3022 79.6726C64.6853 79.4221 58.543 82.6303 61.7546 85.7868C64.5532 88.5374 67.7925 83.2432 70.0479 81.3917C72.5626 83.5057 75.0911 85.6053 77.5485 87.7867C76.2082 87.4308 74.9129 87.3784 73.4761 87.8125C71.9894 88.2624 69.5903 89.385 70.5302 91.3924C71.4861 93.4337 74.3669 92.5048 75.8674 91.8567C76.6858 91.5032 78.3266 90.3102 79.7672 89.8077C83.6887 93.51 87.0853 97.5878 89.6568 102.391C91.2622 105.391 92.4804 108.595 93.3379 111.889C93.8852 113.991 94.9637 117.521 94.7478 120.257C95.7769 114.781 93.9161 108.203 91.9117 103.308C90.0687 98.8067 87.3104 94.8551 84.0797 91.2982C84.8904 88.8597 91.7145 85.3426 87.6349 83.0771C85.4686 81.8792 83.2498 83.8669 82.7763 85.972C82.451 87.4185 82.9466 89.2361 83.4725 90.6402C82.4562 89.5559 81.3996 88.5065 80.3109 87.4919C78.8063 86.0897 77.2657 84.7281 75.7104 83.3837C78.2734 80.9759 80.699 74.0925 77.2626 72.9667C72.188 71.3091 74.6314 80.6983 74.9854 82.4581C75.0859 82.464 75.1643 82.4336 75.2219 82.3685C75.1934 82.5297 75.1602 82.702 75.1201 82.8758C72.1432 80.3161 69.1222 77.8067 66.2007 75.1859C66.4639 74.9913 66.8824 74.2479 67.2112 73.8523C67.9534 72.9603 68.6635 72.0286 69.1825 70.9851C70.0023 69.3361 70.793 66.706 68.6198 65.736C66.2565 64.6793 65.1334 67.6541 65.1169 69.4287C65.1057 70.6561 65.4399 71.822 65.6141 73.025C65.6685 73.4002 65.4589 75.0914 65.97 74.3639C65.9459 74.6322 65.9425 74.8264 65.9544 74.9642C65.4299 74.4913 64.9095 74.0133 64.3923 73.5318C64.4162 73.471 64.434 73.4047 64.438 73.3279C64.4657 72.7988 63.9334 72.595 63.56 72.75C62.8776 72.1015 62.2019 71.4448 61.5382 70.7751C60.1315 69.3563 58.7045 67.897 57.2873 66.4066C57.5948 66.1424 57.4725 65.7767 57.7601 65.4962C58.0471 65.2164 58.6126 65.0617 58.9501 64.8018C59.7992 64.1478 60.5033 63.1949 61.0125 62.2571C61.8532 60.7076 62.9396 57.4571 60.4837 56.7185C57.9524 55.9561 56.6675 59.0851 56.5047 61.0413C56.473 61.4203 56.7568 64.8352 56.974 66.0752C54.3517 63.3053 51.7726 60.4315 49.4359 57.5077C50.1444 57.5012 52.1531 56.0496 52.5591 55.6535C53.55 54.6874 55.125 52.5527 53.3879 51.423C51.8434 50.4211 49.9396 51.8723 49.2792 53.2827C49.1706 53.5149 48.7878 55.6765 48.758 56.6464C47.7908 55.4065 46.8683 54.1594 46.01 52.9082C45.4375 52.0763 44.9026 51.2225 44.4022 50.3506C44.5227 50.2823 44.636 50.1632 44.743 50.0151C47.319 49.5779 50.6032 45.5588 47.5775 44.1604C46.1369 43.4955 44.5746 44.868 43.8689 45.9918C43.7243 46.2217 43.4902 47.3775 43.2996 48.2892C41.8598 45.4005 40.7595 42.3424 39.9221 39.2068C40.1463 39.1511 40.3362 38.9798 40.3612 38.6852C41.6119 37.9722 42.5995 37.3785 43.4725 36.0074C44.0149 35.1559 44.9917 33.2102 43.398 32.7375C41.3241 32.1225 40.0213 35.2902 39.8517 36.8505C39.8319 37.0316 39.8326 37.5583 39.8395 38.041C39.7675 38.0312 39.6947 38.0323 39.6233 38.045C39.147 36.1034 38.7668 34.1368 38.4644 32.1669C39.5964 31.8026 39.7921 25.8577 39.0384 25.0113C37.3538 23.1159 36.1652 25.8538 36.2552 27.3009C36.3614 29.0071 37.1346 30.5592 38.0552 31.9367C38.154 32.0825 38.1258 32.0755 38.1514 31.8723C38.1656 31.9727 38.1992 32.0468 38.249 32.1005C38.2015 32.9986 38.1089 33.9182 38.1534 34.7129C38.2809 36.9888 38.546 39.278 38.9309 41.5247C39.0245 42.0711 39.1318 42.6131 39.252 43.1503C38.3421 42.3752 37.1154 41.6865 36.6354 41.4712C35.3896 40.9128 33.4697 40.3099 32.2323 41.2558ZM94.8939 120.265C94.8361 121.059 94.6929 121.785 94.4254 122.385C94.626 121.702 94.7798 120.993 94.8939 120.265Z" fill="#F2F2F2"/>
<g opacity="0.7">
<path opacity="0.7" fill-rule="evenodd" clip-rule="evenodd" d="M68.0467 83.8727C72.9189 83.6199 78.9445 86.4638 79.4643 91.7599C79.8419 95.6079 79.7249 99.4449 80.3093 103.287C80.7766 106.358 81.7648 109.306 83.1126 112.103C84.4086 114.793 87.0971 117.083 87.7963 119.956C88.242 121.787 87.9925 124.363 87.3779 126.154C86.6305 128.331 87.0278 128.159 88.517 129.986C91.4354 133.567 94.0632 137.239 95.9214 141.515C98.5981 147.675 100.353 154.875 99.3596 161.617C99.2332 162.473 99.0834 165.546 97.9043 165.761C96.5875 166.001 97.2033 164.244 97.2736 163.676C97.7216 160.054 98.1197 156.888 97.5792 153.209C95.4938 139.016 85.3119 129.665 78.682 117.619C78.3176 116.998 77.5482 115.519 77.0132 114.543C76.1686 113.002 75.3195 110.07 74.1762 108.928C72.0228 106.776 74.0025 111.102 74.4221 111.928C74.9526 112.973 75.5362 114.084 76.0799 114.999C78.5673 119.243 81.3437 123.876 83.9127 128.25C72.802 130.782 64.9772 117.424 61.9956 108.643C59.539 101.408 56.5997 84.4917 68.0467 83.8727Z" fill="#69A1AC"/>
<path opacity="0.7" fill-rule="evenodd" clip-rule="evenodd" d="M133.349 70.4369C125.205 71.0832 119.976 76.4576 117.542 83.9747C116.23 88.0258 116.079 92.1874 115.35 96.3505C114.254 102.614 111.894 107.36 107.283 111.823C105.854 113.205 104.802 114.624 104.054 116.142C102.568 117.657 101.275 119.373 100.325 121.47C99.112 124.148 98.7687 127.361 100.17 130.031C100.546 130.749 101.486 132.189 102.46 132.844C98.8137 140.61 96.8088 149.115 97.0348 157.609C97.1714 162.736 97.4217 167.866 97.7137 172.987C97.7923 174.362 98.2401 176.633 98.9127 174.327C99.5283 172.217 98.7564 168.906 98.6849 166.702C98.3374 155.967 98.0403 146.206 102.459 136.177C102.923 135.126 103.414 134.083 103.926 133.048C103.956 133.031 103.984 133.01 104.012 132.989C104.031 133.005 104.049 133.021 104.069 133.035C104.101 132.977 104.146 132.908 104.198 132.83C104.345 132.679 104.473 132.487 104.595 132.274C104.987 131.731 105.431 131.093 105.433 130.743C105.433 130.74 105.431 130.736 105.431 130.734C108.167 126.268 111.3 122.048 114.501 117.911C114.477 117.941 117.973 113.182 117.432 115.814C117.172 117.082 114.6 119.498 113.562 120.841C111.265 123.83 108.567 127.618 106.326 131.28C106.024 131.453 105.598 132.304 105.29 132.938C105.119 133.26 104.961 133.583 104.805 133.866C112.747 136.49 118.926 131.204 123.139 125.055C123.144 125.048 123.149 125.041 123.154 125.033C124.436 123.334 125.749 121.648 127.39 120.305C130.127 118.064 133.059 117.668 136.287 116.565C145.089 113.558 148.831 102.151 150.019 93.6868C151.36 84.1379 144.801 69.4954 133.349 70.4369Z" fill="#89C5CC"/>
<path opacity="0.7" fill-rule="evenodd" clip-rule="evenodd" d="M117.26 43.6959C108.901 52.3961 104.862 64.4634 101.664 75.8079C98.0925 88.4786 95.7335 101.345 95.6429 114.518C95.5835 123.173 95.3481 131.883 95.8533 140.528C96.0325 143.598 96.3386 146.674 96.8252 149.711C96.8653 149.961 97.954 156.742 98.9958 155.162C99.5883 154.263 97.8798 148.127 97.7506 147.105C97.0244 141.348 96.8557 135.549 96.8911 129.751C96.9493 120.204 96.6679 110.707 97.6355 101.195C97.7797 99.7751 97.8939 98.2836 98.2312 96.8943C98.5893 95.4173 98.1332 96.062 99.2998 95.4773C100.433 94.9089 101.834 94.9901 103.01 94.277C107.676 91.448 110.062 84.1815 111.919 79.4137C114.044 73.9614 115.335 68.1474 116.366 62.4097C117.124 58.194 117.665 54.004 117.971 49.7341C118.068 48.3884 118.074 46.9811 118.338 45.6579C118.409 45.3009 118.767 44.6695 118.754 44.3534C118.727 43.6844 118.323 43.291 118.29 42.7289C117.94 43.0438 117.596 43.3664 117.26 43.6959Z" fill="#89C5CC"/>
<path opacity="0.7" fill-rule="evenodd" clip-rule="evenodd" d="M71.6777 159.612C71.6777 174 83.3416 185.664 97.7296 185.664C112.118 185.664 123.781 174 123.781 159.612" fill="#89C5CC"/>
<path opacity="0.7" fill-rule="evenodd" clip-rule="evenodd" d="M99.8219 159.695H98.4453C98.5408 157.968 98.667 156.244 98.9557 154.536C100.06 148.004 103.513 138.411 111.086 137.351C111.365 137.311 112.393 137.305 113.638 137.378C114.228 137.048 114.889 136.849 115.585 136.803C122.033 136.327 129.233 141.529 132.343 146.942C134.851 151.307 134.428 157.038 132.88 161.674C131.843 164.779 129.579 169.205 125.805 169.248C121.083 169.302 120.855 163.465 120.764 160.054C120.643 155.517 120.069 151.566 116.495 148.474C115.662 147.754 114.752 147.12 113.91 146.41C112.592 145.298 111.136 144.16 110.967 142.321C110.732 139.783 112.165 139.326 114.352 139.798C114.724 139.878 118.48 141.563 117.924 140.231C117.754 139.824 117.134 139.502 116.351 139.26C114.326 139.04 111.911 138.785 111.217 138.937C103.724 140.581 100.807 150.96 100.032 157.554C99.9485 158.266 99.8808 158.98 99.8219 159.695Z" fill="#69A1AC"/>
</g>
<path fill-rule="evenodd" clip-rule="evenodd" d="M140.566 75.9147C138.921 73.9845 137.808 71.6189 137.994 68.9683C138.53 61.331 149.162 63.0111 151.23 66.8658C153.298 70.7204 153.052 80.498 150.379 81.187C149.313 81.4617 147.043 80.7887 144.732 79.3958L146.182 89.6579H137.617L140.566 75.9147Z" fill="#B28B67"/>
<path fill-rule="evenodd" clip-rule="evenodd" d="M145.158 69.8117C145.486 74.3787 146.354 76.6622 147.76 76.6622C149.87 76.6622 151.661 75.3226 152.587 75.3226C153.262 75.3226 153.111 76.1673 152.663 76.7935C152.294 77.3101 150.497 77.8081 150.497 78.6091C150.497 79.4101 151.917 78.7904 151.917 79.2655C151.917 80.0513 152.167 81.5287 150.803 81.5287C149.423 81.5287 145.465 81.0257 144.787 78.9772C144.349 77.6552 144.066 74.9156 143.938 70.7586C143.854 70.7487 143.769 70.7436 143.683 70.7436C142.5 70.7436 141.541 71.7022 141.541 72.8848C141.541 73.4852 141.789 74.0278 142.187 74.4166C141.691 75.1159 141.136 75.8465 140.5 76.6003C138.109 75.1662 136.335 70.968 138.672 66.9351C139.318 64.9594 140.781 63.9041 142.508 63.4141C143.907 62.8289 145.359 62.763 146.585 63.1138C148.988 63.3199 151.134 64.0527 151.742 64.4879C151.742 66.763 151.301 67.4381 147.536 67.3786C146.611 67.8672 145.899 68.7086 145.158 69.8117Z" fill="#191847"/>
<path fill-rule="evenodd" clip-rule="evenodd" d="M113.79 136.059H154.831C157.984 136.059 160.541 138.615 160.541 141.769V174.601C160.541 177.755 157.984 180.311 154.831 180.311H113.79C110.637 180.311 108.08 177.755 108.08 174.601V141.769C108.08 138.615 110.637 136.059 113.79 136.059ZM119.5 146.051C118.712 146.051 118.073 146.69 118.073 147.479V168.891C118.073 169.68 118.712 170.319 119.5 170.319H149.121C149.909 170.319 150.548 169.68 150.548 168.891V147.479C150.548 146.69 149.909 146.051 149.121 146.051H119.5Z" fill="#C5CFD6"/>
<path fill-rule="evenodd" clip-rule="evenodd" d="M195.929 178.527C188.893 169.935 184.132 163.565 181.646 159.418C177.391 152.316 173.908 145.997 172.808 143.583C170.187 137.827 178.843 135.132 180.802 137.817C183.767 141.88 190.099 154.667 199.798 176.178L195.929 178.527Z" fill="#B28B67"/>
<path fill-rule="evenodd" clip-rule="evenodd" d="M181.51 176.029L168.415 143.067C165.615 137.058 179.14 133.108 181.198 135.905C185.871 142.253 196.977 167.298 198.37 169.189L181.51 176.029Z" fill="#2F3676"/>
<path fill-rule="evenodd" clip-rule="evenodd" d="M146.634 169.419C149.185 165.698 158.463 153.18 163.516 148C164.969 146.512 166.386 145.084 167.726 143.752C171.709 139.795 179.642 146.446 175.666 150.05C165.763 159.026 151.316 171.142 150.108 172.223C148.417 173.737 145.031 171.757 146.634 169.419Z" fill="#915B3C"/>
<path fill-rule="evenodd" clip-rule="evenodd" d="M147.232 167.738C146.354 168.461 145.782 169.052 145.518 169.51C145.196 170.068 144.819 170.934 144.387 172.111C145.034 172.484 150.845 175.839 161.819 182.175C163.137 180.939 163.342 179.98 162.435 179.297C161.528 178.614 160.779 178.038 160.19 177.569L154.173 169.279C154.057 169.12 153.834 169.084 153.674 169.2C153.672 169.202 153.669 169.204 153.666 169.206L152.416 170.169C151.269 170.069 150.413 169.856 149.848 169.53C149.39 169.265 148.863 168.713 148.268 167.876L148.268 167.876C148.04 167.554 147.594 167.479 147.273 167.707C147.259 167.717 147.246 167.727 147.232 167.738Z" fill="#E4E4E4"/>
<path fill-rule="evenodd" clip-rule="evenodd" d="M192.902 177.243C192.502 178.309 192.303 179.106 192.303 179.635C192.303 180.279 192.41 181.218 192.624 182.453C193.371 182.453 200.08 182.453 212.753 182.453C213.276 180.723 212.974 179.79 211.847 179.652C210.72 179.514 209.784 179.39 209.038 179.279L199.683 175.108C199.503 175.028 199.292 175.108 199.212 175.288C199.21 175.292 199.209 175.295 199.208 175.298L198.606 176.756C197.563 177.243 196.715 177.487 196.063 177.487C195.533 177.487 194.801 177.273 193.867 176.845L193.867 176.845C193.509 176.68 193.085 176.838 192.921 177.196C192.914 177.211 192.908 177.227 192.902 177.243Z" fill="#E4E4E4"/>
<path fill-rule="evenodd" clip-rule="evenodd" d="M163.703 144.713C152.82 142.94 145.53 141.728 141.833 141.076C131.297 139.218 128.225 133.548 130.042 121.178H149.454C152.023 121.92 162.757 126.508 181.656 134.942C185.056 136.63 184.423 141.607 183.802 143.247C183.776 143.314 178.044 153.136 166.605 172.714L150.725 162.598L163.733 145.905C164.077 145.213 164.067 144.816 163.703 144.713Z" fill="#5C63AB"/>
<path fill-rule="evenodd" clip-rule="evenodd" d="M165.102 116.506L176.486 124.865C179.573 125.699 182.153 126.735 184.224 127.975C184.714 128.421 185.305 129.324 183.276 129.168C181.246 129.012 179.105 128.939 178.825 129.631C178.545 130.323 179.773 131.151 179.207 132.085C178.829 132.708 177.047 131.146 173.859 127.401L162.586 122.727L165.102 116.506ZM121.395 116.795L128.852 116.824C124.247 131.689 121.762 139.576 121.395 140.486C120.569 142.533 122.316 145.649 123.064 147.324C120.63 148.413 120.889 144.38 117.819 145.808C115.016 147.112 112.884 149.475 109.647 147.477C109.249 147.231 108.812 146.306 109.866 145.584C112.492 143.783 116.276 140.632 116.787 139.595C117.484 138.18 119.02 130.58 121.395 116.795Z" fill="#915B3C"/>
<path fill-rule="evenodd" clip-rule="evenodd" d="M142.587 85.501L145.673 84.9717C157.123 94.8626 161.825 113.864 175.86 123.93L172.482 128.117C148.135 125.103 142.1 101.925 142.587 85.501Z" fill="#E87613"/>
<path fill-rule="evenodd" clip-rule="evenodd" d="M129.135 124.282C141.508 124.282 150.61 124.282 156.44 124.282C157.687 124.282 157.452 122.48 157.272 121.571C155.19 111.079 147.065 99.7688 147.065 84.8333L139.189 83.5983C132.674 94.0755 130.421 106.975 129.135 124.282Z" fill="#DDE3E9"/>
<path fill-rule="evenodd" clip-rule="evenodd" d="M129.355 93.8968C128.211 93.568 127.306 92.8011 126.638 91.5961C123.759 86.4018 124.799 83.5419 127.875 82.6019C130.952 81.6618 133.695 83.5982 138.597 83.5982C138.863 83.5982 139.107 83.6149 139.329 83.6483L141.795 83.789C148.869 107.764 150.82 123.76 147.648 131.776H126.157C124.883 134.745 123.665 137.244 122.501 139.271H116.645C116.094 121.451 120.331 106.326 129.355 93.8968Z" fill="#FF9B21"/>
<path fill-rule="evenodd" clip-rule="evenodd" d="M130.836 119.463C131.512 125.118 132.611 129.223 134.132 131.776H126.156C127.642 128.313 129.202 124.209 130.836 119.463Z" fill="black" fill-opacity="0.1"/>
<path d="M70.7266 232V220.625H73.9375C74.9271 220.625 75.8021 220.844 76.5625 221.281C77.3229 221.719 77.9089 222.341 78.3203 223.148C78.737 223.956 78.9479 224.883 78.9531 225.93V226.656C78.9531 227.729 78.7448 228.669 78.3281 229.477C77.9167 230.284 77.3255 230.904 76.5547 231.336C75.7891 231.768 74.8958 231.99 73.875 232H70.7266ZM72.2266 221.859V230.773H73.8047C74.9609 230.773 75.8594 230.414 76.5 229.695C77.1458 228.977 77.4688 227.953 77.4688 226.625V225.961C77.4688 224.669 77.1641 223.667 76.5547 222.953C75.9505 222.234 75.0911 221.87 73.9766 221.859H72.2266ZM80.6172 227.695C80.6172 226.867 80.7786 226.122 81.1016 225.461C81.4297 224.799 81.8828 224.289 82.4609 223.93C83.0443 223.57 83.7083 223.391 84.4531 223.391C85.6042 223.391 86.5339 223.789 87.2422 224.586C87.9557 225.383 88.3125 226.443 88.3125 227.766V227.867C88.3125 228.69 88.1536 229.43 87.8359 230.086C87.5234 230.737 87.0729 231.245 86.4844 231.609C85.901 231.974 85.2292 232.156 84.4688 232.156C83.3229 232.156 82.3932 231.758 81.6797 230.961C80.9714 230.164 80.6172 229.109 80.6172 227.797V227.695ZM82.0703 227.867C82.0703 228.805 82.2865 229.557 82.7188 230.125C83.1562 230.693 83.7396 230.977 84.4688 230.977C85.2031 230.977 85.7865 230.69 86.2188 230.117C86.651 229.539 86.8672 228.732 86.8672 227.695C86.8672 226.768 86.6458 226.018 86.2031 225.445C85.7656 224.867 85.1823 224.578 84.4531 224.578C83.7396 224.578 83.1641 224.862 82.7266 225.43C82.2891 225.997 82.0703 226.81 82.0703 227.867ZM93.5156 230.977C94.0312 230.977 94.4818 230.82 94.8672 230.508C95.2526 230.195 95.4661 229.805 95.5078 229.336H96.875C96.849 229.82 96.6823 230.281 96.375 230.719C96.0677 231.156 95.6562 231.505 95.1406 231.766C94.6302 232.026 94.0885 232.156 93.5156 232.156C92.3646 232.156 91.4479 231.773 90.7656 231.008C90.0885 230.237 89.75 229.185 89.75 227.852V227.609C89.75 226.786 89.901 226.055 90.2031 225.414C90.5052 224.773 90.9375 224.276 91.5 223.922C92.0677 223.568 92.737 223.391 93.5078 223.391C94.4557 223.391 95.2422 223.674 95.8672 224.242C96.4974 224.81 96.8333 225.547 96.875 226.453H95.5078C95.4661 225.906 95.2578 225.458 94.8828 225.109C94.513 224.755 94.0547 224.578 93.5078 224.578C92.7734 224.578 92.2031 224.844 91.7969 225.375C91.3958 225.901 91.1953 226.664 91.1953 227.664V227.938C91.1953 228.911 91.3958 229.661 91.7969 230.188C92.1979 230.714 92.7708 230.977 93.5156 230.977ZM103.719 231.164C103.156 231.826 102.331 232.156 101.242 232.156C100.341 232.156 99.6536 231.896 99.1797 231.375C98.7109 230.849 98.474 230.073 98.4688 229.047V223.547H99.9141V229.008C99.9141 230.289 100.435 230.93 101.477 230.93C102.581 230.93 103.315 230.518 103.68 229.695V223.547H105.125V232H103.75L103.719 231.164ZM108.688 223.547L108.727 224.484C109.346 223.755 110.182 223.391 111.234 223.391C112.417 223.391 113.221 223.844 113.648 224.75C113.93 224.344 114.294 224.016 114.742 223.766C115.195 223.516 115.729 223.391 116.344 223.391C118.198 223.391 119.141 224.372 119.172 226.336V232H117.727V226.422C117.727 225.818 117.589 225.367 117.312 225.07C117.036 224.768 116.573 224.617 115.922 224.617C115.385 224.617 114.94 224.779 114.586 225.102C114.232 225.419 114.026 225.849 113.969 226.391V232H112.516V226.461C112.516 225.232 111.914 224.617 110.711 224.617C109.763 224.617 109.115 225.021 108.766 225.828V232H107.32V223.547H108.688ZM124.867 232.156C123.721 232.156 122.789 231.781 122.07 231.031C121.352 230.276 120.992 229.268 120.992 228.008V227.742C120.992 226.904 121.151 226.156 121.469 225.5C121.792 224.839 122.24 224.323 122.812 223.953C123.391 223.578 124.016 223.391 124.688 223.391C125.786 223.391 126.641 223.753 127.25 224.477C127.859 225.201 128.164 226.237 128.164 227.586V228.188H122.438C122.458 229.021 122.701 229.695 123.164 230.211C123.633 230.721 124.227 230.977 124.945 230.977C125.456 230.977 125.888 230.872 126.242 230.664C126.596 230.456 126.906 230.18 127.172 229.836L128.055 230.523C127.346 231.612 126.284 232.156 124.867 232.156ZM124.688 224.578C124.104 224.578 123.615 224.792 123.219 225.219C122.823 225.641 122.578 226.234 122.484 227H126.719V226.891C126.677 226.156 126.479 225.589 126.125 225.188C125.771 224.781 125.292 224.578 124.688 224.578ZM131.211 223.547L131.258 224.609C131.904 223.797 132.747 223.391 133.789 223.391C135.576 223.391 136.477 224.398 136.492 226.414V232H135.047V226.406C135.042 225.797 134.901 225.346 134.625 225.055C134.354 224.763 133.93 224.617 133.352 224.617C132.883 224.617 132.471 224.742 132.117 224.992C131.763 225.242 131.487 225.57 131.289 225.977V232H129.844V223.547H131.211ZM140.633 221.5V223.547H142.211V224.664H140.633V229.906C140.633 230.245 140.703 230.5 140.844 230.672C140.984 230.839 141.224 230.922 141.562 230.922C141.729 230.922 141.958 230.891 142.25 230.828V232C141.87 232.104 141.5 232.156 141.141 232.156C140.495 232.156 140.008 231.961 139.68 231.57C139.352 231.18 139.188 230.625 139.188 229.906V224.664H137.648V223.547H139.188V221.5H140.633ZM149.125 232C149.042 231.833 148.974 231.536 148.922 231.109C148.25 231.807 147.448 232.156 146.516 232.156C145.682 232.156 144.997 231.922 144.461 231.453C143.93 230.979 143.664 230.38 143.664 229.656C143.664 228.776 143.997 228.094 144.664 227.609C145.336 227.12 146.279 226.875 147.492 226.875H148.898V226.211C148.898 225.706 148.747 225.305 148.445 225.008C148.143 224.706 147.698 224.555 147.109 224.555C146.594 224.555 146.161 224.685 145.812 224.945C145.464 225.206 145.289 225.521 145.289 225.891H143.836C143.836 225.469 143.984 225.062 144.281 224.672C144.583 224.276 144.99 223.964 145.5 223.734C146.016 223.505 146.581 223.391 147.195 223.391C148.169 223.391 148.932 223.635 149.484 224.125C150.036 224.609 150.323 225.279 150.344 226.133V230.023C150.344 230.799 150.443 231.417 150.641 231.875V232H149.125ZM146.727 230.898C147.18 230.898 147.609 230.781 148.016 230.547C148.422 230.312 148.716 230.008 148.898 229.633V227.898H147.766C145.995 227.898 145.109 228.417 145.109 229.453C145.109 229.906 145.26 230.26 145.562 230.516C145.865 230.771 146.253 230.898 146.727 230.898ZM154.57 221.5V223.547H156.148V224.664H154.57V229.906C154.57 230.245 154.641 230.5 154.781 230.672C154.922 230.839 155.161 230.922 155.5 230.922C155.667 230.922 155.896 230.891 156.188 230.828V232C155.807 232.104 155.438 232.156 155.078 232.156C154.432 232.156 153.945 231.961 153.617 231.57C153.289 231.18 153.125 230.625 153.125 229.906V224.664H151.586V223.547H153.125V221.5H154.57ZM159.414 232H157.969V223.547H159.414V232ZM157.852 221.305C157.852 221.07 157.922 220.872 158.062 220.711C158.208 220.549 158.422 220.469 158.703 220.469C158.984 220.469 159.198 220.549 159.344 220.711C159.49 220.872 159.562 221.07 159.562 221.305C159.562 221.539 159.49 221.734 159.344 221.891C159.198 222.047 158.984 222.125 158.703 222.125C158.422 222.125 158.208 222.047 158.062 221.891C157.922 221.734 157.852 221.539 157.852 221.305ZM161.352 227.695C161.352 226.867 161.513 226.122 161.836 225.461C162.164 224.799 162.617 224.289 163.195 223.93C163.779 223.57 164.443 223.391 165.188 223.391C166.339 223.391 167.268 223.789 167.977 224.586C168.69 225.383 169.047 226.443 169.047 227.766V227.867C169.047 228.69 168.888 229.43 168.57 230.086C168.258 230.737 167.807 231.245 167.219 231.609C166.635 231.974 165.964 232.156 165.203 232.156C164.057 232.156 163.128 231.758 162.414 230.961C161.706 230.164 161.352 229.109 161.352 227.797V227.695ZM162.805 227.867C162.805 228.805 163.021 229.557 163.453 230.125C163.891 230.693 164.474 230.977 165.203 230.977C165.938 230.977 166.521 230.69 166.953 230.117C167.385 229.539 167.602 228.732 167.602 227.695C167.602 226.768 167.38 226.018 166.938 225.445C166.5 224.867 165.917 224.578 165.188 224.578C164.474 224.578 163.898 224.862 163.461 225.43C163.023 225.997 162.805 226.81 162.805 227.867ZM172.227 223.547L172.273 224.609C172.919 223.797 173.763 223.391 174.805 223.391C176.591 223.391 177.492 224.398 177.508 226.414V232H176.062V226.406C176.057 225.797 175.917 225.346 175.641 225.055C175.37 224.763 174.945 224.617 174.367 224.617C173.898 224.617 173.487 224.742 173.133 224.992C172.779 225.242 172.503 225.57 172.305 225.977V232H170.859V223.547H172.227Z" fill="#5E00CC"/>
<path d="M44.1035 250.506L46.541 243.469H47.7715L44.6074 252H43.6113L40.4531 243.469H41.6777L44.1035 250.506ZM51.123 252.117C50.2637 252.117 49.5645 251.836 49.0254 251.273C48.4863 250.707 48.2168 249.951 48.2168 249.006V248.807C48.2168 248.178 48.3359 247.617 48.5742 247.125C48.8164 246.629 49.1523 246.242 49.582 245.965C50.0156 245.684 50.4844 245.543 50.9883 245.543C51.8125 245.543 52.4531 245.814 52.9102 246.357C53.3672 246.9 53.5957 247.678 53.5957 248.689V249.141H49.3008C49.3164 249.766 49.498 250.271 49.8457 250.658C50.1973 251.041 50.6426 251.232 51.1816 251.232C51.5645 251.232 51.8887 251.154 52.1543 250.998C52.4199 250.842 52.6523 250.635 52.8516 250.377L53.5137 250.893C52.9824 251.709 52.1855 252.117 51.123 252.117ZM50.9883 246.434C50.5508 246.434 50.1836 246.594 49.8867 246.914C49.5898 247.23 49.4062 247.676 49.3359 248.25H52.5117V248.168C52.4805 247.617 52.332 247.191 52.0664 246.891C51.8008 246.586 51.4414 246.434 50.9883 246.434ZM57.9199 246.633C57.7559 246.605 57.5781 246.592 57.3867 246.592C56.6758 246.592 56.1934 246.895 55.9395 247.5V252H54.8555V245.66H55.9102L55.9277 246.393C56.2832 245.826 56.7871 245.543 57.4395 245.543C57.6504 245.543 57.8105 245.57 57.9199 245.625V246.633ZM61.1016 250.412L62.5781 245.66H63.7383L61.1895 252.979C60.7949 254.033 60.168 254.561 59.3086 254.561L59.1035 254.543L58.6992 254.467V253.588L58.9922 253.611C59.3594 253.611 59.6445 253.537 59.8477 253.389C60.0547 253.24 60.2246 252.969 60.3574 252.574L60.5977 251.93L58.3359 245.66H59.5195L61.1016 250.412ZM70.3184 252.117C69.459 252.117 68.7598 251.836 68.2207 251.273C67.6816 250.707 67.4121 249.951 67.4121 249.006V248.807C67.4121 248.178 67.5312 247.617 67.7695 247.125C68.0117 246.629 68.3477 246.242 68.7773 245.965C69.2109 245.684 69.6797 245.543 70.1836 245.543C71.0078 245.543 71.6484 245.814 72.1055 246.357C72.5625 246.9 72.791 247.678 72.791 248.689V249.141H68.4961C68.5117 249.766 68.6934 250.271 69.041 250.658C69.3926 251.041 69.8379 251.232 70.377 251.232C70.7598 251.232 71.084 251.154 71.3496 250.998C71.6152 250.842 71.8477 250.635 72.0469 250.377L72.709 250.893C72.1777 251.709 71.3809 252.117 70.3184 252.117ZM70.1836 246.434C69.7461 246.434 69.3789 246.594 69.082 246.914C68.7852 247.23 68.6016 247.676 68.5312 248.25H71.707V248.168C71.6758 247.617 71.5273 247.191 71.2617 246.891C70.9961 246.586 70.6367 246.434 70.1836 246.434ZM77.9648 252C77.9023 251.875 77.8516 251.652 77.8125 251.332C77.3086 251.855 76.707 252.117 76.0078 252.117C75.3828 252.117 74.8691 251.941 74.4668 251.59C74.0684 251.234 73.8691 250.785 73.8691 250.242C73.8691 249.582 74.1191 249.07 74.6191 248.707C75.123 248.34 75.8301 248.156 76.7402 248.156H77.7949V247.658C77.7949 247.279 77.6816 246.979 77.4551 246.756C77.2285 246.529 76.8945 246.416 76.4531 246.416C76.0664 246.416 75.7422 246.514 75.4805 246.709C75.2188 246.904 75.0879 247.141 75.0879 247.418H73.998C73.998 247.102 74.1094 246.797 74.332 246.504C74.5586 246.207 74.8633 245.973 75.2461 245.801C75.6328 245.629 76.0566 245.543 76.5176 245.543C77.248 245.543 77.8203 245.727 78.2344 246.094C78.6484 246.457 78.8633 246.959 78.8789 247.6V250.518C78.8789 251.1 78.9531 251.562 79.1016 251.906V252H77.9648ZM76.166 251.174C76.5059 251.174 76.8281 251.086 77.1328 250.91C77.4375 250.734 77.6582 250.506 77.7949 250.225V248.924H76.9453C75.6172 248.924 74.9531 249.312 74.9531 250.09C74.9531 250.43 75.0664 250.695 75.293 250.887C75.5195 251.078 75.8105 251.174 76.166 251.174ZM84.2695 250.318C84.2695 250.025 84.1582 249.799 83.9355 249.639C83.7168 249.475 83.332 249.334 82.7812 249.217C82.2344 249.1 81.7988 248.959 81.4746 248.795C81.1543 248.631 80.916 248.436 80.7598 248.209C80.6074 247.982 80.5312 247.713 80.5312 247.4C80.5312 246.881 80.75 246.441 81.1875 246.082C81.6289 245.723 82.1914 245.543 82.875 245.543C83.5938 245.543 84.1758 245.729 84.6211 246.1C85.0703 246.471 85.2949 246.945 85.2949 247.523H84.2051C84.2051 247.227 84.0781 246.971 83.8242 246.756C83.5742 246.541 83.2578 246.434 82.875 246.434C82.4805 246.434 82.1719 246.52 81.9492 246.691C81.7266 246.863 81.6152 247.088 81.6152 247.365C81.6152 247.627 81.7188 247.824 81.9258 247.957C82.1328 248.09 82.5059 248.217 83.0449 248.338C83.5879 248.459 84.0273 248.604 84.3633 248.771C84.6992 248.939 84.9473 249.143 85.1074 249.381C85.2715 249.615 85.3535 249.902 85.3535 250.242C85.3535 250.809 85.127 251.264 84.6738 251.607C84.2207 251.947 83.6328 252.117 82.9102 252.117C82.4023 252.117 81.9531 252.027 81.5625 251.848C81.1719 251.668 80.8652 251.418 80.6426 251.098C80.4238 250.773 80.3145 250.424 80.3145 250.049H81.3984C81.418 250.412 81.5625 250.701 81.832 250.916C82.1055 251.127 82.4648 251.232 82.9102 251.232C83.3203 251.232 83.6484 251.15 83.8945 250.986C84.1445 250.818 84.2695 250.596 84.2695 250.318ZM88.8398 250.412L90.3164 245.66H91.4766L88.9277 252.979C88.5332 254.033 87.9062 254.561 87.0469 254.561L86.8418 254.543L86.4375 254.467V253.588L86.7305 253.611C87.0977 253.611 87.3828 253.537 87.5859 253.389C87.793 253.24 87.9629 252.969 88.0957 252.574L88.3359 251.93L86.0742 245.66H87.2578L88.8398 250.412ZM96.8965 244.125V245.66H98.0801V246.498H96.8965V250.43C96.8965 250.684 96.9492 250.875 97.0547 251.004C97.1602 251.129 97.3398 251.191 97.5938 251.191C97.7188 251.191 97.8906 251.168 98.1094 251.121V252C97.8242 252.078 97.5469 252.117 97.2773 252.117C96.793 252.117 96.4277 251.971 96.1816 251.678C95.9355 251.385 95.8125 250.969 95.8125 250.43V246.498H94.6582V245.66H95.8125V244.125H96.8965ZM98.9473 248.771C98.9473 248.15 99.0684 247.592 99.3105 247.096C99.5566 246.6 99.8965 246.217 100.33 245.947C100.768 245.678 101.266 245.543 101.824 245.543C102.688 245.543 103.385 245.842 103.916 246.439C104.451 247.037 104.719 247.832 104.719 248.824V248.9C104.719 249.518 104.6 250.072 104.361 250.564C104.127 251.053 103.789 251.434 103.348 251.707C102.91 251.98 102.406 252.117 101.836 252.117C100.977 252.117 100.279 251.818 99.7441 251.221C99.2129 250.623 98.9473 249.832 98.9473 248.848V248.771ZM100.037 248.9C100.037 249.604 100.199 250.168 100.523 250.594C100.852 251.02 101.289 251.232 101.836 251.232C102.387 251.232 102.824 251.018 103.148 250.588C103.473 250.154 103.635 249.549 103.635 248.771C103.635 248.076 103.469 247.514 103.137 247.084C102.809 246.65 102.371 246.434 101.824 246.434C101.289 246.434 100.857 246.646 100.529 247.072C100.201 247.498 100.037 248.107 100.037 248.9ZM112.969 251.373C112.547 251.869 111.928 252.117 111.111 252.117C110.436 252.117 109.92 251.922 109.564 251.531C109.213 251.137 109.035 250.555 109.031 249.785V245.66H110.115V249.756C110.115 250.717 110.506 251.197 111.287 251.197C112.115 251.197 112.666 250.889 112.939 250.271V245.66H114.023V252H112.992L112.969 251.373ZM119.367 250.318C119.367 250.025 119.256 249.799 119.033 249.639C118.814 249.475 118.43 249.334 117.879 249.217C117.332 249.1 116.896 248.959 116.572 248.795C116.252 248.631 116.014 248.436 115.857 248.209C115.705 247.982 115.629 247.713 115.629 247.4C115.629 246.881 115.848 246.441 116.285 246.082C116.727 245.723 117.289 245.543 117.973 245.543C118.691 245.543 119.273 245.729 119.719 246.1C120.168 246.471 120.393 246.945 120.393 247.523H119.303C119.303 247.227 119.176 246.971 118.922 246.756C118.672 246.541 118.355 246.434 117.973 246.434C117.578 246.434 117.27 246.52 117.047 246.691C116.824 246.863 116.713 247.088 116.713 247.365C116.713 247.627 116.816 247.824 117.023 247.957C117.23 248.09 117.604 248.217 118.143 248.338C118.686 248.459 119.125 248.604 119.461 248.771C119.797 248.939 120.045 249.143 120.205 249.381C120.369 249.615 120.451 249.902 120.451 250.242C120.451 250.809 120.225 251.264 119.771 251.607C119.318 251.947 118.73 252.117 118.008 252.117C117.5 252.117 117.051 252.027 116.66 251.848C116.27 251.668 115.963 251.418 115.74 251.098C115.521 250.773 115.412 250.424 115.412 250.049H116.496C116.516 250.412 116.66 250.701 116.93 250.916C117.203 251.127 117.562 251.232 118.008 251.232C118.418 251.232 118.746 251.15 118.992 250.986C119.242 250.818 119.367 250.596 119.367 250.318ZM124.494 252.117C123.635 252.117 122.936 251.836 122.396 251.273C121.857 250.707 121.588 249.951 121.588 249.006V248.807C121.588 248.178 121.707 247.617 121.945 247.125C122.188 246.629 122.523 246.242 122.953 245.965C123.387 245.684 123.855 245.543 124.359 245.543C125.184 245.543 125.824 245.814 126.281 246.357C126.738 246.9 126.967 247.678 126.967 248.689V249.141H122.672C122.688 249.766 122.869 250.271 123.217 250.658C123.568 251.041 124.014 251.232 124.553 251.232C124.936 251.232 125.26 251.154 125.525 250.998C125.791 250.842 126.023 250.635 126.223 250.377L126.885 250.893C126.354 251.709 125.557 252.117 124.494 252.117ZM124.359 246.434C123.922 246.434 123.555 246.594 123.258 246.914C122.961 247.23 122.777 247.676 122.707 248.25H125.883V248.168C125.852 247.617 125.703 247.191 125.438 246.891C125.172 246.586 124.812 246.434 124.359 246.434ZM132.381 252H131.297V245.66H132.381V252ZM131.209 243.979C131.209 243.803 131.262 243.654 131.367 243.533C131.477 243.412 131.637 243.352 131.848 243.352C132.059 243.352 132.219 243.412 132.328 243.533C132.438 243.654 132.492 243.803 132.492 243.979C132.492 244.154 132.438 244.301 132.328 244.418C132.219 244.535 132.059 244.594 131.848 244.594C131.637 244.594 131.477 244.535 131.367 244.418C131.262 244.301 131.209 244.154 131.209 243.979ZM134.654 252V246.498H133.652V245.66H134.654V245.01C134.654 244.33 134.836 243.805 135.199 243.434C135.562 243.062 136.076 242.877 136.74 242.877C136.99 242.877 137.238 242.91 137.484 242.977L137.426 243.855C137.242 243.82 137.047 243.803 136.84 243.803C136.488 243.803 136.217 243.906 136.025 244.113C135.834 244.316 135.738 244.609 135.738 244.992V245.66H137.092V246.498H135.738V252H134.654ZM143.344 250.412L144.82 245.66H145.98L143.432 252.979C143.037 254.033 142.41 254.561 141.551 254.561L141.346 254.543L140.941 254.467V253.588L141.234 253.611C141.602 253.611 141.887 253.537 142.09 253.389C142.297 253.24 142.467 252.969 142.6 252.574L142.84 251.93L140.578 245.66H141.762L143.344 250.412ZM146.572 248.771C146.572 248.15 146.693 247.592 146.936 247.096C147.182 246.6 147.521 246.217 147.955 245.947C148.393 245.678 148.891 245.543 149.449 245.543C150.312 245.543 151.01 245.842 151.541 246.439C152.076 247.037 152.344 247.832 152.344 248.824V248.9C152.344 249.518 152.225 250.072 151.986 250.564C151.752 251.053 151.414 251.434 150.973 251.707C150.535 251.98 150.031 252.117 149.461 252.117C148.602 252.117 147.904 251.818 147.369 251.221C146.838 250.623 146.572 249.832 146.572 248.848V248.771ZM147.662 248.9C147.662 249.604 147.824 250.168 148.148 250.594C148.477 251.02 148.914 251.232 149.461 251.232C150.012 251.232 150.449 251.018 150.773 250.588C151.098 250.154 151.26 249.549 151.26 248.771C151.26 248.076 151.094 247.514 150.762 247.084C150.434 246.65 149.996 246.434 149.449 246.434C148.914 246.434 148.482 246.646 148.154 247.072C147.826 247.498 147.662 248.107 147.662 248.9ZM157.617 251.373C157.195 251.869 156.576 252.117 155.76 252.117C155.084 252.117 154.568 251.922 154.213 251.531C153.861 251.137 153.684 250.555 153.68 249.785V245.66H154.764V249.756C154.764 250.717 155.154 251.197 155.936 251.197C156.764 251.197 157.314 250.889 157.588 250.271V245.66H158.672V252H157.641L157.617 251.373ZM166.365 246.633C166.201 246.605 166.023 246.592 165.832 246.592C165.121 246.592 164.639 246.895 164.385 247.5V252H163.301V245.66H164.355L164.373 246.393C164.729 245.826 165.232 245.543 165.885 245.543C166.096 245.543 166.256 245.57 166.365 245.625V246.633ZM169.881 252.117C169.021 252.117 168.322 251.836 167.783 251.273C167.244 250.707 166.975 249.951 166.975 249.006V248.807C166.975 248.178 167.094 247.617 167.332 247.125C167.574 246.629 167.91 246.242 168.34 245.965C168.773 245.684 169.242 245.543 169.746 245.543C170.57 245.543 171.211 245.814 171.668 246.357C172.125 246.9 172.354 247.678 172.354 248.689V249.141H168.059C168.074 249.766 168.256 250.271 168.604 250.658C168.955 251.041 169.4 251.232 169.939 251.232C170.322 251.232 170.646 251.154 170.912 250.998C171.178 250.842 171.41 250.635 171.609 250.377L172.271 250.893C171.74 251.709 170.943 252.117 169.881 252.117ZM169.746 246.434C169.309 246.434 168.941 246.594 168.645 246.914C168.348 247.23 168.164 247.676 168.094 248.25H171.27V248.168C171.238 247.617 171.09 247.191 170.824 246.891C170.559 246.586 170.199 246.434 169.746 246.434ZM177.527 252C177.465 251.875 177.414 251.652 177.375 251.332C176.871 251.855 176.27 252.117 175.57 252.117C174.945 252.117 174.432 251.941 174.029 251.59C173.631 251.234 173.432 250.785 173.432 250.242C173.432 249.582 173.682 249.07 174.182 248.707C174.686 248.34 175.393 248.156 176.303 248.156H177.357V247.658C177.357 247.279 177.244 246.979 177.018 246.756C176.791 246.529 176.457 246.416 176.016 246.416C175.629 246.416 175.305 246.514 175.043 246.709C174.781 246.904 174.65 247.141 174.65 247.418H173.561C173.561 247.102 173.672 246.797 173.895 246.504C174.121 246.207 174.426 245.973 174.809 245.801C175.195 245.629 175.619 245.543 176.08 245.543C176.811 245.543 177.383 245.727 177.797 246.094C178.211 246.457 178.426 246.959 178.441 247.6V250.518C178.441 251.1 178.516 251.562 178.664 251.906V252H177.527ZM175.729 251.174C176.068 251.174 176.391 251.086 176.695 250.91C177 250.734 177.221 250.506 177.357 250.225V248.924H176.508C175.18 248.924 174.516 249.312 174.516 250.09C174.516 250.43 174.629 250.695 174.855 250.887C175.082 251.078 175.373 251.174 175.729 251.174ZM179.877 248.777C179.877 247.805 180.107 247.023 180.568 246.434C181.029 245.84 181.633 245.543 182.379 245.543C183.121 245.543 183.709 245.797 184.143 246.305V243H185.227V252H184.23L184.178 251.32C183.744 251.852 183.141 252.117 182.367 252.117C181.633 252.117 181.033 251.816 180.568 251.215C180.107 250.613 179.877 249.828 179.877 248.859V248.777ZM180.961 248.9C180.961 249.619 181.109 250.182 181.406 250.588C181.703 250.994 182.113 251.197 182.637 251.197C183.324 251.197 183.826 250.889 184.143 250.271V247.359C183.818 246.762 183.32 246.463 182.648 246.463C182.117 246.463 181.703 246.668 181.406 247.078C181.109 247.488 180.961 248.096 180.961 248.9ZM191.361 244.125V245.66H192.545V246.498H191.361V250.43C191.361 250.684 191.414 250.875 191.52 251.004C191.625 251.129 191.805 251.191 192.059 251.191C192.184 251.191 192.355 251.168 192.574 251.121V252C192.289 252.078 192.012 252.117 191.742 252.117C191.258 252.117 190.893 251.971 190.646 251.678C190.4 251.385 190.277 250.969 190.277 250.43V246.498H189.123V245.66H190.277V244.125H191.361ZM194.9 246.428C195.381 245.838 196.006 245.543 196.775 245.543C198.115 245.543 198.791 246.299 198.803 247.811V252H197.719V247.805C197.715 247.348 197.609 247.01 197.402 246.791C197.199 246.572 196.881 246.463 196.447 246.463C196.096 246.463 195.787 246.557 195.521 246.744C195.256 246.932 195.049 247.178 194.9 247.482V252H193.816V243H194.9V246.428ZM201.604 252H200.52V245.66H201.604V252ZM200.432 243.979C200.432 243.803 200.484 243.654 200.59 243.533C200.699 243.412 200.859 243.352 201.07 243.352C201.281 243.352 201.441 243.412 201.551 243.533C201.66 243.654 201.715 243.803 201.715 243.979C201.715 244.154 201.66 244.301 201.551 244.418C201.441 244.535 201.281 244.594 201.07 244.594C200.859 244.594 200.699 244.535 200.59 244.418C200.484 244.301 200.432 244.154 200.432 243.979ZM207.035 250.318C207.035 250.025 206.924 249.799 206.701 249.639C206.482 249.475 206.098 249.334 205.547 249.217C205 249.1 204.564 248.959 204.24 248.795C203.92 248.631 203.682 248.436 203.525 248.209C203.373 247.982 203.297 247.713 203.297 247.4C203.297 246.881 203.516 246.441 203.953 246.082C204.395 245.723 204.957 245.543 205.641 245.543C206.359 245.543 206.941 245.729 207.387 246.1C207.836 246.471 208.061 246.945 208.061 247.523H206.971C206.971 247.227 206.844 246.971 206.59 246.756C206.34 246.541 206.023 246.434 205.641 246.434C205.246 246.434 204.938 246.52 204.715 246.691C204.492 246.863 204.381 247.088 204.381 247.365C204.381 247.627 204.484 247.824 204.691 247.957C204.898 248.09 205.271 248.217 205.811 248.338C206.354 248.459 206.793 248.604 207.129 248.771C207.465 248.939 207.713 249.143 207.873 249.381C208.037 249.615 208.119 249.902 208.119 250.242C208.119 250.809 207.893 251.264 207.439 251.607C206.986 251.947 206.398 252.117 205.676 252.117C205.168 252.117 204.719 252.027 204.328 251.848C203.938 251.668 203.631 251.418 203.408 251.098C203.189 250.773 203.08 250.424 203.08 250.049H204.164C204.184 250.412 204.328 250.701 204.598 250.916C204.871 251.127 205.23 251.232 205.676 251.232C206.086 251.232 206.414 251.15 206.66 250.986C206.91 250.818 207.035 250.596 207.035 250.318Z" fill="#707070"/>
<rect x="19.5" y="305.5" width="201" height="39" rx="4.5" stroke="#5E00CC"/>
<path d="M78.2148 325.549H76.2109V329H75.0801V320.469H77.9043C78.8652 320.469 79.6035 320.688 80.1191 321.125C80.6387 321.562 80.8984 322.199 80.8984 323.035C80.8984 323.566 80.7539 324.029 80.4648 324.424C80.1797 324.818 79.7812 325.113 79.2695 325.309L81.2734 328.93V329H80.0664L78.2148 325.549ZM76.2109 324.629H77.9395C78.498 324.629 78.9414 324.484 79.2695 324.195C79.6016 323.906 79.7676 323.52 79.7676 323.035C79.7676 322.508 79.6094 322.104 79.293 321.822C78.9805 321.541 78.5273 321.398 77.9336 321.395H76.2109V324.629ZM84.9414 329.117C84.082 329.117 83.3828 328.836 82.8438 328.273C82.3047 327.707 82.0352 326.951 82.0352 326.006V325.807C82.0352 325.178 82.1543 324.617 82.3926 324.125C82.6348 323.629 82.9707 323.242 83.4004 322.965C83.834 322.684 84.3027 322.543 84.8066 322.543C85.6309 322.543 86.2715 322.814 86.7285 323.357C87.1855 323.9 87.4141 324.678 87.4141 325.689V326.141H83.1191C83.1348 326.766 83.3164 327.271 83.6641 327.658C84.0156 328.041 84.4609 328.232 85 328.232C85.3828 328.232 85.707 328.154 85.9727 327.998C86.2383 327.842 86.4707 327.635 86.6699 327.377L87.332 327.893C86.8008 328.709 86.0039 329.117 84.9414 329.117ZM84.8066 323.434C84.3691 323.434 84.002 323.594 83.7051 323.914C83.4082 324.23 83.2246 324.676 83.1543 325.25H86.3301V325.168C86.2988 324.617 86.1504 324.191 85.8848 323.891C85.6191 323.586 85.2598 323.434 84.8066 323.434ZM92.5879 329C92.5254 328.875 92.4746 328.652 92.4355 328.332C91.9316 328.855 91.3301 329.117 90.6309 329.117C90.0059 329.117 89.4922 328.941 89.0898 328.59C88.6914 328.234 88.4922 327.785 88.4922 327.242C88.4922 326.582 88.7422 326.07 89.2422 325.707C89.7461 325.34 90.4531 325.156 91.3633 325.156H92.418V324.658C92.418 324.279 92.3047 323.979 92.0781 323.756C91.8516 323.529 91.5176 323.416 91.0762 323.416C90.6895 323.416 90.3652 323.514 90.1035 323.709C89.8418 323.904 89.7109 324.141 89.7109 324.418H88.6211C88.6211 324.102 88.7324 323.797 88.9551 323.504C89.1816 323.207 89.4863 322.973 89.8691 322.801C90.2559 322.629 90.6797 322.543 91.1406 322.543C91.8711 322.543 92.4434 322.727 92.8574 323.094C93.2715 323.457 93.4863 323.959 93.502 324.6V327.518C93.502 328.1 93.5762 328.562 93.7246 328.906V329H92.5879ZM90.7891 328.174C91.1289 328.174 91.4512 328.086 91.7559 327.91C92.0605 327.734 92.2812 327.506 92.418 327.225V325.924H91.5684C90.2402 325.924 89.5762 326.312 89.5762 327.09C89.5762 327.43 89.6895 327.695 89.916 327.887C90.1426 328.078 90.4336 328.174 90.7891 328.174ZM94.9375 325.777C94.9375 324.805 95.168 324.023 95.6289 323.434C96.0898 322.84 96.6934 322.543 97.4395 322.543C98.1816 322.543 98.7695 322.797 99.2031 323.305V320H100.287V329H99.291L99.2383 328.32C98.8047 328.852 98.2012 329.117 97.4277 329.117C96.6934 329.117 96.0938 328.816 95.6289 328.215C95.168 327.613 94.9375 326.828 94.9375 325.859V325.777ZM96.0215 325.9C96.0215 326.619 96.1699 327.182 96.4668 327.588C96.7637 327.994 97.1738 328.197 97.6973 328.197C98.3848 328.197 98.8867 327.889 99.2031 327.271V324.359C98.8789 323.762 98.3809 323.463 97.709 323.463C97.1777 323.463 96.7637 323.668 96.4668 324.078C96.1699 324.488 96.0215 325.096 96.0215 325.9ZM103.152 329H102.068V322.66H103.152V329ZM101.98 320.979C101.98 320.803 102.033 320.654 102.139 320.533C102.248 320.412 102.408 320.352 102.619 320.352C102.83 320.352 102.99 320.412 103.1 320.533C103.209 320.654 103.264 320.803 103.264 320.979C103.264 321.154 103.209 321.301 103.1 321.418C102.99 321.535 102.83 321.594 102.619 321.594C102.408 321.594 102.248 321.535 102.139 321.418C102.033 321.301 101.98 321.154 101.98 320.979ZM105.918 322.66L105.953 323.457C106.438 322.848 107.07 322.543 107.852 322.543C109.191 322.543 109.867 323.299 109.879 324.811V329H108.795V324.805C108.791 324.348 108.686 324.01 108.479 323.791C108.275 323.572 107.957 323.463 107.523 323.463C107.172 323.463 106.863 323.557 106.598 323.744C106.332 323.932 106.125 324.178 105.977 324.482V329H104.893V322.66H105.918ZM111.256 325.777C111.256 324.789 111.484 324.004 111.941 323.422C112.398 322.836 113.004 322.543 113.758 322.543C114.531 322.543 115.135 322.816 115.568 323.363L115.621 322.66H116.611V328.848C116.611 329.668 116.367 330.314 115.879 330.787C115.395 331.26 114.742 331.496 113.922 331.496C113.465 331.496 113.018 331.398 112.58 331.203C112.143 331.008 111.809 330.74 111.578 330.4L112.141 329.75C112.605 330.324 113.174 330.611 113.846 330.611C114.373 330.611 114.783 330.463 115.076 330.166C115.373 329.869 115.521 329.451 115.521 328.912V328.367C115.088 328.867 114.496 329.117 113.746 329.117C113.004 329.117 112.402 328.818 111.941 328.221C111.484 327.623 111.256 326.809 111.256 325.777ZM112.346 325.9C112.346 326.615 112.492 327.178 112.785 327.588C113.078 327.994 113.488 328.197 114.016 328.197C114.699 328.197 115.201 327.887 115.521 327.266V324.371C115.189 323.766 114.691 323.463 114.027 323.463C113.5 323.463 113.088 323.668 112.791 324.078C112.494 324.488 112.346 325.096 112.346 325.9ZM122.406 329H121.322V322.66H122.406V329ZM121.234 320.979C121.234 320.803 121.287 320.654 121.393 320.533C121.502 320.412 121.662 320.352 121.873 320.352C122.084 320.352 122.244 320.412 122.354 320.533C122.463 320.654 122.518 320.803 122.518 320.979C122.518 321.154 122.463 321.301 122.354 321.418C122.244 321.535 122.084 321.594 121.873 321.594C121.662 321.594 121.502 321.535 121.393 321.418C121.287 321.301 121.234 321.154 121.234 320.979ZM127.838 327.318C127.838 327.025 127.727 326.799 127.504 326.639C127.285 326.475 126.9 326.334 126.35 326.217C125.803 326.1 125.367 325.959 125.043 325.795C124.723 325.631 124.484 325.436 124.328 325.209C124.176 324.982 124.1 324.713 124.1 324.4C124.1 323.881 124.318 323.441 124.756 323.082C125.197 322.723 125.76 322.543 126.443 322.543C127.162 322.543 127.744 322.729 128.189 323.1C128.639 323.471 128.863 323.945 128.863 324.523H127.773C127.773 324.227 127.646 323.971 127.393 323.756C127.143 323.541 126.826 323.434 126.443 323.434C126.049 323.434 125.74 323.52 125.518 323.691C125.295 323.863 125.184 324.088 125.184 324.365C125.184 324.627 125.287 324.824 125.494 324.957C125.701 325.09 126.074 325.217 126.613 325.338C127.156 325.459 127.596 325.604 127.932 325.771C128.268 325.939 128.516 326.143 128.676 326.381C128.84 326.615 128.922 326.902 128.922 327.242C128.922 327.809 128.695 328.264 128.242 328.607C127.789 328.947 127.201 329.117 126.479 329.117C125.971 329.117 125.521 329.027 125.131 328.848C124.74 328.668 124.434 328.418 124.211 328.098C123.992 327.773 123.883 327.424 123.883 327.049H124.967C124.986 327.412 125.131 327.701 125.4 327.916C125.674 328.127 126.033 328.232 126.479 328.232C126.889 328.232 127.217 328.15 127.463 327.986C127.713 327.818 127.838 327.596 127.838 327.318ZM133.844 329V323.498H132.842V322.66H133.844V322.01C133.844 321.33 134.025 320.805 134.389 320.434C134.752 320.062 135.266 319.877 135.93 319.877C136.18 319.877 136.428 319.91 136.674 319.977L136.615 320.855C136.432 320.82 136.236 320.803 136.029 320.803C135.678 320.803 135.406 320.906 135.215 321.113C135.023 321.316 134.928 321.609 134.928 321.992V322.66H136.281V323.498H134.928V329H133.844ZM141.396 328.373C140.975 328.869 140.355 329.117 139.539 329.117C138.863 329.117 138.348 328.922 137.992 328.531C137.641 328.137 137.463 327.555 137.459 326.785V322.66H138.543V326.756C138.543 327.717 138.934 328.197 139.715 328.197C140.543 328.197 141.094 327.889 141.367 327.271V322.66H142.451V329H141.42L141.396 328.373ZM145.129 322.66L145.164 323.457C145.648 322.848 146.281 322.543 147.062 322.543C148.402 322.543 149.078 323.299 149.09 324.811V329H148.006V324.805C148.002 324.348 147.896 324.01 147.689 323.791C147.486 323.572 147.168 323.463 146.734 323.463C146.383 323.463 146.074 323.557 145.809 323.744C145.543 323.932 145.336 324.178 145.188 324.482V329H144.104V322.66H145.129Z" fill="#5E00CC"/>
<path d="M162.201 328L165.201 325L162.201 322" stroke="#5E00CC" stroke-width="1.3" stroke-linecap="round" stroke-linejoin="round"/>
<path d="M158 328L161 325L158 322" stroke="#5E00CC" stroke-width="1.3" stroke-linecap="round" stroke-linejoin="round"/>
<defs>
<linearGradient id="paint0_linear" x1="120" y1="0" x2="120" y2="374" gradientUnits="userSpaceOnUse">
<stop stop-color="#E9EDFF" stop-opacity="0"/>
<stop offset="1" stop-color="#E9EDFF"/>
</linearGradient>
</defs>
</svg>
