<svg width="44" height="45" viewBox="0 0 44 45" fill="none" xmlns="http://www.w3.org/2000/svg">
<g clip-path="url(#clip0_300_4434)">
<path d="M22.7531 34.0938H21.2469C20.0286 34.0938 19.0375 33.1026 19.0375 31.8844V31.3748C18.5195 31.2093 18.0163 31.0005 17.5329 30.7503L17.1718 31.1114C16.2971 31.9871 14.8961 31.9615 14.0469 31.1111L12.9823 30.0466C12.1315 29.1968 12.1071 27.7962 12.9826 26.9216L13.3434 26.5608C13.0932 26.0774 12.8844 25.5743 12.7189 25.0563H12.2094C10.9912 25.0563 10 24.0651 10 22.8469V21.3406C10 20.1224 10.9912 19.1313 12.2094 19.1313H12.7189C12.8845 18.6133 13.0933 18.1101 13.3435 17.6267L12.9823 17.2656C12.1074 16.3916 12.1315 14.9909 12.9826 14.1407L14.0473 13.0761C14.8985 12.2237 16.2992 12.2024 17.1722 13.0764L17.533 13.4372C18.0164 13.187 18.5196 12.9782 19.0375 12.8126V12.3031C19.0375 11.0849 20.0286 10.0938 21.2469 10.0938H22.7531C23.9714 10.0938 24.9625 11.0849 24.9625 12.3031V12.8127C25.4804 12.9782 25.9836 13.187 26.467 13.4372L26.8282 13.0761C27.7028 12.2004 29.1039 12.226 29.9531 13.0764L31.0177 14.1409C31.8684 14.9907 31.8929 16.3913 31.0174 17.2659L30.6565 17.6267C30.9067 18.1101 31.1155 18.6132 31.2811 19.1313H31.7906C33.0088 19.1313 34 20.1224 34 21.3406V22.8469C34 24.0651 33.0088 25.0563 31.7906 25.0563H31.2811C31.1155 25.5742 30.9067 26.0774 30.6565 26.5608L31.0177 26.9219C31.8926 27.796 31.8685 29.1967 31.0174 30.0468L29.9527 31.1115C29.1015 31.9638 27.7008 31.9851 26.8278 31.1112L26.467 30.7504C25.9836 31.0005 25.4804 31.2094 24.9625 31.3749V31.8845C24.9625 33.1026 23.9714 34.0938 22.7531 34.0938ZM17.768 29.2736C18.4396 29.6708 19.1624 29.9708 19.9163 30.1654C20.2268 30.2455 20.4438 30.5255 20.4438 30.8462V31.8844C20.4438 32.3272 20.8041 32.6875 21.2469 32.6875H22.7531C23.196 32.6875 23.5563 32.3272 23.5563 31.8844V30.8462C23.5563 30.5255 23.7732 30.2455 24.0837 30.1654C24.8377 29.9708 25.5605 29.6708 26.2321 29.2736C26.5084 29.1102 26.8602 29.1546 27.0872 29.3816L27.8226 30.1171C28.1396 30.4345 28.6488 30.4271 28.9581 30.1174L30.0234 29.0521C30.3319 28.744 30.3422 28.2347 30.0237 27.9166L29.288 27.1809C29.061 26.9539 29.0166 26.602 29.1799 26.3258C29.5771 25.6542 29.8771 24.9314 30.0717 24.1774C30.1518 23.8669 30.4319 23.65 30.7525 23.65H31.7906C32.2335 23.65 32.5938 23.2898 32.5938 22.8469V21.3407C32.5938 20.8978 32.2335 20.5375 31.7906 20.5375H30.7525C30.4318 20.5375 30.1518 20.3206 30.0717 20.0102C29.8771 19.2562 29.5771 18.5334 29.1799 17.8618C29.0166 17.5855 29.061 17.2337 29.288 17.0067L30.0234 16.2713C30.3413 15.9538 30.333 15.4447 30.0237 15.1358L28.9585 14.0705C28.6497 13.7613 28.1404 13.7523 27.8229 14.0703L27.0872 14.806C26.8603 15.033 26.5083 15.0774 26.2321 14.914C25.5605 14.5168 24.8377 14.2168 24.0838 14.0222C23.7733 13.9421 23.5563 13.6621 23.5563 13.3414V12.3031C23.5563 11.8603 23.196 11.5 22.7532 11.5H21.247C20.8041 11.5 20.4438 11.8603 20.4438 12.3031V13.3413C20.4438 13.662 20.2269 13.942 19.9164 14.0221C19.1624 14.2167 18.4396 14.5167 17.768 14.9139C17.4917 15.0773 17.1399 15.0328 16.9129 14.8059L16.1775 14.0704C15.8605 13.753 15.3513 13.7604 15.042 14.0701L13.9767 15.1354C13.6682 15.4435 13.6578 15.9527 13.9764 16.2709L14.7121 17.0066C14.9391 17.2336 14.9835 17.5855 14.8202 17.8617C14.423 18.5333 14.123 19.2561 13.9284 20.0101C13.8482 20.3206 13.5682 20.5375 13.2476 20.5375H12.2094C11.7666 20.5375 11.4062 20.8978 11.4062 21.3406V22.8469C11.4062 23.2897 11.7666 23.65 12.2094 23.65H13.2475C13.5682 23.65 13.8482 23.8669 13.9284 24.1774C14.1229 24.9314 14.423 25.6542 14.8201 26.3257C14.9835 26.602 14.939 26.9538 14.7121 27.1808L13.9766 27.9162C13.6587 28.2338 13.667 28.7428 13.9764 29.0518L15.0416 30.117C15.3504 30.4262 15.8596 30.4353 16.1771 30.1173L16.9128 29.3816C17.08 29.2144 17.428 29.0725 17.768 29.2736Z" fill="#686868"/>
<path d="M22.0002 27.3156C19.1208 27.3156 16.7783 24.973 16.7783 22.0937C16.7783 19.2144 19.1208 16.8718 22.0002 16.8718C24.8796 16.8718 27.2221 19.2144 27.2221 22.0937C27.2221 24.973 24.8796 27.3156 22.0002 27.3156ZM22.0002 18.2781C19.8962 18.2781 18.1846 19.9898 18.1846 22.0937C18.1846 24.1976 19.8963 25.9093 22.0002 25.9093C24.1041 25.9093 25.8158 24.1976 25.8158 22.0937C25.8158 19.9898 24.1042 18.2781 22.0002 18.2781Z" fill="#686868"/>
</g>
<defs>
<clipPath id="clip0_300_4434">
<rect width="24" height="24" fill="white" transform="translate(10 10.0938)"/>
</clipPath>
</defs>
</svg>
