<?xml version="1.0" encoding="iso-8859-1"?>
<!-- Generator: Adobe Illustrator 16.0.0, SVG Export Plug-In . SVG Version: 6.00 Build 0)  -->
<!DOCTYPE svg PUBLIC "-//W3C//DTD SVG 1.1//EN" "http://www.w3.org/Graphics/SVG/1.1/DTD/svg11.dtd">
<svg version="1.1" id="Capa_1" xmlns="http://www.w3.org/2000/svg" xmlns:xlink="http://www.w3.org/1999/xlink" x="0px" y="0px"
	 width="124.512px" height="124.512px" viewBox="0 0 124.512 124.512" style="enable-background:new 0 0 124.512 124.512;"
	 xml:space="preserve">
<g>
	<path fill="#60c2e1" d="M113.956,57.006l-97.4-56.2c-4-2.3-9,0.6-9,5.2v112.5c0,4.6,5,7.5,9,5.2l97.4-56.2
		C117.956,65.105,117.956,59.306,113.956,57.006z"/>
</g>
<g>
</g>
<g>
</g>
<g>
</g>
<g>
</g>
<g>
</g>
<g>
</g>
<g>
</g>
<g>
</g>
<g>
</g>
<g>
</g>
<g>
</g>
<g>
</g>
<g>
</g>
<g>
</g>
<g>
</g>
</svg>
