﻿Model ,Type
ACE-4710-0.5F-K9,Software
ACE-4710-1F-K9,Software
AC-PLS-P-25-S,Software
AIR-AP1852I-BBULK,Access Point
AIR-AP2702I-UXZBLK,Access Point
AIR-CAP1602E-A-K9,Access Point
AIR-CAP2602I-A-K9,Access Point
AIR-CT2504-25-K9,Wireless Controller
AIR-CT2504-25-K9Z,Wireless Controller
AIR-CT2504-5-K9,Wireless Controller
AIR-CT2504-HA-K9,Wireless Controller
AIR-CT2504-K9,Wireless Controller
AIR-CT5508-100-K9,Wireless Controller
AIR-CT5520-50-K9,Wireless Controller
AIR-CT5520-K9,Wireless Controller
AIR-LAP1131AG-A-K9,Access Point
AIR-LAP1131AG-A-K9,Access Point
AIR-LAP1142N-A-K9,Access Point
AIR-WCS-WL-EX-UG,Wireless Controller
AIR-WLC4402-25-K9,Wireless Controller
AnyConnect Apex,Software
AnyConnect Mobile,Software
AnyConnect VPN Phone License,Software
ASA5500X-SSD120=,Firewall
ASA5505-50-BUN-K9,Firewall
ASA5505-BUN-K9,Firewall
ASA5505-SEC-BUN-K9,Firewall
ASA5505-UL-BUN-K9,Firewall
ASA5506-K9,Firewall
ASA5510-AIP10-K9,Firewall
ASA5512-IPS-K9,Firewall
ASA5512-K9,Firewall
ASA5512-SSD120-K9,Firewall
ASA5516-CTRL-LIC,Firewall
ASA5516-SSD,Firewall
ASA5525-FPWR-K9,Firewall
ASA5545-K9,Firewall
ASA5585-S10F10-K9,Firewall
ASA5585-S10-K9,Firewall
ASA5585-S60-2A-K9,Firewall
ASR1001X-2.5G-K9,Router
ASR1001X-2.5G-VPN,Router
ATA186-I1-A=,Analog Adapter
BE6H-M4-K9=,Compute/Storage
BRKT-PHD-MONITOR,Monitor Bracket
C2901-CME-SRST/K9,Router
C2901-VSEC/K9,Router
C2911-CME-SRST/K9,Router
C2911-VSEC/K9,Router
C2911-VSEC-CUBE/K9,Router
C2921-VSEC/K9,Router
C2921-VSEC-CUBE/K9,Router
C2951-VSEC/K9,Router
C881W-A-K9,Router
C891FW-A-K9,Router
C892FSP-K9,Router
CAB-2HDMI-3M,HDMI cable
CAB-HDMI-PHD12XS,HDMI cable
CAB-N5K6A-NA,Power cable
CAB-STACK-50CM,Stacking cable
CCX-10-ADD-K9,Software
CCX-10-N-P-LIC,Software
CCX-10-P-SVR-LIC,Software
CCX-10-QM-LIC,Software
CCX-11-ADD-K9,Software
CCX-11-QM-LIC,Software
CFS-TR1034-E1-8=,Fax Server
CISCO1841-HSEC/K9,Router
CISCO2821,Router
CISCO2901/K9,Router
CISCO871W-G-A-K9,Router
CISCO881W-GN-A-K9,Router
CON-3ECMU-CPW25USR,Software
CON-3SNT-AIRAP28B,Access Point
CON-3SNT-C220M4S,Server
CON-3SNT-HX40XP23,Compute/Storage
CON-3SNT-HXFI48P,Compute/Storage
CON-3SNT-WSC654,Switch
CON-ECDN-CSKITK9,Hardware
CON-ECDN-CSKITPLU,Software
CON-ECDN-CSKITPUR,Software
CON-ECDN-CSMX800D,Software
CON-ECDN-CTLDV10,Software
CON-ECDN-CTSCAM40,Camera
CON-ECDN-CTS-EX90,Video Unit
CON-ECDN-CTSMICG2,Software
CON-ECDN-CTSMICT2,Software
CON-ECDN-CTSMICTB,Software
CON-ECDN-CTSMX20K,Software
CON-ECDN-CTSSX10,Software
CON-ECDN-CTSSX1NK,Software
CON-ECDN-CTSSX860,Software
CON-ECDN-INTP6K,Software
CON-ECDN-MX800S2C,Software
CON-ECDN-SPARKBRD,Software
CON-ECDN-SX2PHD4X,Software
CON-ECMU-ACPL25,Software
CON-ECMU-BE11WXUR,Software
CON-ECMU-BE1U1XCU,Software
CON-ECMU-C1A1381K,Software
CON-ECMU-C1A1382K,Software
CON-ECMU-C1AP3652,Software
CON-ECMU-C1F1C382,Software
CON-ECMU-C1F1PISR,Software
CON-ECMU-C1FC3651,Software
CON-ECMU-C1FC3652,Software
CON-ECMU-C1FPC291,Software
CON-ECMU-C1FPC292,Software
CON-ECMU-C1FPC38S,Software
CON-ECMU-C70EES1,Software
CON-ECMU-CCX11NIL,Software
CON-ECMU-CCX1PISL,Software
CON-ECMU-CCX90PPS,Software
CON-ECMU-CFPASR11,Software
CON-ECMU-CMSRECST,Software
CON-ECMU-CTITMSSW,Software
CON-ECMU-CUAC10XA,Software
CON-ECMU-DEVUWL,Software
CON-ECMU-EMRGNCY,Software
CON-ECMU-ER11USR1,Software
CON-ECMU-ER12USR1,Software
CON-ECMU-IPDEVUWL,Software
CON-ECMU-ISE5VM,Software
CON-ECMU-ISEVM,Software
CON-ECMU-ISRE300,Software
CON-ECMU-ISRW750,Software
CON-ECMU-LASAV5S,Software
CON-ECMU-LASAV5S8,Software
CON-ECMU-LCCX90P1,Software
CON-ECMU-LCS50APS,Software
CON-ECMU-LCSR10M1,Software
CON-ECMU-LCT25A,Software
CON-ECMU-LCTIOS1A,Software
CON-ECMU-LCUAC1ND,Software
CON-ECMU-LIC0ENHA,Software
CON-ECMU-LIC0ESSA,Software
CON-ECMU-LICC1CMS,Software
CON-ECMU-LICCT55A,Software
CON-ECMU-LICCUCHM,Software
CON-ECMU-LICCUMX2,Software
CON-ECMU-LICEXPRM,Software
CON-ECMU-LICMENHA,Software
CON-ECMU-LICMPORT,Software
CON-ECMU-LICMXNPA,Software
CON-ECMU-LICTMS25,Software
CON-ECMU-LICTP1O2,Software
CON-ECMU-LICTP1RO,Software
CON-ECMU-LICTTERK,Software
CON-ECMU-LICUWLPA,Software
CON-ECMU-LICUWLT,Software
CON-ECMU-LICVCS20,Software
CON-ECMU-LICXENHA,Software
CON-ECMU-LIT4BASE,Software
CON-ECMU-LMGMBASE,Software
CON-ECMU-LMGMT32X,Software
CON-ECMU-LMGMT32X,Software
CON-ECMU-LMGMT35N,Software
CON-ECMU-LMGMT3KX,Software
CON-ECMU-LMGMT3XM,Software
CON-ECMU-LMGMTN2K,Software
CON-ECMU-LMGMTOPR,Software
CON-ECMU-LMSEX25,Software
CON-ECMU-LTMS-100,Software
CON-ECMU-LTMS25,Software
CON-ECMU-N7DCNM,Software
CON-ECMU-PCB100AN,Software
CON-ECMU-PCB50AN,Software
CON-ECMU-PCB50MD,Software
CON-ECMU-RCBE6KK,Software
CON-ECMU-RCBE6KK,Software
CON-ECMU-RUCLUCK9,Software
CON-ECMUS-C1F1PISR,Software
CON-ECMUS-ISE5VM,Software
CON-ECMUS-LICCT55A,Software
CON-ECMUS-LICTP1RO,Software
CON-ECMU-SMGM3X2K,Software
CON-ECMU-SMGMT3XI,Software
CON-ECMU-SMGMTXK3,Software
CON-ECMU-SMGMXNK9,Software
CON-ECMU-SMGTBASE,Software
CON-ECMU-SMGTISR2,Software
CON-ECMU-SMGTMXHA,Software
CON-ECMU-SPSERVP9,Software
CON-ECMU-SPSERVP9,Software
CON-ECMU-UCM11STD,Software
CON-ECMU-UCMENHUC,Software
CON-ECMU-UCMESSUC,Software
CON-ECMU-UCMUCBAS,Software
CON-ECMU-UCMUCLTP,Software
CON-ECMU-UCN10XVM,Software
CON-ECMU-UNITCN0S,Software
CON-ECMU-UNITYSTD,Software
CON-ECMU-UWL10XMG,Software
CON-ECMU-UWL10XS0,Software
CON-ECMU-UWL11XPR,Software
CON-ECMU-UWL11XS1,Software
CON-ECMU-UWLST1,Software
CON-ECMU-VCM100,Software
CON-ECMU-VMVCSCTL,Software
CON-ECMU-VMW,Software
CON-ECMU-VMWSW10,Software
CON-ECMU-VWS1300,Software
CON-ELSU-EAMP18SE,Software
CON-ELSU-ELA2C7MI,Software
CON-ELSU-ELA2CLUS,Software
CON-ELSU-ELA2COLG,Software
CON-ELSU-ELOLIBMG,Software
CON-ELSU-ELOLUC17,Software
CON-ISV1-VS5STD1A,Software
CON-ISV1-VSXSTD3A,Software
CON-OSP-3945EV,Software
CON-OSP-C220M5SX,Software
CON-OSP-C240M4XC,Software
CON-OSP-C240M5SX,Software
CON-OSP-C296C8PC,Software
CON-OSP-CT2515,Software
CON-OSP-CT255,Software
CON-OSP-CT5508,Software
CON-OSP-ISR45XK9,Software
CON-OSP-SPINFRAC,Software
CON-OSP-WSC248TS,Software
CON-OSP-WSC3652S,Software
CON-RO4P-MX84-HW,Software
CON-ROBP-MS22548L,Software
CON-SAS-LCPSMM,Software
CON-SAS-LCPSMOW7,Software
CON-SAS-LCPSMV,Software
CON-SAS-LCPSMV,Software
CON-SAU-CUICBASE,Software
CON-SAU-ISEVM,Software
CON-SAU-LCSR10M1,Software
CON-SAU-SVRP9,Software
CON-SAU-VCM,Software
CON-SAU-VCM100,Software
CON-SAU-VMWSW2,Software
CON-SMBS-SL422SEC,Software
CON-SNT-1142NA,Software
CON-SNT-1142NAK,Software
CON-SNT-1X10GEV2,Software
CON-SNT-2248EFA,Software
CON-SNT-2901V,Router
CON-SNT-2901VSEC,Router
CON-SNT-2911,Router
CON-SNT-2911CMST,Router
CON-SNT-2911VSCC,Router
CON-SNT-2911VSEC,Router
CON-SNT-2921,Router
CON-SNT-2921CMST,Router
CON-SNT-2948FPDL,Router
CON-SNT-2951,Router
CON-SNT-2951HSEC,Router
CON-SNT-2960S2PS,Router
CON-SNT-2960S2SS,Router
CON-SNT-2960S4FS,Router
CON-SNT-2960S4TD,Router
CON-SNT-2C6508,Switch
CON-SNT-3560GPS,Switch
CON-SNT-3560X2PS,Switch
CON-SNT-3560X2TS,Switch
CON-SNT-3560X4PS,Switch
CON-SNT-3624PDK9,Switch
CON-SNT-3702IA,Access Point
CON-SNT-3750G48P,Switch
CON-SNT-3750X2PS,Switch
CON-SNT-3750X2TL,Switch
CON-SNT-3750X2TS,Switch
CON-SNT-3750X4FS,Switch
CON-SNT-3750X4PS,Switch
CON-SNT-3750X4TL,Switch
CON-SNT-3750X4TS,Switch
CON-SNT-38048UK9,Switch
CON-SNT-3925,Switch
CON-SNT-3945CMST,Switch
CON-SNT-3945SEC,Switch
CON-SNT-4510RES7,Switch
CON-SNT-7706B23,Switch
CON-SNT-881WGAK,Router
CON-SNT-93180YCX,Switch
CON-SNT-9372PXBN,Switch
CON-SNT-9372PXE,Switch
CON-SNT-9372TXBN,Switch
CON-SNT-A15FPK9,Software
CON-SNT-A15SDK9,Software
CON-SNT-A25K9,Router
CON-SNT-A45FPK9,Router
CON-SNT-A45K9,Router
CON-SNT-A85S2K9,Router
CON-SNT-AIR25K9Z,Wireless Controller
CON-SNT-AIR4PBK9,Hardware
CON-SNT-AIRAP38E,Router
CON-SNT-AIRAPC1B,Router
CON-SNT-AIRAPIKB,Hardware
CON-SNT-AIRAPUXZ,Hardware
CON-SNT-AIRBAP15,Hardware
CON-SNT-AIRCAPN2,Hardware
CON-SNT-AIRCIAK9,Hardware
CON-SNT-AIRCP3IB,Access Point
CON-SNT-AIRCT25A,Hardware
CON-SNT-AIRPIBK9,Hardware
CON-SNT-AIRSAI2B,Hardware
CON-SNT-AP2702IC,Hardware
CON-SNT-AS1BUNK9,Hardware
CON-SNT-AS1SBK9,Hardware
CON-SNT-AS2BUNK9,Hardware
CON-SNT-ASA5506K,Firewall
CON-SNT-ASA5508K,Firewall
CON-SNT-ASA550K9,Firewall
CON-SNT-ASA556F9,Firewall
CON-SNT-ASA5K16F,Firewall
CON-SNT-ASR1001X,Firewall
CON-SNT-ATA190,Router
CON-SNT-B6SPRIM2,Compute/Storage
CON-SNT-BE6HM4K9,Compute/Storage
CON-SNT-BE6KSTBD,Compute/Storage
CON-SNT-BE6M4M4K,Compute/Storage
CON-SNT-BE7MM4K9,Compute/Storage
CON-SNT-C14431K9,Hardware
CON-SNT-C1602IA,Hardware
CON-SNT-C1WSC385,Hardware
CON-SNT-C1WSC38L,Hardware
CON-SNT-C2010SEC,Hardware
CON-SNT-C220M3SF,Hardware
CON-SNT-C220M4S,Hardware
CON-SNT-C220M5S2,Hardware
CON-SNT-C2520TC,Hardware
CON-SNT-C296012P,Hardware
CON-SNT-C29602PC,Hardware
CON-SNT-C375X12E,Switch
CON-SNT-C375X12S,Switch
CON-SNT-C375X24S,Switch
CON-SNT-C4506E,Switch
CON-SNT-C48S,Hardware
CON-SNT-C48UBS32,Hardware
CON-SNT-C5548P,Hardware
CON-SNT-C5548UP,Hardware
CON-SNT-C819H4GV,Hardware
CON-SNT-C881VK8,Router
CON-SNT-C881WAK9,Router
CON-SNT-C891FWAB,Router
CON-SNT-C891FWBB,Router
CON-SNT-C9124A,Hardware
CON-SNT-C93002PE,Switch
CON-SNT-C93002TE,Switch
CON-SNT-C93004PE,Switch
CON-SNT-CAP352IA,Access Point
CON-SNT-CBS313GF,Hardware
CON-SNT-CP7821K9,Phone
CON-SNT-CP83BASE,Hardware
CON-SNT-CP8831K9,Phone
CON-SNT-CP8841K9,Phone
CON-SNT-CP8851K9,Phone
CON-SNT-CP8851K9,Phone
CON-SNT-CP8865KP,Phone
CON-SNT-CP88K9BN,Phone
CON-SNT-CPBEKEM,Hardware
CON-SNT-CPDX70WK,Hardware
CON-SNT-CPDX80KG,Hardware
CON-SNT-CPSHD4TK,Hardware
CON-SNT-CPSM2AIG,Hardware
CON-SNT-CPSS1UK9,Hardware
CON-SNT-CSDX80KS,Hardware
CON-SNT-CT08100,Hardware
CON-SNT-CT0812,Hardware
CON-SNT-CT2504HA,Hardware
CON-SNT-CT2515,Hardware
CON-SNT-CT2525,Hardware
CON-SNT-CT255,Hardware
CON-SNT-CT5508,Hardware
CON-SNT-CT5508HA,Hardware
CON-SNT-CTLDH10,Hardware
CON-SNT-CTS-MICC,Hardware
CON-SNT-CTSSX1NK,Hardware
CON-SNT-CTSSX2N0,Hardware
CON-SNT-CTSX2NK9,Hardware
CON-SNT-CUBE100R,Hardware
CON-SNT-ENSCB20Z,Hardware
CON-SNT-EZ7B20VP,Hardware
CON-SNT-FLSA11XM,Hardware
CON-SNT-FLSABGEX,Hardware
CON-SNT-GWK9,Hardware
CON-SNT-IR829GWL,Hardware
CON-SNT-IR82VZAK,Hardware
CON-SNT-ISR4321K,Router
CON-SNT-ISR4321S,Router
CON-SNT-ISR4321XV,Router
CON-SNT-ISR4331AX,Router
CON-SNT-ISR4331K,Router
CON-SNT-ISR4331S,Router
CON-SNT-ISR4331V,Router
CON-SNT-ISR4331XV,Router
CON-SNT-ISR4331XV,Router
CON-SNT-ISR4351AX,Router
CON-SNT-ISR4431V,Router
CON-SNT-ISR44SEC,Router
CON-SNT-ISR45XK9,Router
CON-SNT-IW3702BK,Hardware
CON-SNT-LAP1141A,Hardware
CON-SNT-LCT255A,Hardware
CON-SNT-LCT25UP,Hardware
CON-SNT-LFLA1BGE,Hardware
CON-SNT-LICCM157,Hardware
CON-SNT-N2248F,Switch
CON-SNT-N2248T,Switch
CON-SNT-N9348F,Switch
CON-SNT-N9KC921U,Switch
CON-SNTP-1142NA,Hardware
CON-SNTP-2232B,Hardware
CON-SNTP-2248B,Hardware
CON-SNTP-2348PQFA,Hardware
CON-SNTP-2901,Router
CON-SNTP-2901CMST,Router
CON-SNTP-2901V,Router
CON-SNTP-2911,Router
CON-SNTP-2911CMST,Router
CON-SNTP-2911V,Router
CON-SNTP-2911VSEC,Router
CON-SNTP-2921,Router
CON-SNTP-2921CMST,Router
CON-SNTP-2921HSEC,Router
CON-SNTP-2921SEC,Router
CON-SNTP-2948FPSL,Router
CON-SNTP-2951CMST,Router
CON-SNTP-2951SEC,Router
CON-SNTP-2960S2PS,Router
CON-SNTP-2960S2TS,Router
CON-SNTP-2960S4FS,Router
CON-SNTP-3524P10X,Switch
CON-SNTP-3750X2PL,Switch
CON-SNTP-3750X4TS,Switch
CON-SNTP-4510RES7,Switch
CON-SNTP-64TBAL3,Hardware
CON-SNTP-7009B2P13,Hardware
CON-SNTP-93180YCX,Hardware
CON-SNTP-A1001XK9,Hardware
CON-SNTP-A12SDK8,Hardware
CON-SNTP-A25FPK9,Hardware
CON-SNTP-A45K9,Hardware
CON-SNTP-AIRCAPN2,Hardware
CON-SNTP-APICAPL9,Access Point
CON-SNTP-AS2BUNK9,Hardware
CON-SNTP-ASA5506K,Firewall
CON-SNTP-ASA5508K,Firewall
CON-SNTP-ASA550K9,Firewall
CON-SNTP-ASA556F9,Firewall
CON-SNTP-ASASFC1,Firewall
CON-SNTP-ASD120,Hardware
CON-SNTP-ASD5508F,Hardware
CON-SNTP-ASR1002,Hardware
CON-SNTP-BE6M4M4K,Hardware
CON-SNTP-C14451K9,Hardware
CON-SNTP-C148UQK9,Hardware
CON-SNTP-C148URK9,Hardware
CON-SNTP-C1602IE,Hardware
CON-SNTP-C1WS3650,Hardware
CON-SNTP-C220M3SF,Hardware
CON-SNTP-C2348UPQ,Hardware
CON-SNTP-C240M3SF,Hardware
CON-SNTP-C240M5SX,Hardware
CON-SNTP-C29608C,Hardware
CON-SNTP-C4510R+E,Hardware
CON-SNTP-C48UBS32,Hardware
CON-SNTP-C5624Q,Hardware
CON-SNTP-C701BN,Hardware
CON-SNTP-C701PB,Hardware
CON-SNTP-C891F8BB,Router
CON-SNTP-C93002TA,Switch
CON-SNTP-C93002TE,Switch
CON-SNTP-C93004PE,Switch
CON-SNTP-C93E048X,Switch
CON-SNTP-C9410R,Switch
CON-SNTP-C9500XQA,Switch
CON-SNTP-CSCGPUP4,Hardware
CON-SNTP-CT0825,Hardware
CON-SNTP-CT2515,Hardware
CON-SNTP-CT255,Hardware
CON-SNTP-CWS48FK9,Hardware
CON-SNTP-FI6248BS,Hardware
CON-SNTP-FIE16UP,Hardware
CON-SNTP-FLSA11XS,Hardware
CON-SNTP-FLSABGEX,Hardware
CON-SNTP-ISR4221K,Hardware
CON-SNTP-ISR4321XV,Router
CON-SNTP-ISR4331V,Router
CON-SNTP-ISR4451-X,Router
CON-SNTP-N2224P1G,Switch
CON-SNTP-N9508B3,Switch
CON-SNTP-SNS3515K,Hardware
CON-SNTP-SP6508A2,Hardware
CON-SNTP-SP6C220P,Hardware
CON-SNTP-SPRM5EP1,Hardware
CON-SNTP-SPVPB200,Hardware
CON-SNTP-SRB2M4VP,Hardware
CON-SNTP-SRC220P1,Hardware
CON-SNTP-VG310ICV,Hardware
CON-SNTP-WC3654PS,Hardware
CON-SNTP-WSC224SL,Hardware
CON-SNTP-WSC28PCL,Hardware
CON-SNTP-WSC28TCL,Hardware
CON-SNTP-WSC294SL,Hardware
CON-SNTP-WSC3652DE,Hardware
CON-SNTP-WSC3652S,Switch
CON-SNTP-WSC3654T,Switch
CON-SNTP-WSC384PE,Switch
CON-SNTP-WS-C384PS,Switch
CON-SNTP-WSC388FE,Hardware
CON-SNTP-WSC38TCS,Hardware
CON-SNTP-WSC654,Hardware
CON-SNT-RPS2300,Hardware
CON-SNT-RW489NA2,Hardware
CON-SNT-S5ENTSB2,Hardware
CON-SNT-SG3021NA,Hardware
CON-SNT-SG3022NA,Hardware
CON-SNT-SL6508A2,Hardware
CON-SNT-SLASR1IK,Hardware
CON-SNT-SMB200A3,Hardware
CON-SNT-SNS3415,Hardware
CON-SNT-SNS3515K,Hardware
CON-SNT-SP3S624X,Hardware
CON-SNT-SP7B200E,Hardware
CON-SNT-SP7B200V,Hardware
CON-SNT-SP7F6248,Hardware
CON-SNT-SPINFRAC,Hardware
CON-SNT-SPINFRAF,Hardware
CON-SNT-SPLB24A3,Hardware
CON-SNT-SRW089NA,Hardware
CON-SNT-UCB200M3,Hardware
CON-SNT-VG204XM,Hardware
CON-SNT-VG310ICV,Hardware
CON-SNT-WC3654PS,Hardware
CON-SNT-WS3548US,Hardware
CON-SNT-WS365048,Switch
CON-SNT-WS5048FS,Hardware
CON-SNT-WS6524SS,Hardware
CON-SNT-WSC224SL,Hardware
CON-SNT-WSC248TS,Hardware
CON-SNT-WSC28PCL,Hardware
CON-SNT-WSC28TCL,Hardware
CON-SNT-WSC294SL,Hardware
CON-SNT-WSC2964P,Hardware
CON-SNT-WSC296TW,Hardware
CON-SNT-WSC296XT,Hardware
CON-SNT-WSC312PC,Hardware
CON-SNT-WSC312PD,Hardware
CON-SNT-WSC3560C,Hardware
CON-SNT-WSC3568,Hardware
CON-SNT-WSC360C1,Hardware
CON-SNT-WSC364DL,Hardware
CON-SNT-WSC3652DE,Hardware
CON-SNT-WSC3652S,Hardware
CON-SNT-WSC3652TS,Hardware
CON-SNT-WSC365PDS,Hardware
CON-SNT-WSC365QE,Hardware
CON-SNT-WSC365SL,Hardware
CON-SNT-WSC36PQS,Hardware
CON-SNT-WSC36PSS,Hardware
CON-SNT-WS-C384PS,Hardware
CON-SNT-WSC384TE,Hardware
CON-SNT-WSC384TS,Hardware
CON-SNT-WSC3851S,Hardware
CON-SNT-WSC3852X,Hardware
CON-SNT-WSC388FS,Hardware
CON-SNT-WSC388PS,Hardware
CON-SNT-WSC388TS,Hardware
CON-SNT-WSC38PCS,Hardware
CON-SNT-WS-C451R,Hardware
CON-SNT-WS-C4948,Hardware
CON-SNT-WSC4948S,Hardware
CON-SNT-WSC604DL,Hardware
CON-SNT-WS-C6506,Switch
CON-SNT-WS-C6509,Switch
CON-SNT-WSC654,Hardware
CON-SNT-WSCX3852,Hardware
CON-SNT-XFP10GLL,Hardware
CON-SSSNP-C1S451K9,Hardware
CON-SSSNP-ISR4331K,Router
CON-SSSNP-ISR4331S,Router
CON-SSSNP-ISR4331V,Router
CON-SSSNP-ISR4351K,Router
CON-SSSNP-ISR45XK9,Router
CON-SSSNP-WSC365DE,Hardware
CON-SSSNT-ASA5508K,Firewall
CON-SSSNT-ASR102HX,Router
CON-SSSNT-C891FWAB,Router
CON-SSSNT-C93002TE,Switch
CON-SSSNT-C930048E,Switch
CON-SSSNT-C93004PA,Switch
CON-SSSNT-C93004PE,Switch
CON-SSSNT-C93004TA,Switch
CON-SSSNT-C95004XA,Switch
CON-SSSNT-C9500XQA,Switch
CON-SSSNT-CSKITK9,Hardware
CON-SSSNT-CSKITMSR,Hardware
CON-SSSNT-CSKITPLU,Hardware
CON-SSSNT-CTSCAM60,Camera
CON-SSSNT-CTSMICG2,Microphone
CON-SSSNT-CTSMICT2,Microphone
CON-SSSNT-CTSMICTB,Microphone
CON-SSSNT-CTSMX300,Video Unit
CON-SSSNT-CTSSX8I9,Hardware
CON-SSSNT-FLCUBE25,Hardware
CON-SSSNT-ISR44SEC,Router
CON-SSSNT-ISX451-X,Hardware
CON-SSSNT-LCTUPG,Hardware
CON-SSSNT-SLASR1AK,Hardware
CON-SSSNT-SPARKBD7,Hardware
CON-SSSNT-SX2PHD12,Hardware
CON-SSSNT-SX80IP60,Hardware
CON-SSSNT-WSC365DE,Hardware
CON-SSSNT-WSC365DE,Hardware
CON-SSSNT-WSC365ML,Hardware
CON-SU1-A25IPS9,Hardware
CON-SU1-AS2A20K9,Hardware
CON-SU1-ASIP10K9,Hardware
CON-SU1-ISR45XK9,Hardware
CON-UCW5-B200M5A2,Hardware
CON-UCW5-SPINFRAF,Hardware
CON-UCW7-B200BA1,Hardware
CON-UCW7-B200BF3,Hardware
CON-UCW7-B200M4UC,Hardware
CON-UCW7-B200M5A2,Hardware
CON-UCW7-C220BS1,Hardware
CON-UCW7-SPRCM5S2,Hardware
CP-7841-K9=,Hardware
CP-7921G-A-K9=,Telephone
CP-7925G-A-K9=,Telephone
CP-7937G=,Telephone
CP-7962G=,Telephone
CP-8831-BASE-S,Telephone
CP-8831-K9=,Telephone
CP-8841-K9=,Telephone
CP-9951-C-CAM-K9=,Telephone
CP-DSKCH-7925G-BUN,Hardware
CTI-VMVCS-CTRL-K9,Hardware
CTS-CTRL-DVX-10,Hardware
CTS-MIC-TABL20,Microphone
CTS-PHD1080P12XS2+,Hardware
CTS-QSC20-MIC,Hardware
CTS-RMT-TRC5,Hardware
CTS-SX10-K9,Video Unit
CTS-SX10N-K9,Video Unit
CTS-SX20CODEC-K9,Video Unit
CTS-SX20-PHD12X-K9,Video Unit
CTS-SX80-IP60-K9,Video Unit
CUIC-SP-PHY-SVR,Hardware
CUVA-V2=,Hardware
DS-C9148-16P-K9,Hardware
ER10-USR-1,Hardware
FLSA1-BIN-1X10GE,Hardware
FLSASR1-FWNAT-R,Hardware
FLSASR1-IPSEC,Hardware
FS-VMW-10-SW-K9,Hardware
FS-VMW-SW-K9,Hardware
ISE-APX-3YR-500,Hardware
ISE-PLS-3YR-500,Hardware
ISM-SRE-300-K9,Hardware
ISR4321/K9,Router
ISR4321-SEC/K9,Router
ISR4321-V/K9,Router
ISR4321-VSEC/K9,Router
ISR4331/K9,Router
ISR4331-SEC/K9,Router
ISR4331-V/K9,Router
ISR4331-VSEC/K9,Router
ISR4431-SEC/K9,Router
ISR4431-V/K9,Router
ISR4451-X-V/K9,Router
L-AC-PLS-1Y-S2,Hardware
L-AC-PLS-P-25,Hardware
L-AC-PLS-P-25,Hardware
L-AC-PLS-P-G,Hardware
L-ASA5508-TAMC-1Y,Firewall
L-ASA5508-TAMC-PR=,Firewall
L-ASA5516-TAMC-1Y,Firewall
L-ASA5516-TAMC-PR=,Firewall
L-CUCM-USR-LIC-ADD,Hardware
L-CUWL-ADDON-STDK9,Hardware
L-CUWL-ADD-PRO-K9,Hardware
LIC-CT5508-25A,Licensing
LIC-CT5520-1A,Licensing
LIC-CT5520-50A,Licensing
LIC-CT5520-UPG,Licensing
LIC-CTIOS-1A,Licensing
LIC-CUCM-10X-ENH-A,Licensing
LIC-CUCM-11X-ENH-A,Licensing
LIC-CUCM-USR-A,Licensing
LIC-EXP-RMS,Licensing
LIC-S52010-TC-K9,Licensing
LIC-SX20,Licensing
LIC-SX20-DD,Licensing
LIC-SX20-HD,Licensing
LIC-SX20-NPP,Licensing
LIC-SX20-PR,Licensing
LIC-TMS-100,Licensing
LIC-TMS-25,Licensing
LIC-TP-10X-ROOM,Licensing
LIC-UWL-STD-A,Licensing
LIC-VCS-20,Licensing
L-ISE-APX-S-100=,Licensing
L-ISE-MU-S-100=,Licensing
L-ISE-PLS-S-100=,Licensing
L-LIC-CT5508-UPG,Licensing
L-LIC-CT5760-UPG,Licensing
L-LIC-CTIOS-1A,Licensing
L-LIC-UWL-PRO-A,Licensing
L-LIC-UWL-STD1K,Licensing
L-MGMT3X-2K-K9,Licensing
L-MGMT3X-3K-K9,Licensing
L-MGMT3X-AP-K9,Licensing
L-MGMT3X-ISR2-K9,Licensing
L-MGMT3X-N5K-K9,Licensing
L-MGMT3X-PI-BASE,Licensing
L-N1K-VLCPU-16=,Licensing
L-PC-B-100-MD-LIC,Licensing
L-PC-B-50-MID-LIC,Licensing
L-PC-B-AN-100-LIC,Licensing
L-PC-B-AN-50-LIC,Licensing
L-PC-B-PAAN,Licensing
L-SLASR1-AES=,Licensing
MCS-7816-I3-IPC1,Hardware
MCS-7825-H3-IPC1,Hardware
MCS7835H2-K9-CMB2D,Hardware
N1K-VLCPU-01,Hardware
N20-BBLKD,Hardware
N20-C6508-UPG,Hardware
N2224TP-FA-BUN,Switch
N2248TP-E-FA-BUN,Switch
N2K-C2224TF,Switch
N2K-C2224TP-1GE,Switch
N2K-C2248TP-E,Switch
N2K-C2348UPQ,Switch
N2K-C2348UPQ4F,Switch
N3524-LAN1K9,Switch
N3K-C3524P-10G,Switch
N3K-C3524P-10GX,Switch
N3K-C3524P-10GX,Switch
N5K-C5548UP-B-S32,Switch
N5K-C5548UP-FA,Switch
N5K-C56128P,Switch
N5K-C56128P,Switch
N5K-C5624Q,Switch
N5K-C5672UP,Switch
N77-C7710-B26S2E-R,Switch
N7K-C7010=,Switch
N7K-C7010-BUN,Switch
N93-LIC-PAK,Switch
N9K-C9372PX,Switch
N9K-C9372PX-E,Switch
N9K-C9372PX-E-B18Q,Switch
N9K-C9372PX-E-BUN,Switch
N9K-C9372TX-BUN,Switch
N9K-C9396PX-BUN,Switch
R-CBE6K-K9,Hardware
R-CUWL-STD-K9,Hardware
R-EMRGNCY-RSPNDR,Hardware
R-MGMT3X-N-K9,Hardware
R-PC-10.6-ASSW-K9=,Hardware
R-PC-10.6-PRSW-K9=,Hardware
R-PI30-SW-K9,Hardware
R-VMTCS-PRO10P-K9,Hardware
SF-ASA-FP5.4.1-K9,Software
SF-ASA-K-9.5-K8,Software
SLASR1-AES,Hardware
SNS-3415-K9,Hardware
SW-S52010-TC7-K9,Hardware
UCM-10X-UWLSTD,Hardware
UCM-11X-BAS-UCL,Hardware
UCM-11X-ENH-UCL,Hardware
UCM-11X-UWLSTD,Hardware
UCN-11X-VM-UCL,Hardware
UCSB-5108-AC2-UPG,Hardware
UCSB-B200-M4,Hardware
UCSC-DBUN-C220-110,Hardware
UCSC-HS-C220M3,Hardware
UCSC-PCIF-01F,Hardware
UCSC-PSU-650W,Hardware
UCS-CPU-E5-2650,Hardware
UCSC-RAIL1,Hardware
UCSC-SD-16G-C220,Hardware
UCS-CTR-LIC,Hardware
UCS-EZ8-B200M4-PP,Hardware
UCS-EZ8-C220M4-EP,Hardware
UCS-EZ-ENVP-B200M3,Hardware
UCS-FI-6248E16-28P,Hardware
UCS-FI-E16UP=,Hardware
UCS-FI-M-6324,Hardware
UCS-MR-1X082RY-A,Hardware
UCS-RAID-9266CV,Hardware
UCS-SP-5108-AC2,Hardware
UCS-SP6-C220P,Hardware
UCS-SP8-B-FI48,Hardware
UCS-SP-B200M4-C2T,Hardware
UCS-SP-ENVP-B200M3,Hardware
UCS-SP-FI48P,Hardware
UCS-SP-INFRA-CHSS,Hardware
UCS-SP-INFRA-FI,Hardware
UCS-SPL-5108-AC2,Hardware
UCS-SPL-B200M4-S1,Hardware
UCS-SPL-MINI,Hardware
UCS-SPR-C240-P1,Hardware
UCS-SR-B200M4-VP,Hardware
UWL-11X-STD,Hardware
VCS-C-GWBDL,Hardware
VG224,Router
VG224-MP,Router
VG310,Router
VG320,Router
VMW-VS5-HYP-USEL,Hardware
VMW-VS5-STD-5A,Hardware
WAAS-ENT-APL,Hardware
WCS-STANDARD-K9,Hardware
WS-C2940-8TT-S,Router
WS-C2960-24PC-L,Router
WS-C2960-24TC-L,Router
WS-C2960-48PST-L,Router
WS-C2960S-24PS-L,Router
WS-C2960X-24TD-L,Router
WS-C2960X-24TS-L,Router
WS-C2960X-48FPD-L,Router
WS-C2960X-48FPS-L,Router
WS-C2960X-48TD-L,Router
WS-C2960XR-24PS-I,Router
WS-C3560CX-12PD-S,Switch
WS-C3560CX-12PD-S,Switch
WS-C3560CX-8PC-S,Switch
WS-C3560G-24PS-S,Switch
WS-C3560G-24TS-S,Switch
WS-C3560X-24P-S,Switch
WS-C3650-24PD-E,Switch
WS-C3650-24PS-E,Switch
WS-C3650-48FD-E,Switch
WS-C3750-24PS-S,Switch
WS-C3750G-12S-E,Switch
WS-C3750G-24PS-S,Switch
WS-C3750X-24P-S,Switch
WS-C3750X-48P-L,Switch
WS-C3850-24P-E,Switch
WS-C3850-24P-S,Switch
WS-C3850-24PW-S,Switch
WS-C3850-24T-S,Switch
"WS-C3850-24XS-E	",Switch
WS-C3850-48F-E,Switch
WS-C3850-48F-L,Switch
WS-C3850-48F-S,Switch
WS-C3850-48P-E,Switch
WS-C3850-48PW-S,Switch
WS-C4510RE-S7+96V+,Switch
WS-C6509-E,Switch
