{
  "group_id": {
    "disabled": "false",
    "label": "Device Group",
    "value": "",
    "is_required": "true",
    "type": "PICKLIST",
    "options": []
  },
  "system_categories": {
    "disabled": "false",
    "label": "System Categories",
    "value": "",
    "is_required": "true",
    "type": "CHECKBOXES",
    "options": []
  }
}
