{
  "project_outcome": {
    "section_label": "Project Outcome",
    "ordering": 1,
    "default_hidden": false,
    "visible_in": ["Fixed Fee"],
    "project_outcome": {
      "section_label": "Project Outcome Section",
      "ordering": 1,
      "label": "Project Outcome",
      "value": "",
      "type": "MARKDOWN",
      "input_type": "STRING",
      "is_required": "true",
      "is_label_editable": "true"
    }
  },
  "project_details": {
    "section_label": "Project Details",
    "ordering": 2,
    "default_hidden": false,
    "visible_in": ["Fixed Fee", "T & M"],
    "request_description": {
      "section_label": "Request Description Section",
      "ordering": 1,
      "label": "Request Description",
      "value": "",
      "type": "TEXTBOX",
      "input_type": "STRING",
      "is_label_editable": "false"
    },
    "task_deliverables": {
      "section_label": "Task Deliverables Section",
      "ordering": 2,
      "label": "Task Deliverables",
      "value": "",
      "type": "MARKDOWN",
      "input_type": "STRING",
      "is_required": "true",
      "is_label_editable": "true"
    },
    "project_assumptions": {
      "section_label": "Project Assumptions Section",
      "ordering": 3,
      "label": "Project Assumptions",
      "value": "",
      "type": "MARKDOWN",
      "input_type": "STRING",
      "is_required": "true",
      "is_label_editable": "true"
    },
    "out_of_scope": {
      "section_label": "Out of Scope Section",
      "ordering": 4,
      "label": "Out of Scope",
      "value": "",
      "type": "MARKDOWN",
      "input_type": "STRING",
      "is_required": "true",
      "is_label_editable": "true"
    }
  },
  "implementation_logistics": {
    "section_label": "Implementation Logistics",
    "ordering": 3,
    "visible_in": [
      "Fixed Fee",
      "T & M"
    ],
    "default_hidden": false,
    "sections": [
      {
        "column1": {
          "ordering": 1,
          "label": "Column 1 Name",
          "value": "Design",
          "type": "TEXTBOX",
          "input_type": "STRING",
          "is_required": "true",
          "is_label_editable": "false",
          "position": "LEFT"
        },
        "delivery_model": {
          "section_label": "Delivery Mode Section",
          "ordering": 2,
          "label": "Delivery Mode",
          "value": "",
          "type": "RADIOBOX",
          "input_type": "STRING",
          "is_required": "true",
          "options": [
            "Onsite",
            "Remote"
          ],
          "is_label_editable": "false",
          "position": "LEFT"
        },
        "detail": {
          "section_label": "Detail's Section",
          "ordering": 3,
          "label": "Detail",
          "value": "",
          "type": "TEXTAREA",
          "input_type": "STRING",
          "is_required": "true",
          "is_label_editable": "false",
          "position": "RIGHT"
        }
      },
      {
        "delivery_model": {
          "section_label": "Delivery Mode Section",
          "ordering": 2,
          "label": "Delivery Mode",
          "value": "",
          "type": "RADIOBOX",
          "input_type": "STRING",
          "is_required": "true",
          "options": [
            "Onsite",
            "Remote"
          ],
          "is_label_editable": "false",
          "position": "LEFT"
        },
        "detail": {
          "section_label": "Detail's Section",
          "ordering": 3,
          "label": "Detail",
          "value": "",
          "type": "TEXTAREA",
          "input_type": "STRING",
          "is_required": "true",
          "is_label_editable": "false",
          "position": "RIGHT"
        },
        "column2": {
          "ordering": 1,
          "label": "Column 2 Name",
          "value": "Design",
          "type": "TEXTBOX",
          "input_type": "STRING",
          "is_required": "true",
          "is_label_editable": "false",
          "position": "LEFT"
        }
      },
      {
        "delivery_model": {
          "section_label": "Delivery Mode Section",
          "ordering": 2,
          "label": "Delivery Mode",
          "value": "",
          "type": "RADIOBOX",
          "input_type": "STRING",
          "is_required": "true",
          "options": [
            "Onsite",
            "Remote"
          ],
          "is_label_editable": "false",
          "position": "LEFT"
        },
        "detail": {
          "section_label": "Detail's Section",
          "ordering": 3,
          "label": "Detail",
          "value": "",
          "type": "TEXTAREA",
          "input_type": "STRING",
          "is_required": "true",
          "is_label_editable": "false",
          "position": "RIGHT"
        },
        "column3": {
          "ordering": 1,
          "label": "Column 3 Name",
          "value": "Design",
          "type": "TEXTBOX",
          "input_type": "STRING",
          "is_required": "true",
          "is_label_editable": "false",
          "position": "LEFT"
        }
      },
      {
        "delivery_model": {
          "section_label": "Delivery Mode Section",
          "ordering": 2,
          "label": "Delivery Mode",
          "value": "",
          "type": "RADIOBOX",
          "input_type": "STRING",
          "is_required": "true",
          "options": [
            "Onsite",
            "Remote"
          ],
          "is_label_editable": "false",
          "position": "LEFT"
        },
        "detail": {
          "section_label": "Detail's Section",
          "ordering": 3,
          "label": "Detail",
          "value": "",
          "type": "TEXTAREA",
          "input_type": "STRING",
          "is_required": "true",
          "is_label_editable": "false",
          "position": "RIGHT"
        },
        "column4": {
          "ordering": 1,
          "label": "Column 4 Name",
          "value": "Design",
          "type": "TEXTBOX",
          "input_type": "STRING",
          "is_required": "true",
          "is_label_editable": "false",
          "position": "LEFT"
        }
      }
    ],
    "hide_in_sow": false
  },
  "project_management_fixed_fee": {
    "section_label": "Project Management Fixed Fee",
    "ordering": 4,
    "default_hidden": true,
    "visible_in": ["Fixed Fee"],
    "project_management": {
      "section_label": "Project Management Section",
      "ordering": 4,
      "label": "Project Management",
      "value": "",
      "type": "MARKDOWN",
      "input_type": "STRING",
      "is_required": "true",
      "is_label_editable": "true",
      "reset": true
    }
  },
  "project_management_t_and_m": {
    "section_label": "Project Management T & M",
    "ordering": 5,
    "default_hidden": true,
    "visible_in": ["T & M"],
    "project_management": {
      "section_label": "Project Management Section",
      "ordering": 5,
      "label": "Project Management",
      "value": "",
      "type": "MARKDOWN",
      "input_type": "STRING",
      "is_required": "true",
      "is_label_editable": "true",
      "reset": true
    }
  },
  "terms_fixed_fee": {
    "section_label": "Terms Fixed Fee",
    "ordering": 6,
    "default_hidden": true,
    "visible_in": ["Fixed Fee"],
    "terms": {
      "section_label": "Terms Section",
      "ordering": 6,
      "label": "Terms",
      "value": "",
      "type": "MARKDOWN",
      "input_type": "STRING",
      "is_required": "true",
      "is_label_editable": "true",
      "reset": true
    }
  },
  "terms_t_and_m": {
    "section_label": "Terms T & M",
    "ordering": 7,
    "default_hidden": true,
    "visible_in": ["T & M"],
    "terms": {
      "section_label": "Terms Section",
      "ordering": 7,
      "label": "Terms",
      "value": "",
      "type": "MARKDOWN",
      "input_type": "STRING",
      "is_required": "true",
      "is_label_editable": "true",
      "reset": true
    }
  },
  "service_cost": {
    "static_fields": true,
    "engineering_hours_breakup": {
      "phases": [
        {
          "name": "Planning and Design",
          "hours": 0,
          "override": false,
          "after_hours": false,
          "default": true
        },
        {
          "name": "Configuration",
          "hours": 0,
          "override": false,
          "after_hours": false,
          "default": true
        },
        {
          "name": "Cutover or Activation",
          "hours": 0,
          "override": false,
          "after_hours": false,
          "default": true
        },
        {
          "name": "Day One Support",
          "hours": 0,
          "override": false,
          "after_hours": false,
          "default": true
        }
      ],
      "total_sites": 1,
      "total_sites_override": false,
      "total_cutovers": 1,
      "total_cutovers_override": false
    },
    "engineering_hours": 0,
    "engineering_hours_override": false,
    "engineering_hourly_rate": 0,
    "hide_engineering_hours": false,
    "after_hours": 0,
    "after_hours_override": false,
    "after_hours_rate": 0,
    "hide_after_hours": false,
    "project_management_hours": 0,
    "project_management_hours_override": false,
    "project_management_hourly_rate": 0,
    "hide_project_management_hours": false,
    "integration_technician_hours": 0,
    "integration_technician_hours_override": false,
    "integration_technician_hourly_rate": 0,
    "hide_integration_technician_hours": false,
    "contractors": [
      {
        "name": "",
        "vendor_id": null,
        "partner_cost": 0,
        "margin_percentage": 0,
        "customer_cost": 0,
        "type": "Service"
      }
    ],
    "travels": [
      {
        "description": "",
        "cost": 0
      }
    ],
    "hourly_resources": [],
    "notes": "",
    "customer_cost_fixed_fee": 0,
    "internal_cost_fixed_fee": 0,
    "customer_cost_t_and_m_fee": 0,
    "internal_cost_t_and_m_fee": 0
  }
}