<svg width="44" height="42" viewBox="0 0 44 42" fill="none" xmlns="http://www.w3.org/2000/svg">
<path d="M10.7032 28.2813H14.2188V30.3906C14.2188 30.779 14.5336 31.0938 14.9219 31.0938H33.2969C33.6852 31.0938 34 30.779 34 30.3906V12.1094C34 11.7211 33.6852 11.4063 33.2969 11.4063H29.7813V10.7032C29.7813 10.3149 29.4665 10.0001 29.0781 10.0001C28.6898 10.0001 28.375 10.3149 28.375 10.7032V11.4063H24.8125V10.7032C24.8125 10.3149 24.4977 10.0001 24.1094 10.0001C23.7211 10.0001 23.4063 10.3149 23.4063 10.7032V11.4063H19.8907V10.7032C19.8907 10.3149 19.5759 10.0001 19.1875 10.0001C18.7992 10.0001 18.4844 10.3149 18.4844 10.7032V11.4063H14.9219C14.5336 11.4063 14.2188 11.7211 14.2188 12.1094V16.3282C14.2188 21.5102 12.0651 25.4967 10.253 27.038C10.0256 27.2275 9.94128 27.5392 10.042 27.8175C10.1428 28.0959 10.4071 28.2813 10.7032 28.2813V28.2813ZM32.5938 29.6875H15.625V28.2813H29.0781C29.2426 28.2813 29.4019 28.2236 29.5283 28.1183C30.3735 27.4143 31.6828 25.7381 32.5938 23.5913V29.6875ZM15.625 12.8126H18.4844V13.5157C18.4844 13.904 18.7992 14.2188 19.1875 14.2188C19.5759 14.2188 19.8907 13.904 19.8907 13.5157V12.8126H23.4063V13.5157C23.4063 13.904 23.7211 14.2188 24.1094 14.2188C24.4977 14.2188 24.8125 13.904 24.8125 13.5157V12.8126H28.375V13.5157C28.375 13.904 28.6898 14.2188 29.0781 14.2188C29.4665 14.2188 29.7813 13.904 29.7813 13.5157V12.8126H32.5938V15.625H15.625V12.8126ZM15.613 17.0308H32.5813C32.4229 21.4912 30.7109 25.0006 28.8024 26.875H12.3025C14.465 24.1197 15.497 20.532 15.613 17.0308V17.0308Z" fill="#686868"/>
</svg>
