<svg width="44" height="45" viewBox="0 0 44 45" fill="none" xmlns="http://www.w3.org/2000/svg">
<path d="M31.8906 13.6562H12.1094C10.9439 13.6562 10 14.606 10 15.7656V28.4219C10 29.5884 10.9509 30.5312 12.1094 30.5312H31.8906C33.0463 30.5312 34 29.5923 34 28.4219V15.7656C34 14.6081 33.0598 13.6562 31.8906 13.6562ZM31.5952 15.0625C31.1642 15.4912 23.7476 22.8687 23.4916 23.1235C23.0931 23.5219 22.5634 23.7413 22 23.7413C21.4366 23.7413 20.9069 23.5218 20.5071 23.1221C20.3349 22.9508 13.0001 15.6547 12.4048 15.0625H31.5952ZM11.4062 28.1357V16.0527L17.483 22.0975L11.4062 28.1357ZM12.4057 29.125L18.4801 23.0892L19.5141 24.1178C20.1781 24.7818 21.061 25.1475 22 25.1475C22.939 25.1475 23.8219 24.7818 24.4846 24.1191L25.5199 23.0892L31.5943 29.125H12.4057ZM32.5938 28.1357L26.517 22.0975L32.5938 16.0527V28.1357Z" fill="#686868"/>
</svg>
