<svg width="44" height="44" viewBox="0 0 44 44" fill="none" xmlns="http://www.w3.org/2000/svg">
<path d="M22 24.1177H19.8823V31.1765H21.2941V28.353H22C22.3892 28.353 22.7059 28.6696 22.7059 29.0589V31.1765H24.1176V29.0589C24.1176 28.5169 23.9128 28.0221 23.5767 27.6471C23.9128 27.2721 24.1176 26.7773 24.1176 26.2353C24.1176 25.0677 23.1677 24.1177 22 24.1177ZM21.2941 26.9412V25.5294H22C22.3892 25.5294 22.7059 25.8461 22.7059 26.2353C22.7059 26.6246 22.3892 26.9412 22 26.9412H21.2941Z" fill="#686868"/>
<path d="M26.9411 28.353H27.6469C28.8147 28.353 29.7646 27.403 29.7646 26.2353C29.7646 25.0677 28.8147 24.1177 27.6469 24.1177H25.5293V31.1765H26.9411V28.353ZM26.9411 25.5294H27.6469C28.0362 25.5294 28.3528 25.8461 28.3528 26.2353C28.3528 26.6246 28.0362 26.9412 27.6469 26.9412H26.9411V25.5294Z" fill="#686868"/>
<path d="M14.9414 31.1765H18.4708V29.7647H16.3532V28.353H17.7649V26.9412H16.3532V25.5294H18.4708V24.1177H14.9414V31.1765Z" fill="#686868"/>
<path d="M32.5882 21.2941V18.6254L30.0654 17.9946C29.9244 17.5559 29.7477 17.1292 29.537 16.7193L30.8751 14.4892L28.0991 11.7133L25.8689 13.0513C25.4591 12.8406 25.0325 12.6639 24.5936 12.5229L23.9629 10H20.0371L19.4064 12.5229C18.9676 12.6639 18.541 12.8406 18.1311 13.0513L15.9009 11.7133L13.125 14.4892L14.4631 16.7194C14.2524 17.1293 14.0756 17.556 13.9347 17.9947L11.4118 18.6254V21.2941H10V34H34V21.2941H32.5882ZM12.8235 19.7276L15.0725 19.1654L15.1797 18.7634C15.4856 17.6168 15.9768 16.9271 16.0956 16.6962L14.9027 14.708L16.1198 13.491L18.108 14.6839L18.4681 14.4753C19.495 13.8806 20.3302 13.7399 20.5771 13.6607L21.1394 11.4118H22.8606L23.4228 13.6607C23.6672 13.7391 24.5045 13.8804 25.5318 14.4753L25.8919 14.6839L27.8801 13.491L29.0973 14.708L27.9043 16.6963C28.0203 16.9216 28.5143 17.6165 28.8202 18.7634L28.9275 19.1654L31.1765 19.7276V21.2941H25.4577C25.9058 19.1011 24.2204 17.0588 22 17.0588C19.7795 17.0588 18.0942 19.1012 18.5423 21.2941H12.8235V19.7276ZM19.8824 20.5882C19.8824 19.4206 20.8323 18.4706 22 18.4706C23.1677 18.4706 24.1176 19.4206 24.1176 20.5882C24.1176 20.8295 24.0763 21.0684 23.9964 21.2941H20.0036C19.9237 21.0684 19.8824 20.8295 19.8824 20.5882V20.5882ZM32.5882 32.5882H11.4118V22.7059H32.5882V32.5882Z" fill="#686868"/>
</svg>
