<?xml version="1.0"?>
<svg xmlns="http://www.w3.org/2000/svg" xmlns:xlink="http://www.w3.org/1999/xlink" version="1.1" id="Layer_1" x="0px" y="0px" viewBox="0 0 472.615 472.615" style="enable-background:new 0 0 472.615 472.615;" xml:space="preserve" width="512px" height="512px" class=""><g><g>
	<g>
		<path d="M0,109.02v363.542h363.648V109.02H0z M290.825,300.654h-99.154v99.154h-19.692v-99.154H72.824v-19.692h99.155v-99.15    h19.692v99.15h99.154V300.654z" data-original="#000000" class="active-path" data-old_color="#000000" fill="#FFFFFF"/>
	</g>
</g><g>
	<g>
		<polygon points="109.073,0.054 109.073,89.327 383.344,89.327 383.344,363.596 472.615,363.596 472.615,0.054   " data-original="#000000" class="active-path" data-old_color="#000000" fill="#FFFFFF"/>
	</g>
</g></g> </svg>
