<?xml version="1.0"?>
<svg xmlns="http://www.w3.org/2000/svg" xmlns:xlink="http://www.w3.org/1999/xlink" version="1.1" id="Layer_1" x="0px" y="0px" viewBox="0 0 512 512" style="enable-background:new 0 0 512 512;" xml:space="preserve" width="512px" height="512px"><g><g>
	<polygon points="256,0 114.759,194.207 211.862,194.207 211.862,300.138 300.138,300.138 300.138,194.207    397.241,194.207  " data-original="#4FBA6F" class="active-path" data-old_color="#4FBA6F" fill="#E50606"/>
	<path d="M282.483,335.448h-52.966c-9.71,0-17.655,7.945-17.655,17.655s7.945,17.655,17.655,17.655h52.966   c9.71,0,17.655-7.945,17.655-17.655S292.193,335.448,282.483,335.448" data-original="#4FBA6F" class="active-path" data-old_color="#4FBA6F" fill="#E50606"/>
	<path d="M282.483,406.069h-52.966c-9.71,0-17.655,7.945-17.655,17.655c0,9.71,7.945,17.655,17.655,17.655   h52.966c9.71,0,17.655-7.945,17.655-17.655C300.138,414.014,292.193,406.069,282.483,406.069" data-original="#4FBA6F" class="active-path" data-old_color="#4FBA6F" fill="#E50606"/>
	<path d="M282.483,476.69h-52.966c-9.71,0-17.655,7.945-17.655,17.655c0,9.71,7.945,17.655,17.655,17.655   h52.966c9.71,0,17.655-7.945,17.655-17.655C300.138,484.634,292.193,476.69,282.483,476.69" data-original="#4FBA6F" class="active-path" data-old_color="#4FBA6F" fill="#E50606"/>
</g></g> </svg>
