<svg width="28" height="34" viewBox="0 0 28 34" fill="none" xmlns="http://www.w3.org/2000/svg">
<path d="M20.3756 6.76999C20.1948 7.0073 20.1157 7.3067 20.1556 7.60234C20.1955 7.89798 20.3513 8.16566 20.5886 8.34649C22.3182 9.66373 23.6134 11.4691 24.307 13.5297C25.0006 15.5902 25.0607 17.8113 24.4796 19.9064C23.8986 22.0014 22.7029 23.8742 21.0471 25.2831C19.3912 26.692 17.3511 27.5724 15.1901 27.8105L16.2056 26.795C16.4068 26.5942 16.5247 26.3247 16.5354 26.0407C16.546 25.7566 16.4488 25.479 16.2631 25.2637C16.0775 25.0484 15.8172 24.9114 15.5347 24.8802C15.2521 24.849 14.9682 24.9259 14.7401 25.0955L14.6141 25.205L11.6141 28.205C11.4235 28.3955 11.3077 28.648 11.2876 28.9167C11.2675 29.1853 11.3445 29.4523 11.5046 29.669L11.6141 29.795L14.6141 32.795C14.8151 32.9944 15.0839 33.1107 15.3668 33.1207C15.6498 33.1307 15.9262 33.0335 16.1407 32.8487C16.3552 32.6639 16.4922 32.405 16.5242 32.1237C16.5563 31.8424 16.481 31.5593 16.3136 31.331L16.2056 31.205L15.0806 30.08C17.7252 29.861 20.2413 28.8455 22.297 27.1674C24.3528 25.4894 25.8516 23.2276 26.5957 20.6804C27.3399 18.1333 27.2945 15.4203 26.4655 12.8995C25.6365 10.3786 24.0628 8.16829 21.9521 6.55999C21.7149 6.37904 21.4156 6.29968 21.12 6.33934C20.8244 6.379 20.5566 6.53444 20.3756 6.77149V6.76999ZM11.7956 1.20499C11.5849 1.41592 11.4665 1.70186 11.4665 1.99999C11.4665 2.29811 11.5849 2.58405 11.7956 2.79499L12.9206 3.91999C10.3185 4.13433 7.83948 5.11984 5.80048 6.75054C3.76148 8.38123 2.25516 10.583 1.4741 13.0743C0.693053 15.5656 0.672768 18.2333 1.41584 20.7362C2.15892 23.2391 3.63159 25.4635 5.64556 27.125C5.75951 27.2191 5.89089 27.2899 6.03221 27.3333C6.17352 27.3767 6.32199 27.3918 6.46915 27.3778C6.61631 27.3638 6.75927 27.321 6.88987 27.2517C7.02047 27.1825 7.13615 27.0882 7.2303 26.9742C7.32446 26.8603 7.39525 26.7289 7.43864 26.5876C7.48202 26.4463 7.49714 26.2978 7.48314 26.1506C7.46914 26.0035 7.4263 25.8605 7.35705 25.7299C7.2878 25.5993 7.19351 25.4836 7.07956 25.3895C5.43062 24.0288 4.21925 22.2124 3.59681 20.1671C2.97437 18.1219 2.96846 15.9386 3.57983 13.89C4.1912 11.8414 5.39273 10.0185 7.03428 8.6489C8.67583 7.27933 10.6846 6.42389 12.8096 6.18949L11.7956 7.20499C11.6882 7.30881 11.6025 7.43299 11.5436 7.57027C11.4847 7.70756 11.4538 7.85519 11.4525 8.00457C11.4513 8.15395 11.4798 8.30207 11.5365 8.4403C11.5931 8.57853 11.6767 8.7041 11.7824 8.80968C11.8881 8.91526 12.0137 8.99874 12.152 9.05524C12.2903 9.11174 12.4384 9.14013 12.5878 9.13876C12.7372 9.1374 12.8848 9.10629 13.022 9.04727C13.1592 8.98825 13.2833 8.90248 13.3871 8.79499L16.3871 5.79499C16.5977 5.58405 16.7161 5.29811 16.7161 4.99999C16.7161 4.70186 16.5977 4.41592 16.3871 4.20499L13.3871 1.20499C13.1761 0.994311 12.8902 0.875977 12.5921 0.875977C12.2939 0.875977 12.008 0.994311 11.7971 1.20499H11.7956Z" fill="#212121"/>
</svg>
