<svg xmlns="http://www.w3.org/2000/svg" width="41" height="37" viewBox="0 0 41 37">
  <g id="Group_445" data-name="Group 445" transform="translate(-0.284 0.272)">
    <g id="Group_297" data-name="Group 297" transform="translate(-0.002 0)">
      <rect id="Rectangle_163" data-name="Rectangle 163" width="41" height="37" rx="8" transform="translate(0.286 -0.272)" fill="#f6f9ff"/>
    </g>
    <g id="Group_444" data-name="Group 444" transform="translate(8.285 5.728)">
      <path id="path16" d="M381.332-1101.976a12.688,12.688,0,0,1,12.688-12.688,12.688,12.688,0,0,1,12.688,12.688,12.688,12.688,0,0,1-12.688,12.688,12.688,12.688,0,0,1-12.688-12.688" transform="translate(-381.332 1114.664)" fill="#ffc740"/>
      <path id="path18" d="M456.349-1060.949a12.629,12.629,0,0,1,2,6.834,12.688,12.688,0,0,1-12.688,12.688,12.623,12.623,0,0,1-6.638-1.874,12.678,12.678,0,0,0,10.692,5.854,12.688,12.688,0,0,0,12.688-12.688,12.679,12.679,0,0,0-6.05-10.814" transform="translate(-437.023 1062.808)" fill="#febb1b"/>
      <path id="path20" d="M406.705-1074.5a11.78,11.78,0,0,1,11.78-11.78,11.76,11.76,0,0,1,9.338,4.6,11.775,11.775,0,0,0-10.215-5.908,11.78,11.78,0,0,0-11.78,11.78,11.727,11.727,0,0,0,2.442,7.181,11.726,11.726,0,0,1-1.565-5.871" transform="translate(-404.981 1088.526)" fill="#ffd55e"/>
      <path id="path22" d="M587.767-880.918c0,.87-.418,1.576-.935,1.576s-.935-.706-.935-1.576.419-1.576.935-1.576.935.706.935,1.576" transform="translate(-578.818 890.528)" fill="#333"/>
      <path id="path24" d="M857.935-880.918c0,.87-.418,1.576-.935,1.576s-.935-.706-.935-1.576.419-1.576.935-1.576.935.706.935,1.576" transform="translate(-839.638 890.528)" fill="#333"/>
      <path id="path26" d="M501.615-713.317a8.582,8.582,0,0,0,8.526,7.609,8.582,8.582,0,0,0,8.526-7.609H501.615" transform="translate(-497.452 727.205)" fill="#635445"/>
      <path id="path28" d="M577.809-595.971a8.547,8.547,0,0,0,5.889,2.343,8.544,8.544,0,0,0,5.688-2.158l-.079-.184c-5.725-2.792-11.421-.039-11.5,0" transform="translate(-571.01 615.125)" fill="#d46669"/>
    </g>
  </g>
</svg>
