<?xml version="1.0" encoding="UTF-8"?>
<svg xmlns="http://www.w3.org/2000/svg" >
    <defs>
        <marker id="markerArrow" markerUnits="userSpaceOnUse" markerWidth="15" markerHeight="20" refX="200" refY="10" orient="auto">
            <path d="M2,4 L2,18 L15,10 L2,2" style="fill: #D8D8D8;" stroke="#9e9e9e" stroke-width="1"></path>
        </marker>
    </defs>
    <path d="M0,20 L500,20 L1000,20" stroke-width="3" style="marker-mid:url(#markerArrow); stroke: #D8D8D8"></path>
</svg>
