{
  "data": [
    {
      "deviceId": "WT101",
      "material": "water",
      "weight": 20
    },
    {
      "deviceId": "WT101",
      "material": "latex",
      "weight": 30
    },
    {
      "deviceId": "WT101",
      "material": "teric",
      "weight": 50
    },
    {
      "deviceId": "WT101",
      "material": "formic",
      "weight": 30
    }
  ],
  "message": "Successful",
  "result": "OK"
}