{
	"enr": {
		"material": [
			{
				"code": "DP1_WT101",
				"name": "DRUM PUMP",
				"procedure": 1,
				"sequence": 1,
				"unit": "KG",
				"type": "material"
			},
			{
				"code": "XSV102",
				"name": "SA1 WATER VALVE (TERIC)",
				"procedure": 2,
				"sequence": "",
				"unit": "KG",
				"type": "material"
			},
			{
				"code": "XSV115_WT101",
				"name": "LATEX DIAPHRAGM PUMP SOLENOID VALVE",
				"procedure": 3,
				"sequence": 1,
				"unit": "KG",
				"type": "material"
			},
			{
				"code": "XSV112_WT101",
				"name": "TERIC ACID TANK SOLENOID VALVE",
				"procedure": 3,
				"sequence": 2,
				"unit": "KG",
				"type": "material"
			},
			{
				"code": "XSV123_WT101",
				"name": "SA1 WATER VALVE (FLUSHING, 2'\")",
				"procedure": 3,
				"sequence": 5,
				"unit": "KG",
				"type": "material"
			},
			{
				"code": "XSV111_WT101",
				"name": "AMMONIA SOLENOID VALVE",
				"procedure": 3,
				"sequence": 1,
				"unit": "KG",
				"type": "material"
			},
			{
				"code": "XSV110_WT101",
				"name": "SA1 WATER VALVE (FLUSHING, 1\")",
				"procedure": 3,
				"sequence": 2,
				"unit": "KG",
				"type": "material"
			}
		],
		"heating": [
			{
				"code": "CDP1",
				"name": "",
				"unit": "",
				"type": "onOff"
			},
			{
				"code": "MXR1",
				"name": "REACTOR TANK STIRRER MOTOR",
				"procedure": 1,
				"sequence": "",
				"unit": "Hz",
				"type": "inverter"
			},
			{
				"code": "HWP1",
				"name": "HOT WATER CIRCULATION PUMP",
				"procedure": 2,
				"sequence": 1,
				"unit": "",
				"type": "onOff"
			},
			{
				"code": "TT106",
				"name": "TEMPERATURE SENSOR (OUTLET)",
				"procedure": 2,
				"sequence": 2,
				"unit": "°C",
				"type": "temp"
			},
			{
				"code": "TT101",
				"name": "TEMPERATURE SENSOR (INLET)",
				"procedure": 2,
				"sequence": 3,
				"unit": "°C",
				"type": "temp"
			},
			{
				"code": "TT102",
				"name": "TEMPERATURE SENSOR",
				"procedure": 2,
				"sequence": 4,
				"unit": "°C",
				"type": "temp",
				"mode": true
			},
			{
				"code": "TT103",
				"name": "TEMPERATURE SENSOR",
				"procedure": 2,
				"sequence": 4,
				"unit": "°C",
				"type": "temp",
				"mode": true
			},
			{
				"code": "TT104",
				"name": "TEMPERATURE SENSOR",
				"procedure": 2,
				"sequence": 4,
				"unit": "°C",
				"type": "temp",
				"mode": true
			},
			{
				"code": "TT105",
				"name": "TEMPERATURE SENSOR",
				"procedure": 2,
				"sequence": 4,
				"unit": "°C",
				"type": "temp",
				"mode": true
			},
			{
				"code": "TT108",
				"name": "3 WAY CONTROL VALVE (FRESH WATER)",
				"procedure": 2,
				"sequence": "",
				"unit": "°C",
				"type": "temp"
			},
			{
				"code": "TT109",
				"name": "3 WAY CONTROL VALVE (FRESH WATER)",
				"procedure": 2,
				"sequence": 5,
				"unit": "°C",
				"type": "temp"
			}
		],
		"cooling": [
			{
				"code": "CDP1",
				"name": "",
				"unit": "",
				"type": "onOff"
			},
			{
				"code": "MXR1",
				"name": "REACTOR TANK STIRRER MOTOR",
				"procedure": 1,
				"sequence": "",
				"unit": "Hz",
				"type": "inverter"
			},
			{
				"code": "CCWP1",
				"name": "COLD WATER CIRCULATION PUMP",
				"procedure": 2,
				"sequence": "",
				"unit": "",
				"type": "onOff"
			},
			{
				"code": "HWP1",
				"name": "HOT WATER CIRCULATION PUMP",
				"procedure": 2,
				"sequence": "",
				"unit": "",
				"type": "onOff"
			},
			{
				"code": "TT106",
				"name": "TEMPERATURE SENSOR (OUTLET)",
				"procedure": 2,
				"sequence": "",
				"unit": "°C",
				"type": "temp"
			},
			{
				"code": "TT101",
				"name": "TEMPERATURE SENSOR (INLET)",
				"procedure": 2,
				"sequence": "",
				"unit": "°C",
				"type": "temp"
			},
			{
				"code": "TT102",
				"name": "TEMPERATURE SENSOR",
				"procedure": 2,
				"sequence": "",
				"unit": "°C",
				"type": "temp",
				"mode": true
			},
			{
				"code": "TT103",
				"name": "TEMPERATURE SENSOR",
				"procedure": 2,
				"sequence": "",
				"unit": "°C",
				"type": "temp",
				"mode": true
			},
			{
				"code": "TT104",
				"name": "TEMPERATURE SENSOR",
				"procedure": 2,
				"sequence": "",
				"unit": "°C",
				"type": "temp",
				"mode": true
			},
			{
				"code": "TT105",
				"name": "TEMPERATURE SENSOR",
				"procedure": 2,
				"sequence": "",
				"unit": "°C",
				"type": "temp",
				"mode": true
			},
			{
				"code": "TT108",
				"name": "3 WAY CONTROL VALVE (FRESH WATER)",
				"procedure": 2,
				"sequence": "",
				"unit": "°C",
				"type": "temp"
			},
			{
				"code": "TT109",
				"name": "3 WAY CONTROL VALVE (FRESH WATER)",
				"procedure": 2,
				"sequence": "",
				"unit": "°C",
				"type": "temp"
			}
		],
		"coagulation": [
			{
				"code": "LT105",
				"name": "LEVEL TRANSMITTER",
				"procedure": 1,
				"sequence": 1,
				"unit": "%",
				"type": "level"
			},
			{
				"code": "ETF1",
				"name": "FUME EXTRACTOR",
				"procedure": 1,
				"sequence": 1,
				"unit": "",
				"type": "onOff"
			},
			{
				"code": "FXP1",
				"name": "FUME EXTRACTOR SPRAYER PUMP",
				"procedure": 1,
				"sequence": 2,
				"unit": "",
				"type": "onOff"
			},
			{
				"code": "SNV1",
				"name": "VIBRATING SIEVE",
				"procedure": 1,
				"sequence": 8,
				"unit": "",
				"type": "onOff"
			},
			{
				"code": "XSV121",
				"name": "LATEX HOLDING TANK SOLENOID VALVE",
				"procedure": 1,
				"sequence": 9,
				"unit": "",
				"type": "onOff"
			}
		],
		"soaking": [
			{
				"code": "CCWP1",
				"name": "COLD WATER CIRCULATION PUMP",
				"procedure": 1,
				"sequence": 1,
				"unit": "",
				"type": "onOff"
			},
			{
				"code": "HEP1",
				"name": "HEAT EXCHANGER PUMP 1",
				"procedure": 1,
				"sequence": 1,
				"unit": "",
				"type": "onOff"
			},
			{
				"code": "HEP2",
				"name": "HEAT EXCHANGER PUMP 2",
				"procedure": 1,
				"sequence": 1,
				"unit": "",
				"type": "onOff"
			},
			{
				"code": "SAS1",
				"name": "SODA ASH TANK STIRRER",
				"procedure": 2,
				"sequence": 1,
				"unit": "Hz",
				"type": "inverter"
			},
			{
				"code": "ETR1",
				"name": "EXTRUDER",
				"procedure": 3,
				"sequence": 1,
				"unit": "Hz",
				"type": "inverter"
			},
			{
				"code": "RBT1",
				"name": "EXTRUDER CONVEYOR",
				"procedure": 3,
				"sequence": 2,
				"unit": "Hz",
				"type": "inverter"
			},
			{
				"code": "PSP1",
				"name": "SPRAY PUMP (SOAKING TANK)",
				"procedure": 3,
				"sequence": 3,
				"unit": "Hz",
				"type": "inverter"
			},
			{
				"code": "PSP2",
				"name": "CRUMB PUSHER PUMP(SOAKING TANK)",
				"procedure": 3,
				"sequence": 4,
				"unit": "Hz",
				"type": "inverter"
			},
			{
				"code": "CVY7",
				"name": "ROTARY BUCKET",
				"procedure": 3,
				"sequence": 5,
				"unit": "Hz",
				"type": "inverter"
			},
			{
				"code": "GNT1",
				"name": "GRANULATOR MOTOR",
				"procedure": 3,
				"sequence": 6,
				"unit": "Hz",
				"type": "inverter"
			},
			{
				"code": "CVY6",
				"name": "GRANULATOR CONVEYOR MOTOR",
				"procedure": 3,
				"sequence": 7,
				"unit": "Hz",
				"type": "inverter"
			}
		]
	},
	"dpnr": {
		"material": [
			{
				"code": "XSV114",
				"name": "FORMIC ACID CONCENTRATE SOLENOID VALVE",
				"procedure": 2,
				"sequence": 1,
				"unit": "KG",
				"type": "material"
			},
			{
				"code": "XSV101",
				"name": "SA1 WATER VALVE (FORMIC)",
				"procedure": 2,
				"sequence": 2,
				"unit": "KG",
				"type": "material"
			},
			{
				"code": "XSV105",
				"name": "SA1 WATER VALVE (TERIC)",
				"procedure": 3,
				"sequence": 1,
				"unit": "KG",
				"type": "material"
			},
			{
				"code": "XSV115_WT102",
				"name": "LATEX DIAPHRAGM PUMP SOLENOID VALVE",
				"procedure": 4,
				"sequence": 1,
				"unit": "KG",
				"type": "material"
			},
			{
				"code": "XSV109_WT102",
				"name": "TERIC ACID TANK SOLENOID VALVE",
				"procedure": 4,
				"sequence": 2,
				"unit": "KG",
				"type": "material"
			},
			{
				"code": "XSV108_WT102",
				"name": "HNS TANK SOLENOID VALVE",
				"procedure": 4,
				"sequence": 4,
				"unit": "KG",
				"type": "material"
			},
			{
				"code": "XSV106_WT102",
				"name": "SA1 WATER VALVE (FLUSHING, 1\")",
				"procedure": 4,
				"sequence": "3, 5",
				"unit": "KG",
				"type": "material"
			},
			{
				"code": "XSV107_WT102",
				"name": "ENZYME TANK SOLENOID VALVE",
				"procedure": 4,
				"sequence": 6,
				"unit": "KG",
				"type": "material"
			},
			{
				"code": "XSV122_WT102",
				"name": "SA1 WATER VALVE (ADD WATER, 2'\")",
				"procedure": 4,
				"sequence": 7,
				"unit": "KG",
				"type": "material"
			}
		],
		"mixing": [
			{
				"code": "FAS1",
				"name": "FORMIC ACID DILUTED STIRRER",
				"procedure": 2,
				"sequence": 3,
				"unit": "Hz",
				"type": "inverter"
			},
			{
				"code": "MXR2",
				"name": "MIXING TANK STIRRER MOTOR",
				"procedure": 4,
				"sequence": 8,
				"unit": "Hz",
				"type": "inverter"
			},
			{
				"code": "XSV101",
				"name": "SA1 WATER VALVE (FORMIC)",
				"procedure": 4,
				"sequence": 8,
				"unit": "",
				"type": "onOff"
			},
			{
				"code": "XSV114",
				"name": "FORMIC ACID CONCENTRATE SOLENOID VALVE",
				"procedure": 4,
				"sequence": 8,
				"unit": "",
				"type": "onOff"
			}
		],
		"coagulation": [
			{
				"code": "LT104",
				"name": "LEVEL TRANSMITTER",
				"procedure": 1,
				"sequence": 1,
				"unit": "%",
				"type": "level"
			},
			{
				"code": "ETF1",
				"name": "FUME EXTRACTOR",
				"procedure": 1,
				"sequence": 1,
				"unit": "",
				"type": "onOff"
			},
			{
				"code": "FXP1",
				"name": "FUME EXTRACTOR SPRAYER PUMP",
				"procedure": 1,
				"sequence": 1,
				"unit": "",
				"type": "onOff"
			},
			{
				"code": "XSV117",
				"name": "CHEMICAL DIAPHRAGM PUMP AIR VALVE",
				"procedure": 2,
				"sequence": 1,
				"unit": "",
				"type": "onOff"
			},
			{
				"code": "XCV102",
				"name": "BELIMO VALVE (ACID HOLDING TANK)",
				"procedure": 3,
				"sequence": "",
				"unit": "%",
				"type": "valve"
			},
			{
				"code": "XCV103",
				"name": "BELIMO VALVE (LATEX HOLDING TANK)",
				"procedure": 3,
				"sequence": "",
				"unit": "%",
				"type": "valve"
			}
		],
		"creeping": [
			{
				"code": "LR201",
				"name": "HOPPER LEVEL",
				"procedure": 1,
				"sequence": 1,
				"unit": "%",
				"type": "level"
			},
			{
				"code": "CBP1",
				"name": "CRUMP TRANSFER PUMP 1",
				"procedure": 1,
				"sequence": 1,
				"unit": "",
				"type": "onOff"
			},
			{
				"code": "BTP1",
				"name": "BUFFER TANK PUMP 1",
				"procedure": 1,
				"sequence": 2,
				"unit": "",
				"type": "onOff"
			},
			{
				"code": "BTP2",
				"name": "BUFFER TANK PUMP 2",
				"procedure": 1,
				"sequence": 2,
				"unit": "",
				"type": "onOff"
			},
			{
				"code": "SHR1",
				"name": "SHREDDER 1",
				"procedure": 1,
				"sequence": 3,
				"unit": "Hz",
				"type": "inverter"
			},
			{
				"code": "CVY5",
				"name": "CONVEYOR 5",
				"procedure": 1,
				"sequence": 4,
				"unit": "Hz",
				"type": "inverter"
			},
			{
				"code": "CPR5",
				"name": "CREEPER 5",
				"procedure": 1,
				"sequence": 5,
				"unit": "Hz",
				"type": "inverter"
			},
			{
				"code": "CVY4",
				"name": "CONVEYOR 4",
				"procedure": 1,
				"sequence": 6,
				"unit": "Hz",
				"type": "inverter"
			},
			{
				"code": "CPR4",
				"name": "CREEPER 4",
				"procedure": 1,
				"sequence": 7,
				"unit": "Hz",
				"type": "inverter"
			},
			{
				"code": "CVY3",
				"name": "CONVEYOR 3",
				"procedure": 1,
				"sequence": 8,
				"unit": "Hz",
				"type": "inverter"
			},
			{
				"code": "CPR3",
				"name": "CREEPER 3",
				"procedure": 1,
				"sequence": 9,
				"unit": "Hz",
				"type": "inverter"
			},
			{
				"code": "CVY2",
				"name": "CONVEYOR 2",
				"procedure": 1,
				"sequence": 10,
				"unit": "Hz",
				"type": "inverter"
			},
			{
				"code": "CPR2",
				"name": "CREEPER 2",
				"procedure": 1,
				"sequence": 11,
				"unit": "Hz",
				"type": "inverter"
			},
			{
				"code": "CVY1",
				"name": "CONVEYOR 1",
				"procedure": 1,
				"sequence": 12,
				"unit": "Hz",
				"type": "inverter"
			},
			{
				"code": "CPR1",
				"name": "CREEPER 1",
				"procedure": 1,
				"sequence": 13,
				"unit": "Hz",
				"type": "inverter"
			}
		]
	},
	"general": {
		"general": [
			{
				"code": "MXR3",
				"name": "LATEX TANK STIRRER MOTOR",
				"type": "onOff"
			},
			{
				"code": "ACP1",
				"name": "AIR COMPRESSOR",
				"unit": "",
				"type": "onOff"
			},
			{
				"code": "CHR1",
				"name": "CHILLER",
				"unit": "",
				"type": "onOff"
			},
			{
				"code": "HWP1",
				"name": "HOT WATER CIRCULATION PUMP",
				"unit": "",
				"type": "onOff"
			},
			{
				"code": "XSV119",
				"name": "HOT WATER TANK INLET",
				"unit": "",
				"type": "onOff"
			},
			{
				"code": "CDP1",
				"name": "",
				"unit": "",
				"type": "onOff"
			}
		],
		"enr": [
			{
				"code": "TT108",
				"name": "3 WAY CONTROL VALVE (FRESH WATER)",
				"unit": "°C",
				"type": "temp"
			},
			{
				"code": "TT201",
				"name": "CHILLER TEMP",
				"unit": "°C",
				"type": "temp"
			}
		]
	}
}