<?xml version="1.0" encoding="UTF-8"?>
<svg xmlns="http://www.w3.org/2000/svg">
    <line x1="0" y1="523" x2="210" y2="523" stroke-width="3" stroke="#D8D8D8"></line>
    <line x1="210" y1="0" x2="210" y2="523" stroke-width="3" stroke="#D8D8D8"></line>
    <line x1="210" y1="2" x2="232" y2="1" stroke-width="3" stroke="#D8D8D8"></line>
    <polygon points="210,265 203,277, 217,277" fill="#D9D9D9" stroke-width="1" stroke="#9e9e9e" />
</svg>
