[
  {
    "year": 1969,
    "avg_closing_price": 41.1,
    "open": 41.8,
    "high": 43.75,
    "low": 35,
    "close": 35.21,
    "percent_change": -0.1607
  },
  {
    "year": 1970,
    "avg_closing_price": 35.96,
    "open": 35.13,
    "high": 39.19,
    "low": 34.78,
    "close": 37.38,
    "percent_change": 0.0616
  },
  {
    "year": 1971,
    "avg_closing_price": 40.8,
    "open": 37.33,
    "high": 43.9,
    "low": 37.33,
    "close": 43.5,
    "percent_change": 0.1637
  },
  {
    "year": 1972,
    "avg_closing_price": 58.17,
    "open": 43.73,
    "high": 70,
    "low": 43.73,
    "close": 64.7,
    "percent_change": 0.4874
  },
  {
    "year": 1973,
    "avg_closing_price": 97.12,
    "open": 64.99,
    "high": 127,
    "low": 64.1,
    "close": 112.25,
    "percent_change": 0.7349
  },
  {
    "year": 1974,
    "avg_closing_price": 158.76,
    "open": 114.75,
    "high": 197.5,
    "low": 114.75,
    "close": 187.5,
    "percent_change": 0.6704
  },
  {
    "year": 1975,
    "avg_closing_price": 160.87,
    "open": 185,
    "high": 186.25,
    "low": 128.75,
    "close": 140.25,
    "percent_change": -0.252
  },
  {
    "year": 1976,
    "avg_closing_price": 124.8,
    "open": 140.35,
    "high": 140.35,
    "low": 103.05,
    "close": 134.55,
    "percent_change": -0.0406
  },
  {
    "year": 1977,
    "avg_closing_price": 147.84,
    "open": 136.1,
    "high": 168.15,
    "low": 129.4,
    "close": 165.6,
    "percent_change": 0.2308
  },
  {
    "year": 1978,
    "avg_closing_price": 193.57,
    "open": 168.6,
    "high": 243.65,
    "low": 166.3,
    "close": 224.5,
    "percent_change": 0.3557
  },
  {
    "year": 1979,
    "avg_closing_price": 307.01,
    "open": 227.15,
    "high": 524,
    "low": 216.55,
    "close": 524,
    "percent_change": 1.3341
  },
  {
    "year": 1980,
    "avg_closing_price": 614.75,
    "open": 559,
    "high": 843,
    "low": 474,
    "close": 589.5,
    "percent_change": 0.125
  },
  {
    "year": 1981,
    "avg_closing_price": 459.16,
    "open": 592,
    "high": 599.25,
    "low": 391.75,
    "close": 400,
    "percent_change": -0.3215
  },
  {
    "year": 1982,
    "avg_closing_price": 376.11,
    "open": 399,
    "high": 488.5,
    "low": 297,
    "close": 448,
    "percent_change": 0.12
  },
  {
    "year": 1983,
    "avg_closing_price": 423.71,
    "open": 452.75,
    "high": 511.5,
    "low": 374.75,
    "close": 381.5,
    "percent_change": -0.1484
  },
  {
    "year": 1984,
    "avg_closing_price": 360.65,
    "open": 384,
    "high": 406.85,
    "low": 303.25,
    "close": 309,
    "percent_change": -0.19
  },
  {
    "year": 1985,
    "avg_closing_price": 317.42,
    "open": 306.25,
    "high": 339.3,
    "low": 285,
    "close": 327,
    "percent_change": 0.0583
  },
  {
    "year": 1986,
    "avg_closing_price": 368.2,
    "open": 327.1,
    "high": 442.75,
    "low": 326,
    "close": 390.9,
    "percent_change": 0.1954
  },
  {
    "year": 1987,
    "avg_closing_price": 446.84,
    "open": 402.4,
    "high": 502.75,
    "low": 392.6,
    "close": 486.5,
    "percent_change": 0.2446
  },
  {
    "year": 1988,
    "avg_closing_price": 436.78,
    "open": 484.1,
    "high": 485.3,
    "low": 389.05,
    "close": 410.15,
    "percent_change": -0.1569
  },
  {
    "year": 1989,
    "avg_closing_price": 381.27,
    "open": 413.6,
    "high": 417.15,
    "low": 358.1,
    "close": 401,
    "percent_change": -0.0223
  },
  {
    "year": 1990,
    "avg_closing_price": 383.73,
    "open": 401.65,
    "high": 421.4,
    "low": 346.75,
    "close": 391,
    "percent_change": -0.0249
  },
  {
    "year": 1991,
    "avg_closing_price": 362.34,
    "open": 392.5,
    "high": 403.7,
    "low": 343.5,
    "close": 353.4,
    "percent_change": -0.0962
  },
  {
    "year": 1992,
    "avg_closing_price": 343.87,
    "open": 351.2,
    "high": 359.3,
    "low": 330.2,
    "close": 332.9,
    "percent_change": -0.058
  },
  {
    "year": 1993,
    "avg_closing_price": 360.05,
    "open": 329.4,
    "high": 406.7,
    "low": 326.5,
    "close": 390.65,
    "percent_change": 0.1735
  },
  {
    "year": 1994,
    "avg_closing_price": 384.16,
    "open": 395,
    "high": 397.5,
    "low": 370.25,
    "close": 382.5,
    "percent_change": -0.0209
  },
  {
    "year": 1995,
    "avg_closing_price": 384.07,
    "open": 381.4,
    "high": 396.95,
    "low": 372.45,
    "close": 386.7,
    "percent_change": 0.011
  },
  {
    "year": 1996,
    "avg_closing_price": 387.73,
    "open": 387.1,
    "high": 416.25,
    "low": 368.3,
    "close": 369.55,
    "percent_change": -0.0443
  },
  {
    "year": 1997,
    "avg_closing_price": 331,
    "open": 367.8,
    "high": 367.8,
    "low": 283.05,
    "close": 289.2,
    "percent_change": -0.2174
  },
  {
    "year": 1998,
    "avg_closing_price": 294.12,
    "open": 287.7,
    "high": 314.6,
    "low": 273.4,
    "close": 287.45,
    "percent_change": -0.0061
  },
  {
    "year": 1999,
    "avg_closing_price": 278.86,
    "open": 288.25,
    "high": 326.25,
    "low": 252.9,
    "close": 290.85,
    "percent_change": 0.0118
  },
  {
    "year": 2000,
    "avg_closing_price": 279.29,
    "open": 282.05,
    "high": 316.6,
    "low": 263.8,
    "close": 272.65,
    "percent_change": -0.0626
  },
  {
    "year": 2001,
    "avg_closing_price": 271.19,
    "open": 272.8,
    "high": 292.85,
    "low": 256.7,
    "close": 276.5,
    "percent_change": 0.0141
  },
  {
    "year": 2002,
    "avg_closing_price": 310.08,
    "open": 278.1,
    "high": 348.5,
    "low": 277.8,
    "close": 342.75,
    "percent_change": 0.2396
  },
  {
    "year": 2003,
    "avg_closing_price": 363.83,
    "open": 342.2,
    "high": 417.25,
    "low": 319.75,
    "close": 417.25,
    "percent_change": 0.2174
  },
  {
    "year": 2004,
    "avg_closing_price": 409.53,
    "open": 415.2,
    "high": 455.75,
    "low": 373.5,
    "close": 438,
    "percent_change": 0.0497
  },
  {
    "year": 2005,
    "avg_closing_price": 444.99,
    "open": 426.8,
    "high": 537.5,
    "low": 411.5,
    "close": 513,
    "percent_change": 0.1712
  },
  {
    "year": 2006,
    "avg_closing_price": 604.34,
    "open": 520.75,
    "high": 725.75,
    "low": 520.75,
    "close": 635.7,
    "percent_change": 0.2392
  },
  {
    "year": 2007,
    "avg_closing_price": 696.43,
    "open": 640.75,
    "high": 841.75,
    "low": 608.3,
    "close": 836.5,
    "percent_change": 0.3159
  },
  {
    "year": 2008,
    "avg_closing_price": 872.37,
    "open": 840.75,
    "high": 1023.5,
    "low": 692.5,
    "close": 865,
    "percent_change": 0.0341
  },
  {
    "year": 2009,
    "avg_closing_price": 973.66,
    "open": 869.75,
    "high": 1218.25,
    "low": 813,
    "close": 1104,
    "percent_change": 0.2763
  },
  {
    "year": 2010,
    "avg_closing_price": 1226.66,
    "open": 1113,
    "high": 1426,
    "low": 1052.25,
    "close": 1410.25,
    "percent_change": 0.2774
  },
  {
    "year": 2011,
    "avg_closing_price": 1573.16,
    "open": 1405.5,
    "high": 1896.5,
    "low": 1316,
    "close": 1574.5,
    "percent_change": 0.1165
  },
  {
    "year": 2012,
    "avg_closing_price": 1668.86,
    "open": 1590,
    "high": 1790,
    "low": 1537.5,
    "close": 1664,
    "percent_change": 0.0568
  },
  {
    "year": 2013,
    "avg_closing_price": 1409.51,
    "open": 1681.5,
    "high": 1692.5,
    "low": 1192.75,
    "close": 1201.5,
    "percent_change": -0.2779
  },
  {
    "year": 2014,
    "avg_closing_price": 1266.06,
    "open": 1219.75,
    "high": 1379,
    "low": 1144.5,
    "close": 1199.25,
    "percent_change": -0.0019
  },
  {
    "year": 2015,
    "avg_closing_price": 1158.86,
    "open": 1184.25,
    "high": 1298,
    "low": 1049.6,
    "close": 1060.2,
    "percent_change": -0.1159
  },
  {
    "year": 2016,
    "avg_closing_price": 1251.92,
    "open": 1075.2,
    "high": 1372.6,
    "low": 1073.6,
    "close": 1151.7,
    "percent_change": 0.0863
  },
  {
    "year": 2017,
    "avg_closing_price": 1260.39,
    "open": 1162,
    "high": 1351.2,
    "low": 1162,
    "close": 1296.5,
    "percent_change": 0.1257
  },
  {
    "year": 2018,
    "avg_closing_price": 1268.93,
    "open": 1312.8,
    "high": 1360.25,
    "low": 1176.7,
    "close": 1281.65,
    "percent_change": -0.0115
  },
  {
    "year": 2019,
    "avg_closing_price": 1393.34,
    "open": 1287.2,
    "high": 1542.6,
    "low": 1270.05,
    "close": 1523,
    "percent_change": 0.1883
  },
  {
    "year": 2020,
    "avg_closing_price": 1773.73,
    "open": 1520.55,
    "high": 2058.4,
    "low": 1472.35,
    "close": 1895.1,
    "percent_change": 0.2443
  },
  {
    "year": 2021,
    "avg_closing_price": 1799.1,
    "open": 1946.6,
    "high": 1954.4,
    "low": 1678,
    "close": 1783.9,
    "percent_change": -0.0587
  }
]
