module f4f-operator

go 1.13

require (
	github.com/go-logr/logr v0.1.0 // indirect
	github.com/onsi/ginkgo v1.11.0 // indirect
	github.com/onsi/gomega v1.8.1 // indirect
	k8s.io/api v0.17.2 // indirect
	k8s.io/apimachinery v0.17.2
	k8s.io/client-go v0.17.2
	sigs.k8s.io/controller-runtime v0.5.0
)
