<svg xmlns="http://www.w3.org/2000/svg" width="70" height="70" viewBox="0 0 70 70">
    <g fill="none" fill-rule="evenodd">
        <rect width="69" height="69" x=".5" y=".5" fill="#FFF" fill-rule="nonzero" stroke="#B5C1C4" rx="34.5"/>
        <g fill="#B5C1C4">
            <path fill-rule="nonzero" d="M16.156 18c-1.266 0-2.357.809-2.662 2.067l-.524 2.112c.61-.315 1.265-.54 2.007-.584l.262-1.169c.087-.404.48-.719.917-.719.087 0 .13 0 .218.045l37.662 8.852c.305.09.567.315.698.585l.96.18c.306.044.611.134.917.269.043-1.258-.83-2.471-2.139-2.786L16.81 18.09c-.218-.045-.436-.09-.654-.09zM13.903 28.336l.605-2.951c.087-.458.52-.832 1.038-.832.087 0 .13 0 .217.042l19.202 3.74h9.04l-27.896-5.403c-.173-.083-.39-.083-.563-.083-1.34 0-2.508.915-2.81 2.203L12 28.668a4.562 4.562 0 0 1 1.73-.332h.173zM12 50.126a2.8 2.8 0 0 0 2.796 2.788h39.02a2.8 2.8 0 0 0 2.796-2.788v-16.73a2.8 2.8 0 0 0-2.796-2.788h-39.02A2.8 2.8 0 0 0 12 33.396v16.73zM48.485 37.77c-.743-.471-1.224-1.158-1.53-2.016h-2.184a.869.869 0 0 1-.874-.858c0-.471.393-.858.874-.858h2.84c.437 0 .787.3.874.687.175.772.48 1.287 1.005 1.63.917.6 2.097.343 2.14.343a.926.926 0 0 1 .744.172c.218.171.306.386.306.686v8.45c0 .258-.132.515-.306.687a.926.926 0 0 1-.743.171c-.437-.085-2.622-.386-3.102 1.974a.89.89 0 0 1-.874.686H44.77a.869.869 0 0 1-.874-.858c0-.472.393-.858.874-.858h2.185c.305-.858.83-1.544 1.529-2.016.786-.515 1.704-.643 2.403-.686v-6.65c-.699 0-1.573-.17-2.403-.686zM33.847 34.04c4.326 0 7.865 3.475 7.865 7.722s-3.539 7.721-7.865 7.721c-4.326 0-7.865-3.474-7.865-7.721s3.54-7.722 7.865-7.722zm-17.914 3.518c0-.257.13-.515.305-.686.219-.172.481-.215.743-.172.437.086 2.622.386 3.102-1.973a.89.89 0 0 1 .874-.687h2.84c.481 0 .874.387.874.858a.869.869 0 0 1-.873.858h-2.185c-.306.858-.83 1.545-1.53 2.016-.786.515-1.704.644-2.403.687v6.606c.7 0 1.573.171 2.403.686.743.472 1.224 1.158 1.53 2.016h2.185c.48 0 .873.386.873.858a.869.869 0 0 1-.873.858h-2.84a.89.89 0 0 1-.875-.686c-.174-.772-.48-1.287-1.004-1.63-.918-.6-2.098-.343-2.142-.343a.926.926 0 0 1-.742-.172c-.131-.172-.262-.429-.262-.686v-8.408z"/>
            <path d="M35.843 40.276c.226 0 .403.21.403.478 0 .267-.177.477-.403.477h-.451c-.193 1.089-.999 1.91-1.965 1.91h-.645l1.724 2.043c.161.191.161.497 0 .669a.358.358 0 0 1-.29.133.358.358 0 0 1-.29-.133l-2.416-2.865a.536.536 0 0 1-.08-.516c.064-.171.209-.286.37-.286h1.61c.532 0 .967-.401 1.144-.955h-2.738c-.226 0-.403-.21-.403-.477 0-.268.177-.478.403-.478h2.754c-.16-.554-.612-.955-1.143-.955h-1.611c-.226 0-.403-.21-.403-.477 0-.268.177-.478.403-.478h4.027c.226 0 .403.21.403.478 0 .267-.177.477-.403.477h-.805c.177.287.306.611.354.955h.451z"/>
        </g>
    </g>
</svg>
