<svg xmlns="http://www.w3.org/2000/svg" width="70" height="70" viewBox="0 0 70 70">
    <g fill="none" fill-rule="nonzero">
        <rect width="68" height="68" x=".5" y=".5" fill="#FFF" stroke="#B5C1C4" rx="34"/>
        <path fill="#B5C1C4" d="M35 11.29L15.91 24.017h38.18L35 11.29zm0 5a2.273 2.273 0 1 1 0 4.545 2.273 2.273 0 0 1 0-4.545zm-15.455 9.09v17.728h3.637V25.381h-3.637zm9.091 0v17.728h3.637V25.381h-3.637zm9.091 0v17.728h3.637V25.381h-3.637zm9.091 0v17.728h3.637V25.381h-3.637zm-30 19.092v3.636h36.364v-3.636H16.818zm-1.818 5v3.636h40v-3.636H15z"/>
    </g>
</svg>
