<svg xmlns="http://www.w3.org/2000/svg" width="70" height="70" viewBox="0 0 70 70">
    <g fill="none" fill-rule="evenodd">
        <rect width="68" height="68" x=".5" y=".5" fill="#FFF" fill-rule="nonzero" stroke="#B5C1C4"  rx="34"/>
        <path fill="#B5C1C4" fill-rule="nonzero" d="M26.231 15c-.9 0-1.676.575-1.893 1.47l-.372 1.502c.434-.224.9-.384 1.427-.416l.186-.83a.674.674 0 0 1 .652-.512c.062 0 .093 0 .155.032l26.782 6.295a.82.82 0 0 1 .496.415l.683.128c.217.032.435.096.652.192a1.994 1.994 0 0 0-1.52-1.981l-26.783-6.231c-.155-.032-.31-.064-.465-.064zM24.63 22.35l.43-2.099a.752.752 0 0 1 .738-.59c.061 0 .092 0 .154.029l13.655 2.66h6.427l-19.836-3.843c-.123-.059-.277-.059-.4-.059-.954 0-1.784.65-2 1.567l-.522 2.571c.369-.148.769-.236 1.23-.236h.123z"/>
        <path fill="#B5C1C4" fill-rule="nonzero" d="M52.447 45.549c-.063 0-6.715 1.264-10.681 2.023a.616.616 0 0 0-.5.727.61.61 0 0 0 .718.506c3.623-.696 10.525-1.992 10.65-2.023.375-.064.937 0 1.03.379.313 1.106-2.03 2.055-3.122 2.529-.156.063-6.465 2.592-8.433 3.224-2.904.916-5.184 1.043-7.246.316-1.28-.443-6.777-3.414-8.432-3.856-1-.285-1.937-.222-2.686.126l-1.25.695V43.78l3.78-1.138c.03 0 3.154-.98 6.121.664 0 0 3.56 2.023 3.717 2.117.75.38 2.467 1.328 2.686 2.181.03.127.03.285-.125.538-.25.253-1.406.253-5.528-1.201-.563-.19-.969-.348-1.218-.411a.598.598 0 0 0-.75.474.606.606 0 0 0 .469.758c.187.064.624.19 1.124.38 3.31 1.17 6.121 2.023 6.965.727.312-.474.437-1.012.28-1.549-.343-1.422-2.28-2.434-3.31-3.003-.156-.063-3.717-2.086-3.717-2.086-3.435-1.928-6.964-.822-7.09-.79l-3.435 1.043v-.158a2.494 2.494 0 0 0-2.498-2.497H15v14.824h4.997a2.494 2.494 0 0 0 2.499-2.497v-.442l1.78-1.012c.624-.284 1.343-.19 1.842-.063 1.53.41 6.996 3.35 8.37 3.825 1 .347 2.093.537 3.249.537 1.468 0 3.06-.284 4.778-.853 1.999-.633 8.37-3.193 8.526-3.256 1.562-.632 4.498-1.834 3.873-4.046-.312-1.106-1.499-1.454-2.467-1.296z"/>
        <path fill="#B5C1C4" fill-rule="nonzero" d="M23.276 37.845a1.99 1.99 0 0 0 1.988 1.983h27.747A1.99 1.99 0 0 0 55 37.845V25.948a1.99 1.99 0 0 0-1.989-1.982H25.264a1.99 1.99 0 0 0-1.988 1.982v11.897zM49.22 29.06c-.529-.336-.87-.824-1.088-1.434H46.58a.618.618 0 0 1-.622-.61c0-.336.28-.61.622-.61h2.02c.31 0 .559.213.62.488.125.549.342.915.715 1.16.653.426 1.492.243 1.523.243.186-.03.373 0 .528.122.155.122.218.275.218.488v6.01a.714.714 0 0 1-.218.488.659.659 0 0 1-.528.122c-.31-.061-1.864-.275-2.206 1.403a.632.632 0 0 1-.622.488h-2.05a.618.618 0 0 1-.622-.61c0-.336.28-.61.622-.61h1.553c.218-.61.59-1.099 1.088-1.434.559-.366 1.211-.458 1.709-.488v-4.728a3.267 3.267 0 0 1-1.71-.488zm-10.41-2.654c3.077 0 5.594 2.47 5.594 5.49s-2.517 5.491-5.593 5.491-5.593-2.47-5.593-5.49 2.517-5.491 5.593-5.491zm-12.739 2.501c0-.183.094-.366.218-.488a.659.659 0 0 1 .528-.122c.31.061 1.864.275 2.206-1.403a.632.632 0 0 1 .622-.488h2.02c.341 0 .62.274.62.61 0 .335-.279.61-.62.61h-1.554a2.849 2.849 0 0 1-1.088 1.434c-.56.366-1.212.457-1.709.488v4.697c.497 0 1.119.122 1.71.488.527.336.87.824 1.087 1.434h1.553c.342 0 .622.275.622.61 0 .336-.28.61-.622.61h-2.02a.632.632 0 0 1-.62-.488c-.125-.549-.343-.915-.716-1.159-.652-.427-1.491-.244-1.522-.244a.659.659 0 0 1-.528-.122.855.855 0 0 1-.187-.488v-5.979z"/>
        <path fill="#B5C1C4" d="M40.244 30.78c.153 0 .273.143.273.325 0 .182-.12.324-.273.324h-.307c-.131.74-.678 1.298-1.335 1.298h-.438l1.171 1.389c.11.13.11.337 0 .454a.243.243 0 0 1-.197.09.243.243 0 0 1-.197-.09L37.3 32.623a.364.364 0 0 1-.054-.35c.043-.117.142-.195.251-.195h1.095c.361 0 .657-.272.777-.649h-1.86c-.154 0-.274-.142-.274-.324 0-.182.12-.325.273-.325h1.872c-.11-.376-.416-.648-.777-.648h-1.095c-.153 0-.273-.143-.273-.325 0-.181.12-.324.273-.324h2.737c.153 0 .273.143.273.324 0 .182-.12.325-.273.325h-.548c.12.194.208.415.241.648h.307z"/>
    </g>
</svg>
