<svg xmlns="http://www.w3.org/2000/svg" width="18" height="18" viewBox="0 0 18 18">
    <g fill="none" fill-rule="evenodd">
        <circle cx="9" cy="9" r="9" fill="#E8E8E8"/>
        <g stroke="#FFF" stroke-linecap="square">
            <path d="M5.48 5.48l7.071 7.071M5.48 12.462l7.071-7.071"/>
        </g>
    </g>
</svg>
