<svg xmlns="http://www.w3.org/2000/svg" viewBox="0 0 10 10">
  <defs>
    <style>
      .cls-1 {
        fill: #767676;
      }
    </style>
  </defs>
  <path id="Path_216" data-name="Path 216" class="cls-1" d="M10,8.761,6.254,5.015,10,1.239,8.761,0,5.015,3.746,1.239,0,0,1.239,3.746,5.015,0,8.761,1.239,10,5.015,6.254,8.761,10Z"/>
</svg>
