<svg xmlns="http://www.w3.org/2000/svg" width="24" height="24" viewBox="0 0 24 24">
    <g fill="none" fill-rule="nonzero">
        <path fill="#556363" stroke="#556363" stroke-width=".5" d="M9.653 8.63c.06-.057.341-.368.321-.815 0-.214-.1-.564-.46-.874L7.528 5.114a1.35 1.35 0 0 0-.921-.427c-.26-.02-.641.058-1.062.427-.04.04-.802.72-1.082 1.555-.14.369-1.723 4.352 3.326 8.995l.1.097c2.825 2.642 5.35 3.264 7.073 3.264 1.343 0 2.204-.369 2.385-.447.841-.31 1.523-1.088 1.543-1.107.38-.408.42-.797.4-1.05-.04-.485-.38-.796-.48-.854l-1.984-1.826c-.361-.35-.702-.408-.922-.408-.44 0-.761.272-.822.35l-.76.718c-.241.214-.582.272-.863.117a11.104 11.104 0 0 1-2.544-1.788l-.08-.077c-.802-.739-1.443-1.516-1.944-2.39a.715.715 0 0 1 .08-.836l.681-.796zm-1.482 2.021a11.489 11.489 0 0 0 2.084 2.546l.08.077a11.052 11.052 0 0 0 2.725 1.904 1.591 1.591 0 0 0 1.783-.252l.781-.739s.08-.077.2-.097c.04-.02.201-.039.422.175l1.983 1.846.04.02s.18.135.2.349c.02.136-.06.291-.2.466-.16.195-.7.7-1.222.894l-.04.02c-.04.019-3.787 1.787-8.536-2.662l-.12-.097C3.582 10.729 5.145 7.096 5.225 6.96l.02-.039c.2-.622.862-1.224.882-1.243.16-.136.3-.214.44-.214h.02c.201 0 .361.175.361.175l2.024 1.884c.24.214.2.35.2.389a.39.39 0 0 1-.1.194l-.741.797c-.42.486-.5 1.185-.16 1.748z"/>
        <path fill="#BCC31D" d="M11.938 5.503c.22 0 .4-.175.4-.389a.396.396 0 0 0-.4-.388c-.22 0-.401.175-.401.388 0 .214.18.389.4.389zM11.938 6.669c.22 0 .4-.175.4-.389a.396.396 0 0 0-.4-.389c-.22 0-.401.175-.401.389 0 .214.18.389.4.389zM11.938 7.834c.22 0 .4-.175.4-.388a.396.396 0 0 0-.4-.389c-.22 0-.401.175-.401.389 0 .213.18.388.4.388zM11.938 9c.22 0 .4-.175.4-.389a.396.396 0 0 0-.4-.388c-.22 0-.401.175-.401.388 0 .214.18.389.4.389zM15.344 11.448c0 .214.18.389.4.389.221 0 .401-.175.401-.389a.396.396 0 0 0-.4-.389c-.22 0-.401.175-.401.389zM14.142 11.448c0 .214.18.389.4.389.22 0 .401-.175.401-.389a.396.396 0 0 0-.4-.389c-.22 0-.401.175-.401.389zM16.546 11.448c0 .214.18.389.4.389.221 0 .402-.175.402-.389a.396.396 0 0 0-.401-.389c-.22 0-.4.175-.4.389zM18.15 11.837c.22 0 .4-.175.4-.389a.396.396 0 0 0-.4-.389c-.221 0-.402.175-.402.389 0 .214.18.389.401.389zM16.306 6.882a.355.355 0 0 0-.04.544c.08.097.2.136.3.136.1 0 .18-.02.26-.097.161-.136.201-.388.04-.544-.16-.155-.4-.175-.56-.039zM17.227 6.125a.371.371 0 0 0-.06.544c.08.097.2.136.3.136.101 0 .181-.04.261-.098.16-.136.2-.388.06-.544a.416.416 0 0 0-.56-.038zM15.384 7.62c-.16.137-.2.39-.04.545.08.097.2.136.3.136.1 0 .18-.02.261-.098.16-.136.2-.388.04-.544a.416.416 0 0 0-.561-.038zM14.963 8.961c.18-.136.2-.388.06-.544a.399.399 0 0 0-.56-.058.371.371 0 0 0-.06.544c.08.097.2.136.3.136.1.02.18-.02.26-.078zM13.52 9.117c-.16.136-.2.388-.04.544.08.097.2.136.301.136.1 0 .18-.02.26-.098.16-.136.2-.388.06-.544-.14-.155-.4-.174-.58-.038z"/>
    </g>
</svg>
