<svg xmlns="http://www.w3.org/2000/svg" width="60" height="60" viewBox="0 0 60 60">
    <g fill="none" fill-rule="evenodd">
        <path fill="#fff" d="M-601-434H659v777H-601z"/>
        <path stroke="#556363" stroke-linecap="round" stroke-linejoin="round" stroke-width="2.571" d="M48 18v35.143H12V10.56"/>
        <path stroke="#556363" stroke-linecap="round" stroke-linejoin="round" stroke-width="2.571" d="M47.82 17.966H17.495c-3.035 0-5.495-2.48-5.495-5.542 0-3.087 2.46-5.567 5.495-5.567H38.28M20.526 12.411h24.632"/>
        <path fill="#BCC31D" fill-rule="nonzero" stroke="#BCC31D" stroke-width=".857" d="M23.787 37.061a.644.644 0 0 1-.1-.343c0-.39.356-.706.794-.706 3.676 0 6.858-1.479 7.645-3.39h-7.761c-.438 0-.794-.317-.794-.707 0-.39.356-.707.794-.707h7.892c-.404-1.83-2.995-3.349-6.245-3.72h-1.647c-.438 0-.794-.316-.794-.706 0-.243.137-.457.346-.584a.842.842 0 0 1 .564-.21c.573 0 1.133.03 1.675.087h9.48c.437 0 .793.316.793.707 0 .39-.356.706-.793.706H30.9c1.668.935 2.762 2.239 2.964 3.72h1.77c.438 0 .794.317.794.707 0 .39-.356.707-.793.707h-1.852c-.628 2.467-3.764 4.365-7.833 4.737l7.584 7.187c.3.285.285.732-.034 1a.847.847 0 0 1-.544.191.84.84 0 0 1-.578-.222l-8.377-7.94a.662.662 0 0 1-.215-.514z"/>
    </g>
</svg>
