<svg xmlns="http://www.w3.org/2000/svg" width="15" height="14" viewBox="0 0 15 14">
    <path fill="#FFF" fill-rule="nonzero" d="M4.17 5.651a11.489 11.489 0 0 0 2.085 2.546l.08.077a11.052 11.052 0 0 0 2.725 1.904 1.591 1.591 0 0 0 1.783-.252l.781-.739s.08-.077.2-.097c.04-.02.201-.039.422.175l1.983 1.846.04.02s.18.135.2.349c.02.136-.06.291-.2.466-.16.195-.7.7-1.222.894l-.04.02c-.04.019-3.787 1.787-8.536-2.662l-.12-.097C-.418 5.729 1.145 2.096 1.225 1.96l.02-.039c.2-.622.862-1.224.882-1.243.16-.136.3-.214.44-.214.221 0 .381.175.381.175l2.024 1.884c.24.214.2.35.2.389a.39.39 0 0 1-.1.194l-.741.797c-.42.486-.5 1.185-.16 1.748z"/>
</svg>
