<?xml version="1.0" encoding="UTF-8"?>
<svg width="24px" height="20px" viewBox="0 0 24 20" version="1.1" xmlns="http://www.w3.org/2000/svg" xmlns:xlink="http://www.w3.org/1999/xlink">
    <!-- Generator: Sketch 51.1 (57501) - http://www.bohemiancoding.com/sketch -->
    <title>Group 13</title>
    <desc>Created with Sketch.</desc>
    <defs></defs>
    <g id="Symbols" stroke="none" stroke-width="1" fill="none" fill-rule="evenodd" stroke-linecap="round" stroke-linejoin="round">
        <g id="LeftNav_Off" transform="translate(-18.000000, -22.000000)" stroke="#FFFFFF">
            <g id="Group-13">
                <g transform="translate(18.000000, 20.000000)">
                    <path d="M0.75,3 L23.2999446,3" id="Line-2"></path>
                    <path d="M0.75,12 L23.2999446,12" id="Line-2"></path>
                    <path d="M0.75,21 L23.2999446,21" id="Line-2"></path>
                </g>
            </g>
        </g>
    </g>
</svg>