<svg xmlns="http://www.w3.org/2000/svg" width="35" height="35" viewBox="0 0 35 35">
    <g fill="none" fill-rule="evenodd">
        <circle cx="17.5" cy="17.5" r="17.5" fill="#225E9C"/>
        <g stroke-width=".7">
            <path fill="#BCC31D" stroke="#BCC31D" d="M20.156 8.514c-2.6 0-4.712 2.075-4.712 4.624 0 2.549 2.113 4.623 4.712 4.623 2.598 0 4.713-2.074 4.713-4.623 0-2.55-2.115-4.624-4.713-4.624zm0 9.761c-2.887 0-5.236-2.305-5.236-5.137C14.92 10.304 17.269 8 20.156 8c2.888 0 5.237 2.304 5.237 5.138 0 2.832-2.349 5.137-5.237 5.137z"/>
            <path fill="#D7DF23" stroke="#D7DF23" d="M10.524 25.702h2.089v-5.035h-2.089v5.035zm2.35.515h-2.612a.26.26 0 0 1-.262-.258V20.41a.26.26 0 0 1 .262-.257h2.613a.26.26 0 0 1 .262.257v5.55a.26.26 0 0 1-.262.257z"/>
            <path fill="#D7DF23" stroke="#D7DF23" d="M13.137 24.86l7.203 1.482 6.802-2.448a.395.395 0 0 0 .245-.197.338.338 0 0 0 .019-.276c-.2-.573-.856-.885-1.463-.695l-5.59 1.538a.262.262 0 0 1-.166-.009l-4.116-1.582a.256.256 0 0 1 .073-.495l2.105-.175c.727-.062 1.333-.604 1.471-1.265l-1.727.144c-.634.053-1.293-.101-1.904-.444a2.075 2.075 0 0 0-.747-.233c-.61-.078-1.214.077-1.583.389a4.063 4.063 0 0 1-.622.428v3.839zm7.223 2.006a.196.196 0 0 1-.055-.007l-7.484-1.537a.26.26 0 0 1-.208-.252v-4.202c0-.096.054-.183.141-.228.238-.12.462-.267.663-.437.48-.405 1.235-.604 1.992-.51.342.044.667.146.94.299.519.29 1.071.42 1.599.377l2.041-.171a.257.257 0 0 1 .283.257c0 1.046-.888 1.97-1.978 2.06l-.986.083 2.987 1.148 5.496-1.512c.869-.274 1.82.184 2.111 1.02a.847.847 0 0 1-.047.674.906.906 0 0 1-.542.453l-6.863 2.468a.244.244 0 0 1-.09.017z"/>
        </g>
    </g>
</svg>
