<svg xmlns="http://www.w3.org/2000/svg" width="70" height="70" viewBox="0 0 70 70">
    <g fill="none" fill-rule="evenodd">
        <rect width="69" height="69" x=".5" y=".5" fill="#FFF" fill-rule="nonzero" stroke="#B5C1C4" rx="34.5"/>
        <g fill-rule="nonzero">
            <path fill="#000" d="M25.5 35.5c.825 0 1.5-.675 1.5-1.5s-.675-1.5-1.5-1.5v3z"/>
            <path fill="#B5C1C4" d="M19.5 22v3H18v-3h-6v25.5h6v-3h1.5v3H57V22H19.5zm0 21H18v-3h1.5v3zm0-4.5H18v-3h1.5v3zm0-4.5H18v-3h1.5v3zm0-4.5H18v-3h1.5v3zm34.5 15H43.5V43H54v1.5zm0-6H30V37h24v1.5z"/>
        </g>
        <path fill="#FFF" d="M36.4 33.46c.171 0 .307.16.307.365 0 .204-.136.365-.308.365h-.345c-.147.832-.763 1.46-1.502 1.46h-.493l1.318 1.562c.123.146.123.38 0 .51a.273.273 0 0 1-.222.103.273.273 0 0 1-.221-.102l-1.847-2.19a.41.41 0 0 1-.062-.394c.05-.132.16-.22.283-.22h1.232c.406 0 .739-.306.874-.73h-2.093c-.173 0-.308-.16-.308-.364s.135-.365.308-.365h2.105c-.123-.423-.468-.73-.874-.73h-1.231c-.173 0-.308-.16-.308-.365 0-.204.135-.365.308-.365h3.078c.172 0 .308.16.308.365 0 .204-.136.365-.308.365h-.616c.136.219.234.467.271.73h.345z"/>
    </g>
</svg>
