EESchema Schematic File Version 4
EELAYER 30 0
EELAYER END
$Descr A3 16535 11693
encoding utf-8
Sheet 1 1
Title "ESP32-CAN-BOARD"
Date ""
Rev ""
Comp ""
Comment1 ""
Comment2 ""
Comment3 ""
Comment4 ""
$EndDescr
$Comp
L Interface_CAN_LIN:MCP2515-xSO U2
U 1 1 5E03F439
P 7900 5200
F 0 "U2" H 7600 6050 50  0000 C CNN
F 1 "MCP2515-xSO" H 7950 5400 50  0000 C CNN
F 2 "Package_SO:SOIC-18W_7.5x11.6mm_P1.27mm" H 7900 4300 50  0001 C CIN
F 3 "http://ww1.microchip.com/downloads/en/DeviceDoc/21801e.pdf" H 8000 4400 50  0001 C CNN
	1    7900 5200
	1    0    0    -1  
$EndComp
$Comp
L Device:Crystal Y1
U 1 1 5E042F72
P 6350 5500
F 0 "Y1" V 6050 5500 50  0000 C CNN
F 1 "8.00 Mhz" V 5950 5500 50  0000 C CNN
F 2 "" H 6350 5500 50  0001 C CNN
F 3 "~" H 6350 5500 50  0001 C CNN
	1    6350 5500
	0    1    1    0   
$EndComp
$Comp
L Device:C C1
U 1 1 5E043408
P 5950 5300
F 0 "C1" V 6100 5350 50  0000 L CNN
F 1 "22pF" V 6100 5150 50  0000 L CNN
F 2 "kicad-footprints-5.1:C_2010_5025Metric_Pad1.52x2.65mm_HandSolder" H 5988 5150 50  0001 C CNN
F 3 "~" H 5950 5300 50  0001 C CNN
	1    5950 5300
	0    1    1    0   
$EndComp
$Comp
L Device:C C2
U 1 1 5E043722
P 5950 5700
F 0 "C2" V 6100 5750 50  0000 L CNN
F 1 "22pF" V 6100 5550 50  0000 L CNN
F 2 "kicad-footprints-5.1:C_2010_5025Metric_Pad1.52x2.65mm_HandSolder" H 5988 5550 50  0001 C CNN
F 3 "~" H 5950 5700 50  0001 C CNN
	1    5950 5700
	0    1    1    0   
$EndComp
$Comp
L Device:R_US R2
U 1 1 5E04EBC2
P 11050 4550
F 0 "R2" H 10982 4504 50  0000 R CNN
F 1 "120" H 10982 4595 50  0000 R CNN
F 2 "" V 11090 4540 50  0001 C CNN
F 3 "~" H 11050 4550 50  0001 C CNN
	1    11050 4550
	-1   0    0    1   
$EndComp
$Comp
L Device:R_US R1
U 1 1 5E05138D
P 8900 5800
F 0 "R1" V 8695 5800 50  0000 C CNN
F 1 "10K" V 8786 5800 50  0000 C CNN
F 2 "" V 8940 5790 50  0001 C CNN
F 3 "~" H 8900 5800 50  0001 C CNN
	1    8900 5800
	0    1    1    0   
$EndComp
Wire Wire Line
	7300 5400 6850 5400
Wire Wire Line
	6850 5400 6850 5300
Wire Wire Line
	6100 5700 6350 5700
Wire Wire Line
	6850 5500 7300 5500
Wire Wire Line
	6850 5500 6850 5700
Wire Wire Line
	6350 5350 6350 5300
Wire Wire Line
	6100 5300 6350 5300
Connection ~ 6350 5300
Wire Wire Line
	6350 5300 6850 5300
Wire Wire Line
	6350 5650 6350 5700
Connection ~ 6350 5700
Wire Wire Line
	6350 5700 6850 5700
Wire Wire Line
	5800 5300 5700 5300
Wire Wire Line
	5700 5300 5700 5500
Wire Wire Line
	5700 5700 5800 5700
$Comp
L power:GND #PWR03
U 1 1 5E0624EB
P 7900 6800
F 0 "#PWR03" H 7900 6550 50  0001 C CNN
F 1 "GND" H 7905 6627 50  0000 C CNN
F 2 "" H 7900 6800 50  0001 C CNN
F 3 "" H 7900 6800 50  0001 C CNN
	1    7900 6800
	1    0    0    -1  
$EndComp
$Comp
L power:GND #PWR07
U 1 1 5E062ED1
P 10350 5250
F 0 "#PWR07" H 10350 5000 50  0001 C CNN
F 1 "GND" H 10355 5077 50  0000 C CNN
F 2 "" H 10350 5250 50  0001 C CNN
F 3 "" H 10350 5250 50  0001 C CNN
	1    10350 5250
	1    0    0    -1  
$EndComp
Wire Wire Line
	7900 6000 7900 6800
$Comp
L power:GND #PWR01
U 1 1 5E06FFCB
P 5500 5750
F 0 "#PWR01" H 5500 5500 50  0001 C CNN
F 1 "GND" H 5505 5577 50  0000 C CNN
F 2 "" H 5500 5750 50  0001 C CNN
F 3 "" H 5500 5750 50  0001 C CNN
	1    5500 5750
	1    0    0    -1  
$EndComp
Text GLabel 6900 4700 0    50   Input ~ 0
MISO
Text GLabel 6900 4600 0    50   Input ~ 0
MOSI
Text GLabel 6900 4800 0    50   Input ~ 0
CS
Text GLabel 6900 4900 0    50   Input ~ 0
SCK
$Comp
L tja1050:tja1050 U3
U 1 1 5E07B08B
P 10350 4800
F 0 "U3" H 10550 5300 50  0000 C CNN
F 1 "tja1050" H 10550 5200 50  0000 C CNN
F 2 "" H 10500 4800 50  0001 C CNN
F 3 "" H 10500 4800 50  0001 C CNN
	1    10350 4800
	1    0    0    -1  
$EndComp
Wire Wire Line
	10000 4600 8500 4600
Wire Wire Line
	8500 4700 10000 4700
Wire Wire Line
	10350 5150 10350 5250
Wire Wire Line
	7300 4600 6900 4600
Wire Wire Line
	6900 4700 7300 4700
Wire Wire Line
	7300 4800 6900 4800
Wire Wire Line
	6900 4900 7300 4900
Text GLabel 6450 10500 0    50   Input ~ 0
INT
$Comp
L Device:CP1 C3
U 1 1 5E08B65D
P 8200 3900
F 0 "C3" H 8315 3946 50  0000 L CNN
F 1 "10uf/16V" H 8315 3855 50  0000 L CNN
F 2 "kicad-footprints-5.1:C_2816_7142Metric_Pad3.20x4.45mm_HandSolder" H 8200 3900 50  0001 C CNN
F 3 "~" H 8200 3900 50  0001 C CNN
	1    8200 3900
	1    0    0    -1  
$EndComp
$Comp
L Device:C C4
U 1 1 5E08C1D2
P 8900 3900
F 0 "C4" H 8650 3800 50  0000 L CNN
F 1 "0.1uf" H 8600 3900 50  0000 L CNN
F 2 "kicad-footprints-5.1:C_1806_4516Metric" H 8938 3750 50  0001 C CNN
F 3 "~" H 8900 3900 50  0001 C CNN
	1    8900 3900
	-1   0    0    1   
$EndComp
$Comp
L Device:C C5
U 1 1 5E08C9D8
P 9450 3900
F 0 "C5" H 9150 3800 50  0000 L CNN
F 1 "0.1uF" H 9100 3900 50  0000 L CNN
F 2 "kicad-footprints-5.1:C_1806_4516Metric" H 9488 3750 50  0001 C CNN
F 3 "~" H 9450 3900 50  0001 C CNN
	1    9450 3900
	-1   0    0    1   
$EndComp
Connection ~ 7900 3650
Wire Wire Line
	7900 3650 7900 4400
Wire Wire Line
	8200 3750 8200 3650
Wire Wire Line
	8200 3650 7900 3650
Wire Wire Line
	8200 4200 8200 4050
$Comp
L power:GND #PWR04
U 1 1 5E0900DC
P 8900 4300
F 0 "#PWR04" H 8900 4050 50  0001 C CNN
F 1 "GND" H 8905 4127 50  0000 C CNN
F 2 "" H 8900 4300 50  0001 C CNN
F 3 "" H 8900 4300 50  0001 C CNN
	1    8900 4300
	1    0    0    -1  
$EndComp
$Comp
L power:GND #PWR05
U 1 1 5E0911F5
P 9800 5250
F 0 "#PWR05" H 9800 5000 50  0001 C CNN
F 1 "GND" H 9805 5077 50  0000 C CNN
F 2 "" H 9800 5250 50  0001 C CNN
F 3 "" H 9800 5250 50  0001 C CNN
	1    9800 5250
	1    0    0    -1  
$EndComp
$Comp
L Connector_Generic:Conn_01x02 J4
U 1 1 5E09BCFE
P 11750 4750
F 0 "J4" H 11830 4742 50  0000 L CNN
F 1 "Conn_01x02" H 11830 4651 50  0000 L CNN
F 2 "kicad-footprints-5.1:TerminalBlock_MetzConnect_Type055_RT01502HDWU_1x02_P5.00mm_Horizontal" H 11750 4750 50  0001 C CNN
F 3 "~" H 11750 4750 50  0001 C CNN
	1    11750 4750
	1    0    0    -1  
$EndComp
$Comp
L Connector:Conn_01x02_Male J5
U 1 1 5E0AE5F0
P 11800 4450
F 0 "J5" H 11772 4332 50  0000 R CNN
F 1 "Conn_01x02_Male" H 11772 4423 50  0000 R CNN
F 2 "kicad-footprints-5.1:PinSocket_1x02_P2.54mm_Vertical" H 11800 4450 50  0001 C CNN
F 3 "~" H 11800 4450 50  0001 C CNN
	1    11800 4450
	-1   0    0    1   
$EndComp
Wire Wire Line
	10700 4850 11250 4850
Wire Wire Line
	11550 4750 11050 4750
Wire Wire Line
	11600 4450 11250 4450
Wire Wire Line
	11250 4450 11250 4850
Connection ~ 11250 4850
Wire Wire Line
	11250 4850 11550 4850
Wire Wire Line
	11050 4700 11050 4750
Connection ~ 11050 4750
Wire Wire Line
	11050 4750 10700 4750
Wire Wire Line
	11600 4350 11050 4350
Wire Wire Line
	11050 4350 11050 4400
Wire Wire Line
	9450 3750 9450 3650
Wire Wire Line
	9450 3650 8900 3650
Connection ~ 8200 3650
Wire Wire Line
	8900 3750 8900 3650
Connection ~ 8900 3650
Wire Wire Line
	8900 3650 8200 3650
Wire Wire Line
	8900 4050 8900 4200
Connection ~ 8900 4200
Wire Wire Line
	9450 4200 9450 4050
Wire Wire Line
	8900 4200 9450 4200
Wire Wire Line
	8200 4200 8900 4200
Wire Wire Line
	8900 4200 8900 4300
Wire Wire Line
	5700 5500 5500 5500
Wire Wire Line
	5500 5500 5500 5750
Connection ~ 5700 5500
Wire Wire Line
	5700 5500 5700 5700
$Comp
L Connector_Generic:Conn_01x02 J3
U 1 1 5E0D7D89
P 10700 9000
F 0 "J3" H 10780 8992 50  0000 L CNN
F 1 "Conn_01x02" H 10780 8901 50  0000 L CNN
F 2 "kicad-footprints-5.1:PinSocket_1x02_P2.54mm_Vertical" H 10700 9000 50  0001 C CNN
F 3 "~" H 10700 9000 50  0001 C CNN
	1    10700 9000
	1    0    0    -1  
$EndComp
$Comp
L Connector:Conn_01x02_Male J2
U 1 1 5E0D8D74
P 10150 8700
F 0 "J2" V 10212 8744 50  0000 L CNN
F 1 "Conn_01x02_Male" V 10303 8744 50  0000 L CNN
F 2 "kicad-footprints-5.1:PinSocket_1x02_P2.54mm_Vertical" H 10150 8700 50  0001 C CNN
F 3 "~" H 10150 8700 50  0001 C CNN
	1    10150 8700
	0    1    1    0   
$EndComp
Wire Wire Line
	10500 9000 10150 9000
Wire Wire Line
	10150 9000 10150 8900
Wire Wire Line
	10050 8900 10050 9000
$Comp
L power:GND #PWR06
U 1 1 5E0DD56B
P 10150 9150
F 0 "#PWR06" H 10150 8900 50  0001 C CNN
F 1 "GND" H 10155 8977 50  0000 C CNN
F 2 "" H 10150 9150 50  0001 C CNN
F 3 "" H 10150 9150 50  0001 C CNN
	1    10150 9150
	1    0    0    -1  
$EndComp
Wire Wire Line
	10500 9100 10150 9100
Wire Wire Line
	10150 9100 10150 9150
$Comp
L ESP32_shield:ESP32_Devikit U1
U 1 1 5E105611
P 7350 8500
F 0 "U1" H 7800 9650 50  0000 L CNN
F 1 "ESP32_Devikit" H 7550 9550 50  0000 L CNN
F 2 "" H 7800 8650 50  0001 C CNN
F 3 "" H 7800 8650 50  0001 C CNN
	1    7350 8500
	1    0    0    -1  
$EndComp
Text GLabel 6450 8800 0    50   Input ~ 0
MOSI
Text GLabel 6450 8700 0    50   Input ~ 0
MISO
Text GLabel 6450 9300 0    50   Input ~ 0
CS
Text GLabel 6450 8600 0    50   Input ~ 0
SCK
$Comp
L Connector:Conn_01x02_Male J1
U 1 1 5E10EDB7
P 8900 4950
F 0 "J1" V 8962 4994 50  0000 L CNN
F 1 "Conn_01x02_Male" V 8800 4600 50  0000 L CNN
F 2 "kicad-footprints-5.1:PinSocket_1x02_P2.54mm_Vertical" H 8900 4950 50  0001 C CNN
F 3 "~" H 8900 4950 50  0001 C CNN
	1    8900 4950
	0    1    1    0   
$EndComp
Wire Wire Line
	8900 5150 8900 5200
Wire Wire Line
	8800 5150 8800 5200
Wire Wire Line
	8800 5200 8500 5200
Wire Wire Line
	6800 8600 6450 8600
Wire Wire Line
	6450 8700 6800 8700
Wire Wire Line
	6800 8800 6450 8800
Wire Wire Line
	6450 9300 6800 9300
Wire Wire Line
	6800 10500 6450 10500
Text GLabel 7900 3200 1    50   Input ~ 0
VCC
Wire Wire Line
	7900 3200 7900 3650
Text GLabel 10350 3200 1    50   Input ~ 0
VCC
Text GLabel 9250 5800 2    50   Input ~ 0
VCC
Text GLabel 9500 9000 0    50   Input ~ 0
VCC
Wire Wire Line
	9500 9000 10050 9000
Text GLabel 6450 9000 0    50   Input ~ 0
VCC
Wire Wire Line
	6800 8900 6000 8900
Wire Wire Line
	6000 8900 6000 9200
Wire Wire Line
	6000 9200 6800 9200
$Comp
L power:GND #PWR02
U 1 1 5E15D2E0
P 6000 9350
F 0 "#PWR02" H 6000 9100 50  0001 C CNN
F 1 "GND" H 6005 9177 50  0000 C CNN
F 2 "" H 6000 9350 50  0001 C CNN
F 3 "" H 6000 9350 50  0001 C CNN
	1    6000 9350
	1    0    0    -1  
$EndComp
Wire Wire Line
	6000 9200 6000 9350
Connection ~ 6000 9200
Text GLabel 9250 5200 2    50   Input ~ 0
INT
Wire Wire Line
	8900 5200 9250 5200
Wire Wire Line
	8500 5800 8750 5800
Wire Wire Line
	9050 5800 9250 5800
Wire Wire Line
	10350 4450 10350 3200
Wire Wire Line
	6800 9000 6450 9000
Wire Wire Line
	10000 4900 9800 4900
Wire Wire Line
	9800 4900 9800 5250
$EndSCHEMATC
