{
  "__data_type": "UTC ",
  "Appearance_Head": {
    "type": "byte",
    "value": 6
  },
  "Appearance_Type": {
    "type": "word",
    "value": 1
  },
  "ArmorPart_RFoot": {
    "type": "byte",
    "value": 1
  },
  "BodyBag": {
    "type": "byte",
    "value": 0
  },
  "BodyPart_Belt": {
    "type": "byte",
    "value": 0
  },
  "BodyPart_LBicep": {
    "type": "byte",
    "value": 1
  },
  "BodyPart_LFArm": {
    "type": "byte",
    "value": 1
  },
  "BodyPart_LFoot": {
    "type": "byte",
    "value": 1
  },
  "BodyPart_LHand": {
    "type": "byte",
    "value": 1
  },
  "BodyPart_LShin": {
    "type": "byte",
    "value": 1
  },
  "BodyPart_LShoul": {
    "type": "byte",
    "value": 0
  },
  "BodyPart_LThigh": {
    "type": "byte",
    "value": 1
  },
  "BodyPart_Neck": {
    "type": "byte",
    "value": 1
  },
  "BodyPart_Pelvis": {
    "type": "byte",
    "value": 1
  },
  "BodyPart_RBicep": {
    "type": "byte",
    "value": 1
  },
  "BodyPart_RFArm": {
    "type": "byte",
    "value": 1
  },
  "BodyPart_RHand": {
    "type": "byte",
    "value": 1
  },
  "BodyPart_RShin": {
    "type": "byte",
    "value": 1
  },
  "BodyPart_RShoul": {
    "type": "byte",
    "value": 0
  },
  "BodyPart_RThigh": {
    "type": "byte",
    "value": 1
  },
  "BodyPart_Torso": {
    "type": "byte",
    "value": 1
  },
  "Cha": {
    "type": "byte",
    "value": 10
  },
  "ChallengeRating": {
    "type": "float",
    "value": 7.0
  },
  "ClassList": {
    "type": "list",
    "value": [
      {
        "__struct_id": 2,
        "Class": {
          "type": "int",
          "value": 8
        },
        "ClassLevel": {
          "type": "short",
          "value": 10
        }
      },
      {
        "__struct_id": 2,
        "Class": {
          "type": "int",
          "value": 30
        },
        "ClassLevel": {
          "type": "short",
          "value": 1
        }
      }
    ]
  },
  "Color_Hair": {
    "type": "byte",
    "value": 16
  },
  "Color_Skin": {
    "type": "byte",
    "value": 30
  },
  "Color_Tattoo1": {
    "type": "byte",
    "value": 1
  },
  "Color_Tattoo2": {
    "type": "byte",
    "value": 1
  },
  "Comment": {
    "type": "cexostring",
    "value": ""
  },
  "Con": {
    "type": "byte",
    "value": 14
  },
  "Conversation": {
    "type": "resref",
    "value": ""
  },
  "CRAdjust": {
    "type": "int",
    "value": 0
  },
  "CurrentHitPoints": {
    "type": "short",
    "value": 37
  },
  "DecayTime": {
    "type": "dword",
    "value": 0
  },
  "Deity": {
    "type": "cexostring",
    "value": ""
  },
  "Description": {
    "type": "cexolocstring",
    "value": {
      "id": 64101
    }
  },
  "Dex": {
    "type": "byte",
    "value": 18
  },
  "Disarmable": {
    "type": "byte",
    "value": 0
  },
  "Equip_ItemList": {
    "type": "list",
    "value": [
      {
        "__struct_id": 2,
        "EquippedRes": {
          "type": "resref",
          "value": "x2_mdrowar009"
        }
      },
      {
        "__struct_id": 16,
        "EquippedRes": {
          "type": "resref",
          "value": "x2_wdrowls001"
        }
      },
      {
        "__struct_id": 32,
        "EquippedRes": {
          "type": "resref",
          "value": "x2_wdrowls001"
        }
      },
      {
        "__struct_id": 64,
        "EquippedRes": {
          "type": "resref",
          "value": "x2_it_drowcl001"
        }
      },
      {
        "__struct_id": 131072,
        "EquippedRes": {
          "type": "resref",
          "value": "nw_it_creitem057"
        }
      }
    ]
  },
  "FactionID": {
    "type": "word",
    "value": 1
  },
  "FeatList": {
    "type": "list",
    "value": [
      {
        "__struct_id": 1,
        "Feat": {
          "type": "word",
          "value": 1
        }
      },
      {
        "__struct_id": 1,
        "Feat": {
          "type": "word",
          "value": 3
        }
      },
      {
        "__struct_id": 1,
        "Feat": {
          "type": "word",
          "value": 10
        }
      },
      {
        "__struct_id": 1,
        "Feat": {
          "type": "word",
          "value": 206
        }
      },
      {
        "__struct_id": 1,
        "Feat": {
          "type": "word",
          "value": 236
        }
      },
      {
        "__struct_id": 1,
        "Feat": {
          "type": "word",
          "value": 235
        }
      },
      {
        "__struct_id": 1,
        "Feat": {
          "type": "word",
          "value": 240
        }
      },
      {
        "__struct_id": 1,
        "Feat": {
          "type": "word",
          "value": 24
        }
      },
      {
        "__struct_id": 1,
        "Feat": {
          "type": "word",
          "value": 354
        }
      },
      {
        "__struct_id": 1,
        "Feat": {
          "type": "word",
          "value": 226
        }
      },
      {
        "__struct_id": 1,
        "Feat": {
          "type": "word",
          "value": 237
        }
      },
      {
        "__struct_id": 1,
        "Feat": {
          "type": "word",
          "value": 238
        }
      },
      {
        "__struct_id": 1,
        "Feat": {
          "type": "word",
          "value": 239
        }
      },
      {
        "__struct_id": 1,
        "Feat": {
          "type": "word",
          "value": 221
        }
      },
      {
        "__struct_id": 1,
        "Feat": {
          "type": "word",
          "value": 345
        }
      },
      {
        "__struct_id": 1,
        "Feat": {
          "type": "word",
          "value": 346
        }
      },
      {
        "__struct_id": 1,
        "Feat": {
          "type": "word",
          "value": 347
        }
      },
      {
        "__struct_id": 1,
        "Feat": {
          "type": "word",
          "value": 348
        }
      },
      {
        "__struct_id": 1,
        "Feat": {
          "type": "word",
          "value": 41
        }
      },
      {
        "__struct_id": 1,
        "Feat": {
          "type": "word",
          "value": 195
        }
      },
      {
        "__struct_id": 1,
        "Feat": {
          "type": "word",
          "value": 251
        }
      },
      {
        "__struct_id": 1,
        "Feat": {
          "type": "word",
          "value": 256
        }
      },
      {
        "__struct_id": 1,
        "Feat": {
          "type": "word",
          "value": 45
        }
      },
      {
        "__struct_id": 1,
        "Feat": {
          "type": "word",
          "value": 50
        }
      }
    ]
  },
  "FirstName": {
    "type": "cexolocstring",
    "value": {
      "id": 90394
    }
  },
  "fortbonus": {
    "type": "short",
    "value": 0
  },
  "Gender": {
    "type": "byte",
    "value": 0
  },
  "GoodEvil": {
    "type": "byte",
    "value": 0
  },
  "HitPoints": {
    "type": "short",
    "value": 37
  },
  "Int": {
    "type": "byte",
    "value": 10
  },
  "Interruptable": {
    "type": "byte",
    "value": 1
  },
  "IsImmortal": {
    "type": "byte",
    "value": 0
  },
  "IsPC": {
    "type": "byte",
    "value": 0
  },
  "ItemList": {
    "type": "list",
    "value": [
      {
        "__struct_id": 0,
        "InventoryRes": {
          "type": "resref",
          "value": "x1_wmgrenade006"
        },
        "Repos_PosX": {
          "type": "word",
          "value": 0
        },
        "Repos_Posy": {
          "type": "word",
          "value": 0
        }
      },
      {
        "__struct_id": 1,
        "InventoryRes": {
          "type": "resref",
          "value": "x1_wmgrenade006"
        },
        "Repos_PosX": {
          "type": "word",
          "value": 1
        },
        "Repos_Posy": {
          "type": "word",
          "value": 0
        }
      }
    ]
  },
  "LastName": {
    "type": "cexolocstring",
    "value": {}
  },
  "LawfulChaotic": {
    "type": "byte",
    "value": 100
  },
  "Lootable": {
    "type": "byte",
    "value": 0
  },
  "MaxHitPoints": {
    "type": "short",
    "value": 49
  },
  "NaturalAC": {
    "type": "byte",
    "value": 0
  },
  "NoPermDeath": {
    "type": "byte",
    "value": 0
  },
  "PaletteID": {
    "type": "byte",
    "value": 39
  },
  "PerceptionRange": {
    "type": "byte",
    "value": 11
  },
  "Phenotype": {
    "type": "int",
    "value": 0
  },
  "Plot": {
    "type": "byte",
    "value": 0
  },
  "PortraitId": {
    "type": "word",
    "value": 33
  },
  "Race": {
    "type": "byte",
    "value": 1
  },
  "refbonus": {
    "type": "short",
    "value": 0
  },
  "ScriptAttacked": {
    "type": "resref",
    "value": "nw_c2_default5"
  },
  "ScriptDamaged": {
    "type": "resref",
    "value": "nw_c2_default6"
  },
  "ScriptDeath": {
    "type": "resref",
    "value": "nw_c2_default7"
  },
  "ScriptDialogue": {
    "type": "resref",
    "value": "nw_c2_default4"
  },
  "ScriptDisturbed": {
    "type": "resref",
    "value": "nw_c2_default8"
  },
  "ScriptEndRound": {
    "type": "resref",
    "value": "nw_c2_default3"
  },
  "ScriptHeartbeat": {
    "type": "resref",
    "value": "nw_c2_default1"
  },
  "ScriptOnBlocked": {
    "type": "resref",
    "value": "nw_c2_defaulte"
  },
  "ScriptOnNotice": {
    "type": "resref",
    "value": "nw_c2_default2"
  },
  "ScriptRested": {
    "type": "resref",
    "value": "nw_c2_defaulta"
  },
  "ScriptSpawn": {
    "type": "resref",
    "value": "nw_c2_default9"
  },
  "ScriptSpellAt": {
    "type": "resref",
    "value": "nw_c2_defaultb"
  },
  "ScriptUserDefine": {
    "type": "resref",
    "value": "nw_c2_defaultd"
  },
  "SkillList": {
    "type": "list",
    "value": [
      {
        "__struct_id": 0,
        "Rank": {
          "type": "byte",
          "value": 0
        }
      },
      {
        "__struct_id": 0,
        "Rank": {
          "type": "byte",
          "value": 0
        }
      },
      {
        "__struct_id": 0,
        "Rank": {
          "type": "byte",
          "value": 13
        }
      },
      {
        "__struct_id": 0,
        "Rank": {
          "type": "byte",
          "value": 8
        }
      },
      {
        "__struct_id": 0,
        "Rank": {
          "type": "byte",
          "value": 0
        }
      },
      {
        "__struct_id": 0,
        "Rank": {
          "type": "byte",
          "value": 13
        }
      },
      {
        "__struct_id": 0,
        "Rank": {
          "type": "byte",
          "value": 13
        }
      },
      {
        "__struct_id": 0,
        "Rank": {
          "type": "byte",
          "value": 0
        }
      },
      {
        "__struct_id": 0,
        "Rank": {
          "type": "byte",
          "value": 13
        }
      },
      {
        "__struct_id": 0,
        "Rank": {
          "type": "byte",
          "value": 13
        }
      },
      {
        "__struct_id": 0,
        "Rank": {
          "type": "byte",
          "value": 0
        }
      },
      {
        "__struct_id": 0,
        "Rank": {
          "type": "byte",
          "value": 0
        }
      },
      {
        "__struct_id": 0,
        "Rank": {
          "type": "byte",
          "value": 0
        }
      },
      {
        "__struct_id": 0,
        "Rank": {
          "type": "byte",
          "value": 0
        }
      },
      {
        "__struct_id": 0,
        "Rank": {
          "type": "byte",
          "value": 0
        }
      },
      {
        "__struct_id": 0,
        "Rank": {
          "type": "byte",
          "value": 0
        }
      },
      {
        "__struct_id": 0,
        "Rank": {
          "type": "byte",
          "value": 0
        }
      },
      {
        "__struct_id": 0,
        "Rank": {
          "type": "byte",
          "value": 13
        }
      },
      {
        "__struct_id": 0,
        "Rank": {
          "type": "byte",
          "value": 0
        }
      },
      {
        "__struct_id": 0,
        "Rank": {
          "type": "byte",
          "value": 0
        }
      },
      {
        "__struct_id": 0,
        "Rank": {
          "type": "byte",
          "value": 0
        }
      },
      {
        "__struct_id": 0,
        "Rank": {
          "type": "byte",
          "value": 13
        }
      },
      {
        "__struct_id": 0,
        "Rank": {
          "type": "byte",
          "value": 0
        }
      },
      {
        "__struct_id": 0,
        "Rank": {
          "type": "byte",
          "value": 0
        }
      },
      {
        "__struct_id": 0,
        "Rank": {
          "type": "byte",
          "value": 0
        }
      },
      {
        "__struct_id": 0,
        "Rank": {
          "type": "byte",
          "value": 0
        }
      },
      {
        "__struct_id": 0,
        "Rank": {
          "type": "byte",
          "value": 0
        }
      }
    ]
  },
  "SoundSetFile": {
    "type": "word",
    "value": 379
  },
  "SpecAbilityList": {
    "type": "list",
    "value": [
      {
        "__struct_id": 4,
        "Spell": {
          "type": "word",
          "value": 36
        },
        "SpellCasterLevel": {
          "type": "byte",
          "value": 10
        },
        "SpellFlags": {
          "type": "byte",
          "value": 1
        }
      }
    ]
  },
  "StartingPackage": {
    "type": "byte",
    "value": 8
  },
  "Str": {
    "type": "byte",
    "value": 12
  },
  "Subrace": {
    "type": "cexostring",
    "value": "Drow"
  },
  "Tag": {
    "type": "cexostring",
    "value": "X2_MEPHDROW001"
  },
  "Tail": {
    "type": "byte",
    "value": 0
  },
  "TemplateList": {
    "type": "list",
    "value": []
  },
  "TemplateResRef": {
    "type": "resref",
    "value": "x2_mephdrow001"
  },
  "WalkRate": {
    "type": "int",
    "value": 4
  },
  "willbonus": {
    "type": "short",
    "value": 0
  },
  "Wings": {
    "type": "byte",
    "value": 0
  },
  "Wis": {
    "type": "byte",
    "value": 12
  }
}
