{
  "__data_type": "UTT ",
  "AutoRemoveKey": {
    "type": "byte",
    "value": 0
  },
  "Comment": {
    "type": "cexostring",
    "value": ""
  },
  "Cursor": {
    "type": "byte",
    "value": 0
  },
  "DisarmDC": {
    "type": "byte",
    "value": 0
  },
  "Faction": {
    "type": "dword",
    "value": 1
  },
  "HighlightHeight": {
    "type": "float",
    "value": 0.0
  },
  "KeyName": {
    "type": "cexostring",
    "value": "15"
  },
  "LinkedTo": {
    "type": "cexostring",
    "value": ""
  },
  "LinkedToFlags": {
    "type": "byte",
    "value": 0
  },
  "LoadScreenID": {
    "type": "word",
    "value": 0
  },
  "LocalizedName": {
    "type": "cexolocstring",
    "value": {
      "id": 68990
    }
  },
  "OnClick": {
    "type": "resref",
    "value": ""
  },
  "OnDisarm": {
    "type": "resref",
    "value": ""
  },
  "OnTrapTriggered": {
    "type": "resref",
    "value": ""
  },
  "PaletteID": {
    "type": "byte",
    "value": 16
  },
  "PortraitId": {
    "type": "word",
    "value": 0
  },
  "ScriptHeartbeat": {
    "type": "resref",
    "value": ""
  },
  "ScriptOnEnter": {
    "type": "resref",
    "value": "x0_o2_sec_grate1"
  },
  "ScriptOnExit": {
    "type": "resref",
    "value": ""
  },
  "ScriptUserDefine": {
    "type": "resref",
    "value": "x0_o2_sec_reset"
  },
  "Tag": {
    "type": "cexostring",
    "value": "SecretTriggerGrate"
  },
  "TemplateResRef": {
    "type": "resref",
    "value": "x0_sectrigr_grt1"
  },
  "TrapDetectable": {
    "type": "byte",
    "value": 1
  },
  "TrapDetectDC": {
    "type": "byte",
    "value": 0
  },
  "TrapDisarmable": {
    "type": "byte",
    "value": 1
  },
  "TrapFlag": {
    "type": "byte",
    "value": 0
  },
  "TrapOneShot": {
    "type": "byte",
    "value": 1
  },
  "TrapType": {
    "type": "byte",
    "value": 0
  },
  "Type": {
    "type": "int",
    "value": 0
  }
}
