{
  "__data_type": "UTI ",
  "AddCost": {
    "type": "dword",
    "value": 0
  },
  "ArmorPart_Belt": {
    "type": "byte",
    "value": 0
  },
  "ArmorPart_LBicep": {
    "type": "byte",
    "value": 1
  },
  "ArmorPart_LFArm": {
    "type": "byte",
    "value": 1
  },
  "ArmorPart_LFoot": {
    "type": "byte",
    "value": 6
  },
  "ArmorPart_LHand": {
    "type": "byte",
    "value": 1
  },
  "ArmorPart_LShin": {
    "type": "byte",
    "value": 13
  },
  "ArmorPart_LShoul": {
    "type": "byte",
    "value": 0
  },
  "ArmorPart_LThigh": {
    "type": "byte",
    "value": 3
  },
  "ArmorPart_Neck": {
    "type": "byte",
    "value": 1
  },
  "ArmorPart_Pelvis": {
    "type": "byte",
    "value": 3
  },
  "ArmorPart_RBicep": {
    "type": "byte",
    "value": 1
  },
  "ArmorPart_RFArm": {
    "type": "byte",
    "value": 1
  },
  "ArmorPart_RFoot": {
    "type": "byte",
    "value": 6
  },
  "ArmorPart_RHand": {
    "type": "byte",
    "value": 1
  },
  "ArmorPart_RShin": {
    "type": "byte",
    "value": 13
  },
  "ArmorPart_RShoul": {
    "type": "byte",
    "value": 0
  },
  "ArmorPart_RThigh": {
    "type": "byte",
    "value": 3
  },
  "ArmorPart_Torso": {
    "type": "byte",
    "value": 9
  },
  "BaseItem": {
    "type": "int",
    "value": 16
  },
  "Charges": {
    "type": "byte",
    "value": 0
  },
  "Cloth1Color": {
    "type": "byte",
    "value": 23
  },
  "Cloth2Color": {
    "type": "byte",
    "value": 7
  },
  "Comment": {
    "type": "cexostring",
    "value": "1"
  },
  "Cost": {
    "type": "dword",
    "value": 1
  },
  "DescIdentified": {
    "type": "cexolocstring",
    "value": {}
  },
  "Description": {
    "type": "cexolocstring",
    "value": {}
  },
  "Identified": {
    "type": "byte",
    "value": 1
  },
  "Leather1Color": {
    "type": "byte",
    "value": 23
  },
  "Leather2Color": {
    "type": "byte",
    "value": 7
  },
  "LocalizedName": {
    "type": "cexolocstring",
    "value": {
      "id": 13143
    }
  },
  "Metal1Color": {
    "type": "byte",
    "value": 7
  },
  "Metal2Color": {
    "type": "byte",
    "value": 23
  },
  "PaletteID": {
    "type": "byte",
    "value": 58
  },
  "Plot": {
    "type": "byte",
    "value": 0
  },
  "PropertiesList": {
    "type": "list",
    "value": []
  },
  "StackSize": {
    "type": "word",
    "value": 1
  },
  "Stolen": {
    "type": "byte",
    "value": 0
  },
  "Tag": {
    "type": "cexostring",
    "value": "NW_IT_CREITEM146"
  },
  "TemplateResRef": {
    "type": "resref",
    "value": "nw_it_creitem146"
  }
}
