{
  "__data_type": "UTW ",
  "Appearance": {
    "type": "byte",
    "value": 2
  },
  "Comment": {
    "type": "cexostring",
    "value": "This waypoint can be placed to mark a generic exit and entry spot for the beholder flight ability.\r\n\r\nif you place one or more of these waypoints in the same area as any beholder running the x2_ai_behold.nss mini ai script, the beholder will use these to move in combat.\r\n\r\nSee chapter 2 of the official Hordes of the Underdark campaign for more information"
  },
  "Description": {
    "type": "cexolocstring",
    "value": {}
  },
  "HasMapNote": {
    "type": "byte",
    "value": 0
  },
  "LinkedTo": {
    "type": "cexostring",
    "value": ""
  },
  "LocalizedName": {
    "type": "cexolocstring",
    "value": {
      "id": 91379
    }
  },
  "MapNote": {
    "type": "cexolocstring",
    "value": {}
  },
  "MapNoteEnabled": {
    "type": "byte",
    "value": 1
  },
  "PaletteID": {
    "type": "byte",
    "value": 5
  },
  "Tag": {
    "type": "cexostring",
    "value": "X2_WP_BEHOLDER_TUNNEL"
  },
  "TemplateResRef": {
    "type": "resref",
    "value": "x2_wp_behexit"
  }
}
