{
  "__data_type": "UTI ",
  "AddCost": {
    "type": "dword",
    "value": 0
  },
  "BaseItem": {
    "type": "int",
    "value": 20
  },
  "Charges": {
    "type": "byte",
    "value": 0
  },
  "Comment": {
    "type": "cexostring",
    "value": ""
  },
  "Cost": {
    "type": "dword",
    "value": 3960
  },
  "DescIdentified": {
    "type": "cexolocstring",
    "value": {
      "id": 66913
    }
  },
  "Description": {
    "type": "cexolocstring",
    "value": {}
  },
  "Identified": {
    "type": "byte",
    "value": 1
  },
  "LocalizedName": {
    "type": "cexolocstring",
    "value": {
      "id": 66914
    }
  },
  "ModelPart1": {
    "type": "byte",
    "value": 32
  },
  "ModelPart2": {
    "type": "byte",
    "value": 21
  },
  "ModelPart3": {
    "type": "byte",
    "value": 12
  },
  "PaletteID": {
    "type": "byte",
    "value": 27
  },
  "Plot": {
    "type": "byte",
    "value": 0
  },
  "PropertiesList": {
    "type": "list",
    "value": [
      {
        "__struct_id": 0,
        "ChanceAppear": {
          "type": "byte",
          "value": 100
        },
        "CostTable": {
          "type": "byte",
          "value": 24
        },
        "CostValue": {
          "type": "word",
          "value": 0
        },
        "Param1": {
          "type": "byte",
          "value": 10
        },
        "Param1Value": {
          "type": "byte",
          "value": 2
        },
        "PropertyName": {
          "type": "word",
          "value": 48
        },
        "Subtype": {
          "type": "word",
          "value": 19
        }
      }
    ]
  },
  "StackSize": {
    "type": "word",
    "value": 99
  },
  "Stolen": {
    "type": "byte",
    "value": 0
  },
  "Tag": {
    "type": "cexostring",
    "value": "NW_WAMMAR007"
  },
  "TemplateResRef": {
    "type": "resref",
    "value": "nw_wammar007"
  }
}
