{
  "__data_type": "UTI ",
  "AddCost": {
    "type": "dword",
    "value": 0
  },
  "BaseItem": {
    "type": "int",
    "value": 17
  },
  "Charges": {
    "type": "byte",
    "value": 0
  },
  "Cloth1Color": {
    "type": "byte",
    "value": 45
  },
  "Cloth2Color": {
    "type": "byte",
    "value": 45
  },
  "Comment": {
    "type": "cexostring",
    "value": ""
  },
  "Cost": {
    "type": "dword",
    "value": 49003
  },
  "DescIdentified": {
    "type": "cexolocstring",
    "value": {
      "id": 40675
    }
  },
  "Description": {
    "type": "cexolocstring",
    "value": {}
  },
  "Identified": {
    "type": "byte",
    "value": 0
  },
  "Leather1Color": {
    "type": "byte",
    "value": 45
  },
  "Leather2Color": {
    "type": "byte",
    "value": 45
  },
  "LocalizedName": {
    "type": "cexolocstring",
    "value": {
      "id": 40674
    }
  },
  "Metal1Color": {
    "type": "byte",
    "value": 35
  },
  "Metal2Color": {
    "type": "byte",
    "value": 34
  },
  "ModelPart1": {
    "type": "byte",
    "value": 21
  },
  "PaletteID": {
    "type": "byte",
    "value": 9
  },
  "Plot": {
    "type": "byte",
    "value": 0
  },
  "PropertiesList": {
    "type": "list",
    "value": [
      {
        "__struct_id": 0,
        "ChanceAppear": {
          "type": "byte",
          "value": 100
        },
        "CostTable": {
          "type": "byte",
          "value": 0
        },
        "CostValue": {
          "type": "word",
          "value": 0
        },
        "Param1": {
          "type": "byte",
          "value": 255
        },
        "Param1Value": {
          "type": "byte",
          "value": 0
        },
        "PropertyName": {
          "type": "word",
          "value": 75
        },
        "Subtype": {
          "type": "word",
          "value": 0
        }
      },
      {
        "__struct_id": 0,
        "ChanceAppear": {
          "type": "byte",
          "value": 100
        },
        "CostTable": {
          "type": "byte",
          "value": 0
        },
        "CostValue": {
          "type": "word",
          "value": 0
        },
        "Param1": {
          "type": "byte",
          "value": 255
        },
        "Param1Value": {
          "type": "byte",
          "value": 0
        },
        "PropertyName": {
          "type": "word",
          "value": 37
        },
        "Subtype": {
          "type": "word",
          "value": 2
        }
      }
    ]
  },
  "StackSize": {
    "type": "word",
    "value": 1
  },
  "Stolen": {
    "type": "byte",
    "value": 0
  },
  "Tag": {
    "type": "cexostring",
    "value": "X0_ARMHE015"
  },
  "TemplateResRef": {
    "type": "resref",
    "value": "x0_armhe015"
  }
}
