{
  "__data_type": "UTI ",
  "AddCost": {
    "type": "dword",
    "value": 0
  },
  "BaseItem": {
    "type": "int",
    "value": 80
  },
  "Charges": {
    "type": "byte",
    "value": 0
  },
  "Cloth1Color": {
    "type": "byte",
    "value": 175
  },
  "Cloth2Color": {
    "type": "byte",
    "value": 143
  },
  "Comment": {
    "type": "cexostring",
    "value": "1"
  },
  "Cost": {
    "type": "dword",
    "value": 2925
  },
  "Cursed": {
    "type": "byte",
    "value": 0
  },
  "DescIdentified": {
    "type": "cexolocstring",
    "value": {
      "id": 13803
    }
  },
  "Description": {
    "type": "cexolocstring",
    "value": {}
  },
  "Identified": {
    "type": "byte",
    "value": 1
  },
  "Leather1Color": {
    "type": "byte",
    "value": 175
  },
  "Leather2Color": {
    "type": "byte",
    "value": 175
  },
  "LocalizedName": {
    "type": "cexolocstring",
    "value": {
      "id": 13840
    }
  },
  "Metal1Color": {
    "type": "byte",
    "value": 0
  },
  "Metal2Color": {
    "type": "byte",
    "value": 0
  },
  "ModelPart1": {
    "type": "byte",
    "value": 7
  },
  "PaletteID": {
    "type": "byte",
    "value": 18
  },
  "Plot": {
    "type": "byte",
    "value": 0
  },
  "PropertiesList": {
    "type": "list",
    "value": [
      {
        "__struct_id": 0,
        "ChanceAppear": {
          "type": "byte",
          "value": 100
        },
        "CostTable": {
          "type": "byte",
          "value": 2
        },
        "CostValue": {
          "type": "word",
          "value": 2
        },
        "Param1": {
          "type": "byte",
          "value": 255
        },
        "Param1Value": {
          "type": "byte",
          "value": 255
        },
        "PropertyName": {
          "type": "word",
          "value": 1
        },
        "Subtype": {
          "type": "word",
          "value": 0
        }
      }
    ]
  },
  "StackSize": {
    "type": "word",
    "value": 1
  },
  "Stolen": {
    "type": "byte",
    "value": 0
  },
  "Tag": {
    "type": "cexostring",
    "value": "NW_MAARCL088"
  },
  "TemplateResRef": {
    "type": "resref",
    "value": "nw_maarcl088"
  }
}
