{
  "__data_type": "UTI ",
  "AddCost": {
    "type": "dword",
    "value": 0
  },
  "ArmorPart_Belt": {
    "type": "byte",
    "value": 0
  },
  "ArmorPart_LBicep": {
    "type": "byte",
    "value": 3
  },
  "ArmorPart_LFArm": {
    "type": "byte",
    "value": 3
  },
  "ArmorPart_LFoot": {
    "type": "byte",
    "value": 4
  },
  "ArmorPart_LHand": {
    "type": "byte",
    "value": 4
  },
  "ArmorPart_LShin": {
    "type": "byte",
    "value": 14
  },
  "ArmorPart_LShoul": {
    "type": "byte",
    "value": 0
  },
  "ArmorPart_LThigh": {
    "type": "byte",
    "value": 3
  },
  "ArmorPart_Neck": {
    "type": "byte",
    "value": 1
  },
  "ArmorPart_Pelvis": {
    "type": "byte",
    "value": 8
  },
  "ArmorPart_RBicep": {
    "type": "byte",
    "value": 3
  },
  "ArmorPart_RFArm": {
    "type": "byte",
    "value": 3
  },
  "ArmorPart_RFoot": {
    "type": "byte",
    "value": 4
  },
  "ArmorPart_RHand": {
    "type": "byte",
    "value": 4
  },
  "ArmorPart_RShin": {
    "type": "byte",
    "value": 14
  },
  "ArmorPart_RShoul": {
    "type": "byte",
    "value": 0
  },
  "ArmorPart_RThigh": {
    "type": "byte",
    "value": 3
  },
  "ArmorPart_Torso": {
    "type": "byte",
    "value": 32
  },
  "BaseItem": {
    "type": "int",
    "value": 16
  },
  "Charges": {
    "type": "byte",
    "value": 0
  },
  "Cloth1Color": {
    "type": "byte",
    "value": 15
  },
  "Cloth2Color": {
    "type": "byte",
    "value": 15
  },
  "Comment": {
    "type": "cexostring",
    "value": "1"
  },
  "Cost": {
    "type": "dword",
    "value": 8187
  },
  "DescIdentified": {
    "type": "cexolocstring",
    "value": {
      "id": 13809
    }
  },
  "Description": {
    "type": "cexolocstring",
    "value": {}
  },
  "Identified": {
    "type": "byte",
    "value": 1
  },
  "Leather1Color": {
    "type": "byte",
    "value": 13
  },
  "Leather2Color": {
    "type": "byte",
    "value": 15
  },
  "LocalizedName": {
    "type": "cexolocstring",
    "value": {
      "id": 13808
    }
  },
  "Metal1Color": {
    "type": "byte",
    "value": 48
  },
  "Metal2Color": {
    "type": "byte",
    "value": 49
  },
  "PaletteID": {
    "type": "byte",
    "value": 7
  },
  "Plot": {
    "type": "byte",
    "value": 0
  },
  "PropertiesList": {
    "type": "list",
    "value": [
      {
        "__struct_id": 0,
        "ChanceAppear": {
          "type": "byte",
          "value": 100
        },
        "CostTable": {
          "type": "byte",
          "value": 2
        },
        "CostValue": {
          "type": "word",
          "value": 1
        },
        "Param1": {
          "type": "byte",
          "value": 255
        },
        "Param1Value": {
          "type": "byte",
          "value": 255
        },
        "PropertyName": {
          "type": "word",
          "value": 1
        },
        "Subtype": {
          "type": "word",
          "value": 0
        }
      },
      {
        "__struct_id": 0,
        "ChanceAppear": {
          "type": "byte",
          "value": 100
        },
        "CostTable": {
          "type": "byte",
          "value": 7
        },
        "CostValue": {
          "type": "word",
          "value": 2
        },
        "Param1": {
          "type": "byte",
          "value": 255
        },
        "Param1Value": {
          "type": "byte",
          "value": 0
        },
        "PropertyName": {
          "type": "word",
          "value": 23
        },
        "Subtype": {
          "type": "word",
          "value": 7
        }
      },
      {
        "__struct_id": 0,
        "ChanceAppear": {
          "type": "byte",
          "value": 100
        },
        "CostTable": {
          "type": "byte",
          "value": 7
        },
        "CostValue": {
          "type": "word",
          "value": 2
        },
        "Param1": {
          "type": "byte",
          "value": 255
        },
        "Param1Value": {
          "type": "byte",
          "value": 0
        },
        "PropertyName": {
          "type": "word",
          "value": 23
        },
        "Subtype": {
          "type": "word",
          "value": 9
        }
      },
      {
        "__struct_id": 0,
        "ChanceAppear": {
          "type": "byte",
          "value": 100
        },
        "CostTable": {
          "type": "byte",
          "value": 7
        },
        "CostValue": {
          "type": "word",
          "value": 2
        },
        "Param1": {
          "type": "byte",
          "value": 255
        },
        "Param1Value": {
          "type": "byte",
          "value": 0
        },
        "PropertyName": {
          "type": "word",
          "value": 23
        },
        "Subtype": {
          "type": "word",
          "value": 10
        }
      }
    ]
  },
  "StackSize": {
    "type": "word",
    "value": 1
  },
  "Stolen": {
    "type": "byte",
    "value": 0
  },
  "Tag": {
    "type": "cexostring",
    "value": "NW_MAARCL058"
  },
  "TemplateResRef": {
    "type": "resref",
    "value": "nw_maarcl058"
  }
}
