{
  "__data_type": "UTP ",
  "AnimationState": {
    "type": "byte",
    "value": 0
  },
  "Appearance": {
    "type": "dword",
    "value": 88
  },
  "AutoRemoveKey": {
    "type": "byte",
    "value": 0
  },
  "CloseLockDC": {
    "type": "byte",
    "value": 0
  },
  "Comment": {
    "type": "cexostring",
    "value": "Signpost - 2"
  },
  "Conversation": {
    "type": "resref",
    "value": ""
  },
  "CurrentHP": {
    "type": "short",
    "value": 15
  },
  "Description": {
    "type": "cexolocstring",
    "value": {
      "id": 14716
    }
  },
  "DisarmDC": {
    "type": "byte",
    "value": 0
  },
  "Faction": {
    "type": "dword",
    "value": 1
  },
  "Fort": {
    "type": "byte",
    "value": 16
  },
  "Hardness": {
    "type": "byte",
    "value": 5
  },
  "HasInventory": {
    "type": "byte",
    "value": 0
  },
  "HP": {
    "type": "short",
    "value": 15
  },
  "Interruptable": {
    "type": "byte",
    "value": 1
  },
  "KeyName": {
    "type": "cexostring",
    "value": ""
  },
  "KeyRequired": {
    "type": "byte",
    "value": 0
  },
  "Lockable": {
    "type": "byte",
    "value": 1
  },
  "Locked": {
    "type": "byte",
    "value": 0
  },
  "LocName": {
    "type": "cexolocstring",
    "value": {
      "id": 5732
    }
  },
  "OnClosed": {
    "type": "resref",
    "value": ""
  },
  "OnDamaged": {
    "type": "resref",
    "value": ""
  },
  "OnDeath": {
    "type": "resref",
    "value": ""
  },
  "OnDisarm": {
    "type": "resref",
    "value": ""
  },
  "OnHeartbeat": {
    "type": "resref",
    "value": ""
  },
  "OnInvDisturbed": {
    "type": "resref",
    "value": ""
  },
  "OnLock": {
    "type": "resref",
    "value": ""
  },
  "OnMeleeAttacked": {
    "type": "resref",
    "value": ""
  },
  "OnOpen": {
    "type": "resref",
    "value": ""
  },
  "OnSpellCastAt": {
    "type": "resref",
    "value": ""
  },
  "OnTrapTriggered": {
    "type": "resref",
    "value": ""
  },
  "OnUnlock": {
    "type": "resref",
    "value": ""
  },
  "OnUsed": {
    "type": "resref",
    "value": ""
  },
  "OnUserDefined": {
    "type": "resref",
    "value": ""
  },
  "OpenLockDC": {
    "type": "byte",
    "value": 0
  },
  "PaletteID": {
    "type": "byte",
    "value": 12
  },
  "Plot": {
    "type": "byte",
    "value": 0
  },
  "Portrait": {
    "type": "resref",
    "value": "po_plc_l06_"
  },
  "Ref": {
    "type": "byte",
    "value": 0
  },
  "Tag": {
    "type": "cexostring",
    "value": "Signpost - 2"
  },
  "TemplateResRef": {
    "type": "resref",
    "value": "plc_signpost2"
  },
  "TrapDetectable": {
    "type": "byte",
    "value": 1
  },
  "TrapDetectDC": {
    "type": "byte",
    "value": 0
  },
  "TrapDisarmable": {
    "type": "byte",
    "value": 1
  },
  "TrapFlag": {
    "type": "byte",
    "value": 0
  },
  "TrapOneShot": {
    "type": "byte",
    "value": 1
  },
  "TrapType": {
    "type": "byte",
    "value": 1
  },
  "Type": {
    "type": "byte",
    "value": 0
  },
  "Useable": {
    "type": "byte",
    "value": 0
  },
  "Will": {
    "type": "byte",
    "value": 0
  }
}
