{
  "__data_type": "UTI ",
  "AddCost": {
    "type": "dword",
    "value": 20000
  },
  "ArmorPart_Belt": {
    "type": "byte",
    "value": 4
  },
  "ArmorPart_LBicep": {
    "type": "byte",
    "value": 4
  },
  "ArmorPart_LFArm": {
    "type": "byte",
    "value": 4
  },
  "ArmorPart_LFoot": {
    "type": "byte",
    "value": 4
  },
  "ArmorPart_LHand": {
    "type": "byte",
    "value": 4
  },
  "ArmorPart_LShin": {
    "type": "byte",
    "value": 4
  },
  "ArmorPart_LShoul": {
    "type": "byte",
    "value": 4
  },
  "ArmorPart_LThigh": {
    "type": "byte",
    "value": 4
  },
  "ArmorPart_Neck": {
    "type": "byte",
    "value": 4
  },
  "ArmorPart_Pelvis": {
    "type": "byte",
    "value": 4
  },
  "ArmorPart_RBicep": {
    "type": "byte",
    "value": 4
  },
  "ArmorPart_RFArm": {
    "type": "byte",
    "value": 4
  },
  "ArmorPart_RFoot": {
    "type": "byte",
    "value": 4
  },
  "ArmorPart_RHand": {
    "type": "byte",
    "value": 4
  },
  "ArmorPart_Robe": {
    "type": "byte",
    "value": 3
  },
  "ArmorPart_RShin": {
    "type": "byte",
    "value": 4
  },
  "ArmorPart_RShoul": {
    "type": "byte",
    "value": 4
  },
  "ArmorPart_RThigh": {
    "type": "byte",
    "value": 4
  },
  "ArmorPart_Torso": {
    "type": "byte",
    "value": 1
  },
  "BaseItem": {
    "type": "int",
    "value": 16
  },
  "Charges": {
    "type": "byte",
    "value": 0
  },
  "Cloth1Color": {
    "type": "byte",
    "value": 26
  },
  "Cloth2Color": {
    "type": "byte",
    "value": 0
  },
  "Comment": {
    "type": "cexostring",
    "value": "This robe is capable of storing two spells."
  },
  "Cost": {
    "type": "dword",
    "value": 51452
  },
  "Cursed": {
    "type": "byte",
    "value": 0
  },
  "DescIdentified": {
    "type": "cexolocstring",
    "value": {
      "id": 91091
    }
  },
  "Description": {
    "type": "cexolocstring",
    "value": {
      "id": 91088
    }
  },
  "Identified": {
    "type": "byte",
    "value": 0
  },
  "Leather1Color": {
    "type": "byte",
    "value": 44
  },
  "Leather2Color": {
    "type": "byte",
    "value": 0
  },
  "LocalizedName": {
    "type": "cexolocstring",
    "value": {
      "id": 91090
    }
  },
  "Metal1Color": {
    "type": "byte",
    "value": 0
  },
  "Metal2Color": {
    "type": "byte",
    "value": 0
  },
  "PaletteID": {
    "type": "byte",
    "value": 5
  },
  "Plot": {
    "type": "byte",
    "value": 0
  },
  "PropertiesList": {
    "type": "list",
    "value": [
      {
        "__struct_id": 0,
        "ChanceAppear": {
          "type": "byte",
          "value": 100
        },
        "CostTable": {
          "type": "byte",
          "value": 2
        },
        "CostValue": {
          "type": "word",
          "value": 5
        },
        "Param1": {
          "type": "byte",
          "value": 255
        },
        "Param1Value": {
          "type": "byte",
          "value": 0
        },
        "PropertyName": {
          "type": "word",
          "value": 1
        },
        "Subtype": {
          "type": "word",
          "value": 0
        }
      },
      {
        "__struct_id": 0,
        "ChanceAppear": {
          "type": "byte",
          "value": 100
        },
        "CostTable": {
          "type": "byte",
          "value": 3
        },
        "CostValue": {
          "type": "word",
          "value": 13
        },
        "Param1": {
          "type": "byte",
          "value": 255
        },
        "Param1Value": {
          "type": "byte",
          "value": 0
        },
        "PropertyName": {
          "type": "word",
          "value": 15
        },
        "Subtype": {
          "type": "word",
          "value": 524
        }
      },
      {
        "__struct_id": 0,
        "ChanceAppear": {
          "type": "byte",
          "value": 100
        },
        "CostTable": {
          "type": "byte",
          "value": 3
        },
        "CostValue": {
          "type": "word",
          "value": 8
        },
        "Param1": {
          "type": "byte",
          "value": 255
        },
        "Param1Value": {
          "type": "byte",
          "value": 0
        },
        "PropertyName": {
          "type": "word",
          "value": 15
        },
        "Subtype": {
          "type": "word",
          "value": 522
        }
      }
    ]
  },
  "StackSize": {
    "type": "word",
    "value": 1
  },
  "Stolen": {
    "type": "byte",
    "value": 0
  },
  "Tag": {
    "type": "cexostring",
    "value": "x2_sequencer2"
  },
  "TemplateResRef": {
    "type": "resref",
    "value": "x2_sequencer2"
  }
}
