{
  "__data_type": "UTI ",
  "AddCost": {
    "type": "dword",
    "value": 5
  },
  "BaseItem": {
    "type": "int",
    "value": 29
  },
  "Charges": {
    "type": "byte",
    "value": 0
  },
  "Comment": {
    "type": "cexostring",
    "value": ""
  },
  "Cost": {
    "type": "dword",
    "value": 5
  },
  "DescIdentified": {
    "type": "cexolocstring",
    "value": {
      "id": 58558
    }
  },
  "Description": {
    "type": "cexolocstring",
    "value": {}
  },
  "Identified": {
    "type": "byte",
    "value": 1
  },
  "LocalizedName": {
    "type": "cexolocstring",
    "value": {
      "id": 13378
    }
  },
  "ModelPart1": {
    "type": "byte",
    "value": 3
  },
  "PaletteID": {
    "type": "byte",
    "value": 23
  },
  "Plot": {
    "type": "byte",
    "value": 0
  },
  "PropertiesList": {
    "type": "list",
    "value": []
  },
  "StackSize": {
    "type": "word",
    "value": 1
  },
  "Stolen": {
    "type": "byte",
    "value": 0
  },
  "Tag": {
    "type": "cexostring",
    "value": "NW_IT_MMIDMISC05"
  },
  "TemplateResRef": {
    "type": "resref",
    "value": "nw_it_mmidmisc05"
  }
}
