{
  "__data_type": "UTI ",
  "AddCost": {
    "type": "dword",
    "value": 499
  },
  "BaseItem": {
    "type": "int",
    "value": 19
  },
  "Charges": {
    "type": "byte",
    "value": 0
  },
  "Comment": {
    "type": "cexostring",
    "value": "1"
  },
  "Cost": {
    "type": "dword",
    "value": 500
  },
  "DescIdentified": {
    "type": "cexolocstring",
    "value": {}
  },
  "Description": {
    "type": "cexolocstring",
    "value": {}
  },
  "Identified": {
    "type": "byte",
    "value": 1
  },
  "LocalizedName": {
    "type": "cexolocstring",
    "value": {
      "id": 13407
    }
  },
  "ModelPart1": {
    "type": "byte",
    "value": 18
  },
  "PaletteID": {
    "type": "byte",
    "value": 21
  },
  "Plot": {
    "type": "byte",
    "value": 0
  },
  "PropertiesList": {
    "type": "list",
    "value": []
  },
  "StackSize": {
    "type": "word",
    "value": 1
  },
  "Stolen": {
    "type": "byte",
    "value": 0
  },
  "Tag": {
    "type": "cexostring",
    "value": "NW_IT_MNECK021"
  },
  "TemplateResRef": {
    "type": "resref",
    "value": "nw_it_mneck021"
  }
}
