{
  "__data_type": "UTE ",
  "Active": {
    "type": "byte",
    "value": 1
  },
  "Comment": {
    "type": "cexostring",
    "value": ""
  },
  "CreatureList": {
    "type": "list",
    "value": [
      {
        "__struct_id": 0,
        "Appearance": {
          "type": "int",
          "value": 205
        },
        "CR": {
          "type": "float",
          "value": 8.0
        },
        "ResRef": {
          "type": "resref",
          "value": "nw_grayrend"
        },
        "SingleSpawn": {
          "type": "byte",
          "value": 0
        }
      }
    ]
  },
  "Difficulty": {
    "type": "int",
    "value": 1
  },
  "DifficultyIndex": {
    "type": "int",
    "value": 2
  },
  "Faction": {
    "type": "dword",
    "value": 1
  },
  "LocalizedName": {
    "type": "cexolocstring",
    "value": {
      "id": 14467
    }
  },
  "MaxCreatures": {
    "type": "int",
    "value": 5
  },
  "OnEntered": {
    "type": "resref",
    "value": ""
  },
  "OnExhausted": {
    "type": "resref",
    "value": ""
  },
  "OnExit": {
    "type": "resref",
    "value": ""
  },
  "OnHeartbeat": {
    "type": "resref",
    "value": ""
  },
  "OnUserDefined": {
    "type": "resref",
    "value": ""
  },
  "PaletteID": {
    "type": "byte",
    "value": 7
  },
  "PlayerOnly": {
    "type": "byte",
    "value": 1
  },
  "RecCreatures": {
    "type": "int",
    "value": 3
  },
  "Reset": {
    "type": "byte",
    "value": 0
  },
  "ResetTime": {
    "type": "int",
    "value": 60
  },
  "Respawns": {
    "type": "int",
    "value": 0
  },
  "SpawnOption": {
    "type": "int",
    "value": 1
  },
  "Tag": {
    "type": "cexostring",
    "value": "NW_BEAST"
  },
  "TemplateResRef": {
    "type": "resref",
    "value": "nw_beast"
  }
}
