{
  "__data_type": "UTI ",
  "AddCost": {
    "type": "dword",
    "value": 0
  },
  "ArmorPart_Belt": {
    "type": "byte",
    "value": 9
  },
  "ArmorPart_LBicep": {
    "type": "byte",
    "value": 3
  },
  "ArmorPart_LFArm": {
    "type": "byte",
    "value": 10
  },
  "ArmorPart_LFoot": {
    "type": "byte",
    "value": 6
  },
  "ArmorPart_LHand": {
    "type": "byte",
    "value": 1
  },
  "ArmorPart_LShin": {
    "type": "byte",
    "value": 14
  },
  "ArmorPart_LShoul": {
    "type": "byte",
    "value": 23
  },
  "ArmorPart_LThigh": {
    "type": "byte",
    "value": 15
  },
  "ArmorPart_Neck": {
    "type": "byte",
    "value": 1
  },
  "ArmorPart_Pelvis": {
    "type": "byte",
    "value": 3
  },
  "ArmorPart_RBicep": {
    "type": "byte",
    "value": 3
  },
  "ArmorPart_RFArm": {
    "type": "byte",
    "value": 10
  },
  "ArmorPart_RFoot": {
    "type": "byte",
    "value": 6
  },
  "ArmorPart_RHand": {
    "type": "byte",
    "value": 1
  },
  "ArmorPart_RShin": {
    "type": "byte",
    "value": 14
  },
  "ArmorPart_RShoul": {
    "type": "byte",
    "value": 23
  },
  "ArmorPart_RThigh": {
    "type": "byte",
    "value": 15
  },
  "ArmorPart_Torso": {
    "type": "byte",
    "value": 19
  },
  "BaseItem": {
    "type": "int",
    "value": 16
  },
  "Charges": {
    "type": "byte",
    "value": 0
  },
  "Cloth1Color": {
    "type": "byte",
    "value": 7
  },
  "Cloth2Color": {
    "type": "byte",
    "value": 23
  },
  "Comment": {
    "type": "cexostring",
    "value": "\r\n"
  },
  "Cost": {
    "type": "dword",
    "value": 4940
  },
  "DescIdentified": {
    "type": "cexolocstring",
    "value": {
      "id": 40077
    }
  },
  "Description": {
    "type": "cexolocstring",
    "value": {}
  },
  "Identified": {
    "type": "byte",
    "value": 0
  },
  "Leather1Color": {
    "type": "byte",
    "value": 23
  },
  "Leather2Color": {
    "type": "byte",
    "value": 7
  },
  "LocalizedName": {
    "type": "cexolocstring",
    "value": {
      "id": 40075
    }
  },
  "Metal1Color": {
    "type": "byte",
    "value": 51
  },
  "Metal2Color": {
    "type": "byte",
    "value": 25
  },
  "PaletteID": {
    "type": "byte",
    "value": 5
  },
  "Plot": {
    "type": "byte",
    "value": 0
  },
  "PropertiesList": {
    "type": "list",
    "value": [
      {
        "__struct_id": 0,
        "ChanceAppear": {
          "type": "byte",
          "value": 100
        },
        "CostTable": {
          "type": "byte",
          "value": 3
        },
        "CostValue": {
          "type": "word",
          "value": 8
        },
        "Param1": {
          "type": "byte",
          "value": 255
        },
        "Param1Value": {
          "type": "byte",
          "value": 0
        },
        "PropertyName": {
          "type": "word",
          "value": 15
        },
        "Subtype": {
          "type": "word",
          "value": 174
        }
      },
      {
        "__struct_id": 0,
        "ChanceAppear": {
          "type": "byte",
          "value": 100
        },
        "CostTable": {
          "type": "byte",
          "value": 16
        },
        "CostValue": {
          "type": "word",
          "value": 97
        },
        "Param1": {
          "type": "byte",
          "value": 255
        },
        "Param1Value": {
          "type": "byte",
          "value": 0
        },
        "PropertyName": {
          "type": "word",
          "value": 53
        },
        "Subtype": {
          "type": "word",
          "value": 0
        }
      },
      {
        "__struct_id": 0,
        "ChanceAppear": {
          "type": "byte",
          "value": 100
        },
        "CostTable": {
          "type": "byte",
          "value": 18
        },
        "CostValue": {
          "type": "word",
          "value": 3
        },
        "Param1": {
          "type": "byte",
          "value": 9
        },
        "Param1Value": {
          "type": "byte",
          "value": 3
        },
        "PropertyName": {
          "type": "word",
          "value": 44
        },
        "Subtype": {
          "type": "word",
          "value": 0
        }
      },
      {
        "__struct_id": 0,
        "ChanceAppear": {
          "type": "byte",
          "value": 100
        },
        "CostTable": {
          "type": "byte",
          "value": 25
        },
        "CostValue": {
          "type": "word",
          "value": 7
        },
        "Param1": {
          "type": "byte",
          "value": 255
        },
        "Param1Value": {
          "type": "byte",
          "value": 0
        },
        "PropertyName": {
          "type": "word",
          "value": 52
        },
        "Subtype": {
          "type": "word",
          "value": 1
        }
      },
      {
        "__struct_id": 0,
        "ChanceAppear": {
          "type": "byte",
          "value": 100
        },
        "CostTable": {
          "type": "byte",
          "value": 0
        },
        "CostValue": {
          "type": "word",
          "value": 0
        },
        "Param1": {
          "type": "byte",
          "value": 255
        },
        "Param1Value": {
          "type": "byte",
          "value": 0
        },
        "PropertyName": {
          "type": "word",
          "value": 63
        },
        "Subtype": {
          "type": "word",
          "value": 9
        }
      },
      {
        "__struct_id": 0,
        "ChanceAppear": {
          "type": "byte",
          "value": 100
        },
        "CostTable": {
          "type": "byte",
          "value": 0
        },
        "CostValue": {
          "type": "word",
          "value": 0
        },
        "Param1": {
          "type": "byte",
          "value": 255
        },
        "Param1Value": {
          "type": "byte",
          "value": 0
        },
        "PropertyName": {
          "type": "word",
          "value": 63
        },
        "Subtype": {
          "type": "word",
          "value": 10
        }
      }
    ]
  },
  "StackSize": {
    "type": "word",
    "value": 1
  },
  "Stolen": {
    "type": "byte",
    "value": 0
  },
  "Tag": {
    "type": "cexostring",
    "value": "X1_MCLOTH001"
  },
  "TemplateResRef": {
    "type": "resref",
    "value": "x1_mcloth001"
  }
}
