{
  "__data_type": "UTC ",
  "Appearance_Head": {
    "type": "byte",
    "value": 3
  },
  "Appearance_Type": {
    "type": "word",
    "value": 3
  },
  "ArmorPart_RFoot": {
    "type": "byte",
    "value": 1
  },
  "BodyBag": {
    "type": "byte",
    "value": 0
  },
  "BodyPart_Belt": {
    "type": "byte",
    "value": 0
  },
  "BodyPart_LBicep": {
    "type": "byte",
    "value": 1
  },
  "BodyPart_LFArm": {
    "type": "byte",
    "value": 1
  },
  "BodyPart_LFoot": {
    "type": "byte",
    "value": 1
  },
  "BodyPart_LHand": {
    "type": "byte",
    "value": 1
  },
  "BodyPart_LShin": {
    "type": "byte",
    "value": 1
  },
  "BodyPart_LShoul": {
    "type": "byte",
    "value": 0
  },
  "BodyPart_LThigh": {
    "type": "byte",
    "value": 1
  },
  "BodyPart_Neck": {
    "type": "byte",
    "value": 1
  },
  "BodyPart_Pelvis": {
    "type": "byte",
    "value": 1
  },
  "BodyPart_RBicep": {
    "type": "byte",
    "value": 1
  },
  "BodyPart_RFArm": {
    "type": "byte",
    "value": 1
  },
  "BodyPart_RHand": {
    "type": "byte",
    "value": 1
  },
  "BodyPart_RShin": {
    "type": "byte",
    "value": 1
  },
  "BodyPart_RShoul": {
    "type": "byte",
    "value": 0
  },
  "BodyPart_RThigh": {
    "type": "byte",
    "value": 1
  },
  "BodyPart_Torso": {
    "type": "byte",
    "value": 1
  },
  "Cha": {
    "type": "byte",
    "value": 10
  },
  "ChallengeRating": {
    "type": "float",
    "value": 3.0
  },
  "ClassList": {
    "type": "list",
    "value": [
      {
        "__struct_id": 2,
        "Class": {
          "type": "int",
          "value": 8
        },
        "ClassLevel": {
          "type": "short",
          "value": 4
        }
      }
    ]
  },
  "Color_Hair": {
    "type": "byte",
    "value": 5
  },
  "Color_Skin": {
    "type": "byte",
    "value": 2
  },
  "Color_Tattoo1": {
    "type": "byte",
    "value": 1
  },
  "Color_Tattoo2": {
    "type": "byte",
    "value": 1
  },
  "Comment": {
    "type": "cexostring",
    "value": "Tomi Level 4"
  },
  "Con": {
    "type": "byte",
    "value": 16
  },
  "Conversation": {
    "type": "resref",
    "value": "nw_hen_gal"
  },
  "CRAdjust": {
    "type": "int",
    "value": 0
  },
  "CurrentHitPoints": {
    "type": "short",
    "value": 24
  },
  "Deity": {
    "type": "cexostring",
    "value": ""
  },
  "Description": {
    "type": "cexolocstring",
    "value": {
      "id": 57655
    }
  },
  "Dex": {
    "type": "byte",
    "value": 19
  },
  "Disarmable": {
    "type": "byte",
    "value": 0
  },
  "Equip_ItemList": {
    "type": "list",
    "value": [
      {
        "__struct_id": 2,
        "EquippedRes": {
          "type": "resref",
          "value": "nw_aarcl002"
        }
      },
      {
        "__struct_id": 8,
        "EquippedRes": {
          "type": "resref",
          "value": "nw_it_mbracer001"
        }
      },
      {
        "__struct_id": 16,
        "EquippedRes": {
          "type": "resref",
          "value": "nw_wspmku002"
        }
      },
      {
        "__struct_id": 131072,
        "EquippedRes": {
          "type": "resref",
          "value": "nw_hen_hide"
        }
      }
    ]
  },
  "FactionID": {
    "type": "word",
    "value": 3
  },
  "FeatList": {
    "type": "list",
    "value": [
      {
        "__struct_id": 1,
        "Feat": {
          "type": "word",
          "value": 3
        }
      },
      {
        "__struct_id": 1,
        "Feat": {
          "type": "word",
          "value": 10
        }
      },
      {
        "__struct_id": 1,
        "Feat": {
          "type": "word",
          "value": 206
        }
      },
      {
        "__struct_id": 1,
        "Feat": {
          "type": "word",
          "value": 249
        }
      },
      {
        "__struct_id": 1,
        "Feat": {
          "type": "word",
          "value": 248
        }
      },
      {
        "__struct_id": 1,
        "Feat": {
          "type": "word",
          "value": 237
        }
      },
      {
        "__struct_id": 1,
        "Feat": {
          "type": "word",
          "value": 247
        }
      },
      {
        "__struct_id": 1,
        "Feat": {
          "type": "word",
          "value": 221
        }
      },
      {
        "__struct_id": 1,
        "Feat": {
          "type": "word",
          "value": 345
        }
      },
      {
        "__struct_id": 1,
        "Feat": {
          "type": "word",
          "value": 41
        }
      },
      {
        "__struct_id": 1,
        "Feat": {
          "type": "word",
          "value": 195
        }
      },
      {
        "__struct_id": 1,
        "Feat": {
          "type": "word",
          "value": 42
        }
      },
      {
        "__struct_id": 1,
        "Feat": {
          "type": "word",
          "value": 44
        }
      },
      {
        "__struct_id": 1,
        "Feat": {
          "type": "word",
          "value": 50
        }
      }
    ]
  },
  "FirstName": {
    "type": "cexolocstring",
    "value": {
      "id": 12608
    }
  },
  "fortbonus": {
    "type": "short",
    "value": 0
  },
  "Gender": {
    "type": "byte",
    "value": 0
  },
  "GoodEvil": {
    "type": "byte",
    "value": 50
  },
  "HitPoints": {
    "type": "short",
    "value": 24
  },
  "Int": {
    "type": "byte",
    "value": 12
  },
  "Interruptable": {
    "type": "byte",
    "value": 1
  },
  "IsPC": {
    "type": "byte",
    "value": 0
  },
  "ItemList": {
    "type": "list",
    "value": [
      {
        "__struct_id": 0,
        "InventoryRes": {
          "type": "resref",
          "value": "nw_it_mpotion020"
        },
        "Repos_PosX": {
          "type": "word",
          "value": 0
        },
        "Repos_Posy": {
          "type": "word",
          "value": 0
        }
      },
      {
        "__struct_id": 1,
        "InventoryRes": {
          "type": "resref",
          "value": "nw_it_mpotion020"
        },
        "Repos_PosX": {
          "type": "word",
          "value": 1
        },
        "Repos_Posy": {
          "type": "word",
          "value": 0
        }
      },
      {
        "__struct_id": 2,
        "InventoryRes": {
          "type": "resref",
          "value": "nw_it_mpotion020"
        },
        "Repos_PosX": {
          "type": "word",
          "value": 2
        },
        "Repos_Posy": {
          "type": "word",
          "value": 0
        }
      },
      {
        "__struct_id": 3,
        "InventoryRes": {
          "type": "resref",
          "value": "nw_it_mpotion020"
        },
        "Repos_PosX": {
          "type": "word",
          "value": 3
        },
        "Repos_Posy": {
          "type": "word",
          "value": 0
        }
      },
      {
        "__struct_id": 4,
        "InventoryRes": {
          "type": "resref",
          "value": "nw_it_mpotion020"
        },
        "Repos_PosX": {
          "type": "word",
          "value": 4
        },
        "Repos_Posy": {
          "type": "word",
          "value": 0
        }
      },
      {
        "__struct_id": 5,
        "InventoryRes": {
          "type": "resref",
          "value": "nw_hen_galsb2"
        },
        "Repos_PosX": {
          "type": "word",
          "value": 5
        },
        "Repos_Posy": {
          "type": "word",
          "value": 0
        }
      }
    ]
  },
  "LastName": {
    "type": "cexolocstring",
    "value": {
      "id": 12609
    }
  },
  "LawfulChaotic": {
    "type": "byte",
    "value": 0
  },
  "MaxHitPoints": {
    "type": "short",
    "value": 36
  },
  "NaturalAC": {
    "type": "byte",
    "value": 0
  },
  "NoPermDeath": {
    "type": "byte",
    "value": 1
  },
  "PaletteID": {
    "type": "byte",
    "value": 45
  },
  "PerceptionRange": {
    "type": "byte",
    "value": 11
  },
  "Phenotype": {
    "type": "int",
    "value": 0
  },
  "Plot": {
    "type": "byte",
    "value": 0
  },
  "PortraitId": {
    "type": "word",
    "value": 547
  },
  "Race": {
    "type": "byte",
    "value": 3
  },
  "refbonus": {
    "type": "short",
    "value": 0
  },
  "ScriptAttacked": {
    "type": "resref",
    "value": "nw_ch_ac5"
  },
  "ScriptDamaged": {
    "type": "resref",
    "value": "nw_ch_ac6"
  },
  "ScriptDeath": {
    "type": "resref",
    "value": "nw_ch_ac7"
  },
  "ScriptDialogue": {
    "type": "resref",
    "value": "nw_ch_ac4"
  },
  "ScriptDisturbed": {
    "type": "resref",
    "value": "nw_ch_ac8"
  },
  "ScriptEndRound": {
    "type": "resref",
    "value": "nw_ch_ac3"
  },
  "ScriptHeartbeat": {
    "type": "resref",
    "value": "nw_ch_ac1"
  },
  "ScriptOnBlocked": {
    "type": "resref",
    "value": "nw_ch_ace"
  },
  "ScriptOnNotice": {
    "type": "resref",
    "value": "nw_ch_ac2"
  },
  "ScriptRested": {
    "type": "resref",
    "value": "nw_ch_aca"
  },
  "ScriptSpawn": {
    "type": "resref",
    "value": "nw_ch_ac9"
  },
  "ScriptSpellAt": {
    "type": "resref",
    "value": "nw_ch_acb"
  },
  "ScriptUserDefine": {
    "type": "resref",
    "value": "nw_ch_acd"
  },
  "SkillList": {
    "type": "list",
    "value": [
      {
        "__struct_id": 0,
        "Rank": {
          "type": "byte",
          "value": 0
        }
      },
      {
        "__struct_id": 0,
        "Rank": {
          "type": "byte",
          "value": 0
        }
      },
      {
        "__struct_id": 0,
        "Rank": {
          "type": "byte",
          "value": 7
        }
      },
      {
        "__struct_id": 0,
        "Rank": {
          "type": "byte",
          "value": 3
        }
      },
      {
        "__struct_id": 0,
        "Rank": {
          "type": "byte",
          "value": 0
        }
      },
      {
        "__struct_id": 0,
        "Rank": {
          "type": "byte",
          "value": 7
        }
      },
      {
        "__struct_id": 0,
        "Rank": {
          "type": "byte",
          "value": 7
        }
      },
      {
        "__struct_id": 0,
        "Rank": {
          "type": "byte",
          "value": 0
        }
      },
      {
        "__struct_id": 0,
        "Rank": {
          "type": "byte",
          "value": 7
        }
      },
      {
        "__struct_id": 0,
        "Rank": {
          "type": "byte",
          "value": 7
        }
      },
      {
        "__struct_id": 0,
        "Rank": {
          "type": "byte",
          "value": 7
        }
      },
      {
        "__struct_id": 0,
        "Rank": {
          "type": "byte",
          "value": 0
        }
      },
      {
        "__struct_id": 0,
        "Rank": {
          "type": "byte",
          "value": 0
        }
      },
      {
        "__struct_id": 0,
        "Rank": {
          "type": "byte",
          "value": 2
        }
      },
      {
        "__struct_id": 0,
        "Rank": {
          "type": "byte",
          "value": 7
        }
      },
      {
        "__struct_id": 0,
        "Rank": {
          "type": "byte",
          "value": 0
        }
      },
      {
        "__struct_id": 0,
        "Rank": {
          "type": "byte",
          "value": 0
        }
      },
      {
        "__struct_id": 0,
        "Rank": {
          "type": "byte",
          "value": 6
        }
      },
      {
        "__struct_id": 0,
        "Rank": {
          "type": "byte",
          "value": 0
        }
      },
      {
        "__struct_id": 0,
        "Rank": {
          "type": "byte",
          "value": 0
        }
      }
    ]
  },
  "SoundSetFile": {
    "type": "word",
    "value": 213
  },
  "SpecAbilityList": {
    "type": "list",
    "value": []
  },
  "Str": {
    "type": "byte",
    "value": 12
  },
  "Subrace": {
    "type": "cexostring",
    "value": ""
  },
  "Tag": {
    "type": "cexostring",
    "value": "NW_HEN_GAL"
  },
  "Tail": {
    "type": "byte",
    "value": 0
  },
  "TemplateList": {
    "type": "list",
    "value": []
  },
  "TemplateResRef": {
    "type": "resref",
    "value": "nw_hen_gal_01"
  },
  "WalkRate": {
    "type": "int",
    "value": 4
  },
  "willbonus": {
    "type": "short",
    "value": 0
  },
  "Wings": {
    "type": "byte",
    "value": 0
  },
  "Wis": {
    "type": "byte",
    "value": 10
  }
}
