{
  "__data_type": "UTI ",
  "AddCost": {
    "type": "dword",
    "value": 36
  },
  "BaseItem": {
    "type": "int",
    "value": 81
  },
  "Charges": {
    "type": "byte",
    "value": 0
  },
  "Comment": {
    "type": "cexostring",
    "value": ""
  },
  "Cost": {
    "type": "dword",
    "value": 40
  },
  "DescIdentified": {
    "type": "cexolocstring",
    "value": {
      "id": 2992
    }
  },
  "Description": {
    "type": "cexolocstring",
    "value": {}
  },
  "Identified": {
    "type": "byte",
    "value": 1
  },
  "LocalizedName": {
    "type": "cexolocstring",
    "value": {
      "id": 2984
    }
  },
  "ModelPart1": {
    "type": "byte",
    "value": 4
  },
  "PaletteID": {
    "type": "byte",
    "value": 52
  },
  "Plot": {
    "type": "byte",
    "value": 0
  },
  "PropertiesList": {
    "type": "list",
    "value": [
      {
        "__struct_id": 0,
        "ChanceAppear": {
          "type": "byte",
          "value": 100
        },
        "CostTable": {
          "type": "byte",
          "value": 3
        },
        "CostValue": {
          "type": "word",
          "value": 1
        },
        "Param1": {
          "type": "byte",
          "value": 255
        },
        "Param1Value": {
          "type": "byte",
          "value": 0
        },
        "PropertyName": {
          "type": "word",
          "value": 15
        },
        "Subtype": {
          "type": "word",
          "value": 339
        }
      }
    ]
  },
  "StackSize": {
    "type": "word",
    "value": 1
  },
  "Stolen": {
    "type": "byte",
    "value": 0
  },
  "Tag": {
    "type": "cexostring",
    "value": "X1_WMGRENADE004"
  },
  "TemplateResRef": {
    "type": "resref",
    "value": "x1_wmgrenade004"
  }
}
