{
  "__data_type": "UTE ",
  "Active": {
    "type": "byte",
    "value": 1
  },
  "Comment": {
    "type": "cexostring",
    "value": ""
  },
  "CreatureList": {
    "type": "list",
    "value": [
      {
        "__struct_id": 0,
        "Appearance": {
          "type": "int",
          "value": 289
        },
        "CR": {
          "type": "float",
          "value": 12.0
        },
        "ResRef": {
          "type": "resref",
          "value": "nw_vampire001"
        },
        "SingleSpawn": {
          "type": "byte",
          "value": 0
        }
      },
      {
        "__struct_id": 0,
        "Appearance": {
          "type": "int",
          "value": 36
        },
        "CR": {
          "type": "float",
          "value": 13.0
        },
        "ResRef": {
          "type": "resref",
          "value": "nw_skeldevour"
        },
        "SingleSpawn": {
          "type": "byte",
          "value": 1
        }
      },
      {
        "__struct_id": 0,
        "Appearance": {
          "type": "int",
          "value": 288
        },
        "CR": {
          "type": "float",
          "value": 13.0
        },
        "ResRef": {
          "type": "resref",
          "value": "nw_vampire002"
        },
        "SingleSpawn": {
          "type": "byte",
          "value": 0
        }
      },
      {
        "__struct_id": 0,
        "Appearance": {
          "type": "int",
          "value": 289
        },
        "CR": {
          "type": "float",
          "value": 13.0
        },
        "ResRef": {
          "type": "resref",
          "value": "nw_vampire004"
        },
        "SingleSpawn": {
          "type": "byte",
          "value": 1
        }
      },
      {
        "__struct_id": 0,
        "Appearance": {
          "type": "int",
          "value": 288
        },
        "CR": {
          "type": "float",
          "value": 16.0
        },
        "ResRef": {
          "type": "resref",
          "value": "nw_vampire003"
        },
        "SingleSpawn": {
          "type": "byte",
          "value": 1
        }
      },
      {
        "__struct_id": 0,
        "Appearance": {
          "type": "int",
          "value": 39
        },
        "CR": {
          "type": "float",
          "value": 17.0
        },
        "ResRef": {
          "type": "resref",
          "value": "nw_lich003"
        },
        "SingleSpawn": {
          "type": "byte",
          "value": 1
        }
      },
      {
        "__struct_id": 0,
        "Appearance": {
          "type": "int",
          "value": 39
        },
        "CR": {
          "type": "float",
          "value": 28.0
        },
        "ResRef": {
          "type": "resref",
          "value": "nw_lich001"
        },
        "SingleSpawn": {
          "type": "byte",
          "value": 1
        }
      }
    ]
  },
  "Difficulty": {
    "type": "int",
    "value": 1
  },
  "DifficultyIndex": {
    "type": "int",
    "value": 2
  },
  "Faction": {
    "type": "dword",
    "value": 1
  },
  "LocalizedName": {
    "type": "cexolocstring",
    "value": {
      "id": 14514
    }
  },
  "MaxCreatures": {
    "type": "int",
    "value": 4
  },
  "OnEntered": {
    "type": "resref",
    "value": ""
  },
  "OnExhausted": {
    "type": "resref",
    "value": ""
  },
  "OnExit": {
    "type": "resref",
    "value": ""
  },
  "OnHeartbeat": {
    "type": "resref",
    "value": ""
  },
  "OnUserDefined": {
    "type": "resref",
    "value": ""
  },
  "PaletteID": {
    "type": "byte",
    "value": 8
  },
  "PlayerOnly": {
    "type": "byte",
    "value": 1
  },
  "RecCreatures": {
    "type": "int",
    "value": 2
  },
  "Reset": {
    "type": "byte",
    "value": 0
  },
  "ResetTime": {
    "type": "int",
    "value": 60
  },
  "Respawns": {
    "type": "int",
    "value": 0
  },
  "SpawnOption": {
    "type": "int",
    "value": 1
  },
  "Tag": {
    "type": "cexostring",
    "value": "NW_UndeadHigh"
  },
  "TemplateResRef": {
    "type": "resref",
    "value": "nw_undeadhigh"
  }
}
