{
  "__data_type": "UTI ",
  "AddCost": {
    "type": "dword",
    "value": 0
  },
  "BaseItem": {
    "type": "int",
    "value": 17
  },
  "Charges": {
    "type": "byte",
    "value": 0
  },
  "Cloth1Color": {
    "type": "byte",
    "value": 31
  },
  "Cloth2Color": {
    "type": "byte",
    "value": 31
  },
  "Comment": {
    "type": "cexostring",
    "value": ""
  },
  "Cost": {
    "type": "dword",
    "value": 362
  },
  "DescIdentified": {
    "type": "cexolocstring",
    "value": {
      "id": 40655
    }
  },
  "Description": {
    "type": "cexolocstring",
    "value": {}
  },
  "Identified": {
    "type": "byte",
    "value": 0
  },
  "Leather1Color": {
    "type": "byte",
    "value": 31
  },
  "Leather2Color": {
    "type": "byte",
    "value": 31
  },
  "LocalizedName": {
    "type": "cexolocstring",
    "value": {
      "id": 40654
    }
  },
  "Metal1Color": {
    "type": "byte",
    "value": 27
  },
  "Metal2Color": {
    "type": "byte",
    "value": 10
  },
  "ModelPart1": {
    "type": "byte",
    "value": 19
  },
  "PaletteID": {
    "type": "byte",
    "value": 9
  },
  "Plot": {
    "type": "byte",
    "value": 0
  },
  "PropertiesList": {
    "type": "list",
    "value": [
      {
        "__struct_id": 0,
        "ChanceAppear": {
          "type": "byte",
          "value": 100
        },
        "CostTable": {
          "type": "byte",
          "value": 25
        },
        "CostValue": {
          "type": "word",
          "value": 5
        },
        "Param1": {
          "type": "byte",
          "value": 255
        },
        "Param1Value": {
          "type": "byte",
          "value": 0
        },
        "PropertyName": {
          "type": "word",
          "value": 52
        },
        "Subtype": {
          "type": "word",
          "value": 17
        }
      }
    ]
  },
  "StackSize": {
    "type": "word",
    "value": 1
  },
  "Stolen": {
    "type": "byte",
    "value": 0
  },
  "Tag": {
    "type": "cexostring",
    "value": "X0_ARMHE005"
  },
  "TemplateResRef": {
    "type": "resref",
    "value": "x0_armhe005"
  }
}
