{
  "__data_type": "UTI ",
  "AddCost": {
    "type": "dword",
    "value": 9985
  },
  "BaseItem": {
    "type": "int",
    "value": 66
  },
  "Charges": {
    "type": "byte",
    "value": 0
  },
  "Comment": {
    "type": "cexostring",
    "value": ""
  },
  "Cost": {
    "type": "dword",
    "value": 10000
  },
  "DescIdentified": {
    "type": "cexolocstring",
    "value": {
      "id": 40147
    }
  },
  "Description": {
    "type": "cexolocstring",
    "value": {
      "id": 40146
    }
  },
  "Identified": {
    "type": "byte",
    "value": 1
  },
  "LocalizedName": {
    "type": "cexolocstring",
    "value": {
      "id": 66572
    }
  },
  "ModelPart1": {
    "type": "byte",
    "value": 2
  },
  "PaletteID": {
    "type": "byte",
    "value": 53
  },
  "Plot": {
    "type": "byte",
    "value": 0
  },
  "PropertiesList": {
    "type": "list",
    "value": []
  },
  "StackSize": {
    "type": "word",
    "value": 1
  },
  "Stolen": {
    "type": "byte",
    "value": 0
  },
  "Tag": {
    "type": "cexostring",
    "value": "x0_misc_prayer"
  },
  "TemplateResRef": {
    "type": "resref",
    "value": "x0_misc_prayer"
  }
}
