{
  "__data_type": "UTI ",
  "AddCost": {
    "type": "dword",
    "value": 0
  },
  "BaseItem": {
    "type": "int",
    "value": 26
  },
  "Charges": {
    "type": "byte",
    "value": 0
  },
  "Comment": {
    "type": "cexostring",
    "value": ""
  },
  "Cost": {
    "type": "dword",
    "value": 30526
  },
  "DescIdentified": {
    "type": "cexolocstring",
    "value": {
      "id": 56609
    }
  },
  "Description": {
    "type": "cexolocstring",
    "value": {}
  },
  "Identified": {
    "type": "byte",
    "value": 0
  },
  "LocalizedName": {
    "type": "cexolocstring",
    "value": {
      "id": 90836
    }
  },
  "ModelPart1": {
    "type": "byte",
    "value": 11
  },
  "ModelPart2": {
    "type": "byte",
    "value": 22
  },
  "ModelPart3": {
    "type": "byte",
    "value": 23
  },
  "PaletteID": {
    "type": "byte",
    "value": 15
  },
  "Plot": {
    "type": "byte",
    "value": 0
  },
  "PropertiesList": {
    "type": "list",
    "value": [
      {
        "__struct_id": 0,
        "ChanceAppear": {
          "type": "byte",
          "value": 100
        },
        "CostTable": {
          "type": "byte",
          "value": 2
        },
        "CostValue": {
          "type": "word",
          "value": 6
        },
        "Param1": {
          "type": "byte",
          "value": 255
        },
        "Param1Value": {
          "type": "byte",
          "value": 0
        },
        "PropertyName": {
          "type": "word",
          "value": 41
        },
        "Subtype": {
          "type": "word",
          "value": 3
        }
      }
    ]
  },
  "StackSize": {
    "type": "word",
    "value": 1
  },
  "Stolen": {
    "type": "byte",
    "value": 0
  },
  "Tag": {
    "type": "cexostring",
    "value": "X2_IT_MBOOTS001"
  },
  "TemplateResRef": {
    "type": "resref",
    "value": "x2_it_mboots001"
  }
}
