{
  "__data_type": "UTT ",
  "AutoRemoveKey": {
    "type": "byte",
    "value": 0
  },
  "Comment": {
    "type": "cexostring",
    "value": "This trigger will ClearAllActions on an entering mounted\r\nobject and force it to dismount.\r\n\r\nIt will hitch at any object near this trigger with the tag X3_HITCHING_POST.   If no object exists they will simply wander away from this location a short distance and stop.\r\n\r\nif bDismountFast is set to 1 on the object it will dismount without animating.\r\n\r\nNOTE: This does not care if you are in conversation or combat so, you need to be careful and keep that in mind when using this.  If this might be an issue then you may want to make your own triggers to prevent someone in combat or conversing from reaching the location of this trigger.\r\n\r\nComments by Deva Winblood :  January 28th, 2008"
  },
  "Cursor": {
    "type": "byte",
    "value": 0
  },
  "DisarmDC": {
    "type": "byte",
    "value": 10
  },
  "Faction": {
    "type": "dword",
    "value": 1
  },
  "HighlightHeight": {
    "type": "float",
    "value": 3.0
  },
  "KeyName": {
    "type": "cexostring",
    "value": ""
  },
  "LinkedTo": {
    "type": "cexostring",
    "value": ""
  },
  "LinkedToFlags": {
    "type": "byte",
    "value": 0
  },
  "LoadScreenID": {
    "type": "word",
    "value": 0
  },
  "LocalizedName": {
    "type": "cexolocstring",
    "value": {
      "0": "Dismount and Hitch"
    }
  },
  "OnClick": {
    "type": "resref",
    "value": ""
  },
  "OnDisarm": {
    "type": "resref",
    "value": ""
  },
  "OnTrapTriggered": {
    "type": "resref",
    "value": ""
  },
  "PaletteID": {
    "type": "byte",
    "value": 6
  },
  "PortraitId": {
    "type": "word",
    "value": 0
  },
  "ScriptHeartbeat": {
    "type": "resref",
    "value": ""
  },
  "ScriptOnEnter": {
    "type": "resref",
    "value": "x3_tr_dismounth"
  },
  "ScriptOnExit": {
    "type": "resref",
    "value": ""
  },
  "ScriptUserDefine": {
    "type": "resref",
    "value": ""
  },
  "Tag": {
    "type": "cexostring",
    "value": "x3_tr_dismounth"
  },
  "TemplateResRef": {
    "type": "resref",
    "value": "tr_dismounth"
  },
  "TrapDetectable": {
    "type": "byte",
    "value": 1
  },
  "TrapDetectDC": {
    "type": "byte",
    "value": 10
  },
  "TrapDisarmable": {
    "type": "byte",
    "value": 1
  },
  "TrapFlag": {
    "type": "byte",
    "value": 0
  },
  "TrapOneShot": {
    "type": "byte",
    "value": 1
  },
  "TrapType": {
    "type": "byte",
    "value": 0
  },
  "Type": {
    "type": "int",
    "value": 0
  }
}
