{
  "__data_type": "UTE ",
  "Active": {
    "type": "byte",
    "value": 1
  },
  "Comment": {
    "type": "cexostring",
    "value": ""
  },
  "CreatureList": {
    "type": "list",
    "value": [
      {
        "__struct_id": 0,
        "Appearance": {
          "type": "int",
          "value": 135
        },
        "CR": {
          "type": "float",
          "value": 2.0
        },
        "ResRef": {
          "type": "resref",
          "value": "nw_oldwarb"
        },
        "SingleSpawn": {
          "type": "byte",
          "value": 0
        }
      },
      {
        "__struct_id": 0,
        "Appearance": {
          "type": "int",
          "value": 134
        },
        "CR": {
          "type": "float",
          "value": 2.0
        },
        "ResRef": {
          "type": "resref",
          "value": "nw_oldwarra"
        },
        "SingleSpawn": {
          "type": "byte",
          "value": 0
        }
      },
      {
        "__struct_id": 0,
        "Appearance": {
          "type": "int",
          "value": 130
        },
        "CR": {
          "type": "float",
          "value": 4.0
        },
        "ResRef": {
          "type": "resref",
          "value": "nw_oldchiefa"
        },
        "SingleSpawn": {
          "type": "byte",
          "value": 1
        }
      },
      {
        "__struct_id": 0,
        "Appearance": {
          "type": "int",
          "value": 131
        },
        "CR": {
          "type": "float",
          "value": 4.0
        },
        "ResRef": {
          "type": "resref",
          "value": "nw_oldchiefb"
        },
        "SingleSpawn": {
          "type": "byte",
          "value": 1
        }
      },
      {
        "__struct_id": 0,
        "Appearance": {
          "type": "int",
          "value": 132
        },
        "CR": {
          "type": "float",
          "value": 4.0
        },
        "ResRef": {
          "type": "resref",
          "value": "nw_oldmagea"
        },
        "SingleSpawn": {
          "type": "byte",
          "value": 1
        }
      },
      {
        "__struct_id": 0,
        "Appearance": {
          "type": "int",
          "value": 133
        },
        "CR": {
          "type": "float",
          "value": 4.0
        },
        "ResRef": {
          "type": "resref",
          "value": "nw_oldmageb"
        },
        "SingleSpawn": {
          "type": "byte",
          "value": 1
        }
      }
    ]
  },
  "Difficulty": {
    "type": "int",
    "value": 1
  },
  "DifficultyIndex": {
    "type": "int",
    "value": 2
  },
  "Faction": {
    "type": "dword",
    "value": 1
  },
  "LocalizedName": {
    "type": "cexolocstring",
    "value": {
      "id": 14494
    }
  },
  "MaxCreatures": {
    "type": "int",
    "value": 6
  },
  "OnEntered": {
    "type": "resref",
    "value": ""
  },
  "OnExhausted": {
    "type": "resref",
    "value": ""
  },
  "OnExit": {
    "type": "resref",
    "value": ""
  },
  "OnHeartbeat": {
    "type": "resref",
    "value": ""
  },
  "OnUserDefined": {
    "type": "resref",
    "value": ""
  },
  "PaletteID": {
    "type": "byte",
    "value": 6
  },
  "PlayerOnly": {
    "type": "byte",
    "value": 1
  },
  "RecCreatures": {
    "type": "int",
    "value": 3
  },
  "Reset": {
    "type": "byte",
    "value": 0
  },
  "ResetTime": {
    "type": "int",
    "value": 60
  },
  "Respawns": {
    "type": "int",
    "value": 0
  },
  "SpawnOption": {
    "type": "int",
    "value": 1
  },
  "Tag": {
    "type": "cexostring",
    "value": "NW_LIZARD001"
  },
  "TemplateResRef": {
    "type": "resref",
    "value": "nw_lizard001"
  }
}
