{
  "__data_type": "UTI ",
  "AddCost": {
    "type": "dword",
    "value": 0
  },
  "BaseItem": {
    "type": "int",
    "value": 33
  },
  "Charges": {
    "type": "byte",
    "value": 0
  },
  "Comment": {
    "type": "cexostring",
    "value": "1"
  },
  "Cost": {
    "type": "dword",
    "value": 144560
  },
  "DescIdentified": {
    "type": "cexolocstring",
    "value": {
      "id": 13213
    }
  },
  "Description": {
    "type": "cexolocstring",
    "value": {}
  },
  "Identified": {
    "type": "byte",
    "value": 1
  },
  "LocalizedName": {
    "type": "cexolocstring",
    "value": {
      "id": 91172
    }
  },
  "ModelPart1": {
    "type": "byte",
    "value": 13
  },
  "ModelPart2": {
    "type": "byte",
    "value": 33
  },
  "ModelPart3": {
    "type": "byte",
    "value": 33
  },
  "PaletteID": {
    "type": "byte",
    "value": 46
  },
  "Plot": {
    "type": "byte",
    "value": 0
  },
  "PropertiesList": {
    "type": "list",
    "value": [
      {
        "__struct_id": 0,
        "ChanceAppear": {
          "type": "byte",
          "value": 100
        },
        "CostTable": {
          "type": "byte",
          "value": 2
        },
        "CostValue": {
          "type": "word",
          "value": 6
        },
        "Param1": {
          "type": "byte",
          "value": 255
        },
        "Param1Value": {
          "type": "byte",
          "value": 255
        },
        "PropertyName": {
          "type": "word",
          "value": 6
        },
        "Subtype": {
          "type": "word",
          "value": 0
        }
      }
    ]
  },
  "StackSize": {
    "type": "word",
    "value": 1
  },
  "Stolen": {
    "type": "byte",
    "value": 0
  },
  "Tag": {
    "type": "cexostring",
    "value": "X2_WDBMAX003"
  },
  "TemplateResRef": {
    "type": "resref",
    "value": "x2_wdbmax003"
  }
}
