{
  "__data_type": "UTM ",
  "BlackMarket": {
    "type": "byte",
    "value": 0
  },
  "BM_MarkDown": {
    "type": "int",
    "value": 25
  },
  "Comment": {
    "type": "cexostring",
    "value": "Chapter 2"
  },
  "ID": {
    "type": "byte",
    "value": 5
  },
  "LocName": {
    "type": "cexolocstring",
    "value": {
      "id": 14811
    }
  },
  "MarkDown": {
    "type": "int",
    "value": 35
  },
  "MarkUp": {
    "type": "int",
    "value": 150
  },
  "OnOpenStore": {
    "type": "resref",
    "value": "nw_d1_startstore"
  },
  "ResRef": {
    "type": "resref",
    "value": "nw_storetmple002"
  },
  "StoreList": {
    "type": "list",
    "value": [
      {
        "__struct_id": 0,
        "ItemList": {
          "type": "list",
          "value": [
            {
              "__struct_id": 0,
              "Infinite": {
                "type": "byte",
                "value": 1
              },
              "InventoryRes": {
                "type": "resref",
                "value": "nw_aarcl003"
              },
              "Repos_PosX": {
                "type": "word",
                "value": 0
              },
              "Repos_Posy": {
                "type": "word",
                "value": 0
              }
            },
            {
              "__struct_id": 1,
              "Infinite": {
                "type": "byte",
                "value": 1
              },
              "InventoryRes": {
                "type": "resref",
                "value": "nw_aarcl004"
              },
              "Repos_PosX": {
                "type": "word",
                "value": 2
              },
              "Repos_Posy": {
                "type": "word",
                "value": 0
              }
            },
            {
              "__struct_id": 2,
              "Infinite": {
                "type": "byte",
                "value": 1
              },
              "InventoryRes": {
                "type": "resref",
                "value": "nw_aarcl010"
              },
              "Repos_PosX": {
                "type": "word",
                "value": 4
              },
              "Repos_Posy": {
                "type": "word",
                "value": 0
              }
            },
            {
              "__struct_id": 3,
              "Infinite": {
                "type": "byte",
                "value": 1
              },
              "InventoryRes": {
                "type": "resref",
                "value": "nw_aarcl005"
              },
              "Repos_PosX": {
                "type": "word",
                "value": 6
              },
              "Repos_Posy": {
                "type": "word",
                "value": 0
              }
            },
            {
              "__struct_id": 4,
              "Infinite": {
                "type": "byte",
                "value": 1
              },
              "InventoryRes": {
                "type": "resref",
                "value": "nw_aarcl011"
              },
              "Repos_PosX": {
                "type": "word",
                "value": 8
              },
              "Repos_Posy": {
                "type": "word",
                "value": 0
              }
            },
            {
              "__struct_id": 5,
              "Infinite": {
                "type": "byte",
                "value": 1
              },
              "InventoryRes": {
                "type": "resref",
                "value": "nw_aarcl006"
              },
              "Repos_PosX": {
                "type": "word",
                "value": 0
              },
              "Repos_Posy": {
                "type": "word",
                "value": 3
              }
            },
            {
              "__struct_id": 6,
              "Infinite": {
                "type": "byte",
                "value": 1
              },
              "InventoryRes": {
                "type": "resref",
                "value": "nw_ashsw001"
              },
              "Repos_PosX": {
                "type": "word",
                "value": 2
              },
              "Repos_Posy": {
                "type": "word",
                "value": 3
              }
            },
            {
              "__struct_id": 7,
              "Infinite": {
                "type": "byte",
                "value": 1
              },
              "InventoryRes": {
                "type": "resref",
                "value": "nw_ashlw001"
              },
              "Repos_PosX": {
                "type": "word",
                "value": 4
              },
              "Repos_Posy": {
                "type": "word",
                "value": 3
              }
            },
            {
              "__struct_id": 8,
              "Infinite": {
                "type": "byte",
                "value": 1
              },
              "InventoryRes": {
                "type": "resref",
                "value": "nw_ashto001"
              },
              "Repos_PosX": {
                "type": "word",
                "value": 6
              },
              "Repos_Posy": {
                "type": "word",
                "value": 3
              }
            },
            {
              "__struct_id": 9,
              "InventoryRes": {
                "type": "resref",
                "value": "nw_it_mboots006"
              },
              "Repos_PosX": {
                "type": "word",
                "value": 8
              },
              "Repos_Posy": {
                "type": "word",
                "value": 3
              }
            },
            {
              "__struct_id": 10,
              "InventoryRes": {
                "type": "resref",
                "value": "nw_it_mbracer007"
              },
              "Repos_PosX": {
                "type": "word",
                "value": 2
              },
              "Repos_Posy": {
                "type": "word",
                "value": 5
              }
            },
            {
              "__struct_id": 11,
              "InventoryRes": {
                "type": "resref",
                "value": "nw_it_mbracer003"
              },
              "Repos_PosX": {
                "type": "word",
                "value": 8
              },
              "Repos_Posy": {
                "type": "word",
                "value": 5
              }
            },
            {
              "__struct_id": 12,
              "InventoryRes": {
                "type": "resref",
                "value": "nw_ashmsw003"
              },
              "Repos_PosX": {
                "type": "word",
                "value": 0
              },
              "Repos_Posy": {
                "type": "word",
                "value": 6
              }
            },
            {
              "__struct_id": 13,
              "InventoryRes": {
                "type": "resref",
                "value": "nw_maarcl021"
              },
              "Repos_PosX": {
                "type": "word",
                "value": 2
              },
              "Repos_Posy": {
                "type": "word",
                "value": 6
              }
            },
            {
              "__struct_id": 14,
              "InventoryRes": {
                "type": "resref",
                "value": "nw_it_mboots002"
              },
              "Repos_PosX": {
                "type": "word",
                "value": 4
              },
              "Repos_Posy": {
                "type": "word",
                "value": 6
              }
            },
            {
              "__struct_id": 15,
              "Infinite": {
                "type": "byte",
                "value": 1
              },
              "InventoryRes": {
                "type": "resref",
                "value": "nw_arhe004"
              },
              "Repos_PosX": {
                "type": "word",
                "value": 8
              },
              "Repos_Posy": {
                "type": "word",
                "value": 6
              }
            },
            {
              "__struct_id": 16,
              "Infinite": {
                "type": "byte",
                "value": 1
              },
              "InventoryRes": {
                "type": "resref",
                "value": "nw_arhe001"
              },
              "Repos_PosX": {
                "type": "word",
                "value": 6
              },
              "Repos_Posy": {
                "type": "word",
                "value": 7
              }
            },
            {
              "__struct_id": 17,
              "Infinite": {
                "type": "byte",
                "value": 1
              },
              "InventoryRes": {
                "type": "resref",
                "value": "nw_arhe002"
              },
              "Repos_PosX": {
                "type": "word",
                "value": 0
              },
              "Repos_Posy": {
                "type": "word",
                "value": 8
              }
            },
            {
              "__struct_id": 18,
              "Infinite": {
                "type": "byte",
                "value": 1
              },
              "InventoryRes": {
                "type": "resref",
                "value": "nw_arhe005"
              },
              "Repos_PosX": {
                "type": "word",
                "value": 4
              },
              "Repos_Posy": {
                "type": "word",
                "value": 8
              }
            },
            {
              "__struct_id": 19,
              "Infinite": {
                "type": "byte",
                "value": 1
              },
              "InventoryRes": {
                "type": "resref",
                "value": "nw_arhe003"
              },
              "Repos_PosX": {
                "type": "word",
                "value": 8
              },
              "Repos_Posy": {
                "type": "word",
                "value": 8
              }
            },
            {
              "__struct_id": 20,
              "InventoryRes": {
                "type": "resref",
                "value": "nw_armhe006"
              },
              "Repos_PosX": {
                "type": "word",
                "value": 0
              },
              "Repos_Posy": {
                "type": "word",
                "value": 10
              }
            },
            {
              "__struct_id": 21,
              "InventoryRes": {
                "type": "resref",
                "value": "nw_it_mbelt006"
              },
              "Repos_PosX": {
                "type": "word",
                "value": 2
              },
              "Repos_Posy": {
                "type": "word",
                "value": 9
              }
            },
            {
              "__struct_id": 22,
              "InventoryRes": {
                "type": "resref",
                "value": "nw_maarcl056"
              },
              "Repos_PosX": {
                "type": "word",
                "value": 2
              },
              "Repos_Posy": {
                "type": "word",
                "value": 10
              }
            },
            {
              "__struct_id": 23,
              "InventoryRes": {
                "type": "resref",
                "value": "nw_it_mbelt015"
              },
              "Repos_PosX": {
                "type": "word",
                "value": 6
              },
              "Repos_Posy": {
                "type": "word",
                "value": 9
              }
            },
            {
              "__struct_id": 24,
              "InventoryRes": {
                "type": "resref",
                "value": "nw_it_mbelt016"
              },
              "Repos_PosX": {
                "type": "word",
                "value": 4
              },
              "Repos_Posy": {
                "type": "word",
                "value": 10
              }
            },
            {
              "__struct_id": 25,
              "InventoryRes": {
                "type": "resref",
                "value": "nw_maarcl104"
              },
              "Repos_PosX": {
                "type": "word",
                "value": 6
              },
              "Repos_Posy": {
                "type": "word",
                "value": 10
              }
            },
            {
              "__struct_id": 26,
              "InventoryRes": {
                "type": "resref",
                "value": "nw_maarcl105"
              },
              "Repos_PosX": {
                "type": "word",
                "value": 8
              },
              "Repos_Posy": {
                "type": "word",
                "value": 10
              }
            },
            {
              "__struct_id": 27,
              "InventoryRes": {
                "type": "resref",
                "value": "nw_mcloth018"
              },
              "Repos_PosX": {
                "type": "word",
                "value": 4
              },
              "Repos_Posy": {
                "type": "word",
                "value": 11
              }
            },
            {
              "__struct_id": 28,
              "InventoryRes": {
                "type": "resref",
                "value": "nw_mcloth019"
              },
              "Repos_PosX": {
                "type": "word",
                "value": 0
              },
              "Repos_Posy": {
                "type": "word",
                "value": 12
              }
            },
            {
              "__struct_id": 29,
              "InventoryRes": {
                "type": "resref",
                "value": "nw_mcloth020"
              },
              "Repos_PosX": {
                "type": "word",
                "value": 2
              },
              "Repos_Posy": {
                "type": "word",
                "value": 13
              }
            },
            {
              "__struct_id": 30,
              "InventoryRes": {
                "type": "resref",
                "value": "nw_mcloth015"
              },
              "Repos_PosX": {
                "type": "word",
                "value": 6
              },
              "Repos_Posy": {
                "type": "word",
                "value": 13
              }
            },
            {
              "__struct_id": 31,
              "InventoryRes": {
                "type": "resref",
                "value": "nw_mcloth016"
              },
              "Repos_PosX": {
                "type": "word",
                "value": 8
              },
              "Repos_Posy": {
                "type": "word",
                "value": 13
              }
            },
            {
              "__struct_id": 32,
              "InventoryRes": {
                "type": "resref",
                "value": "nw_mcloth017"
              },
              "Repos_PosX": {
                "type": "word",
                "value": 4
              },
              "Repos_Posy": {
                "type": "word",
                "value": 14
              }
            },
            {
              "__struct_id": 33,
              "InventoryRes": {
                "type": "resref",
                "value": "nw_it_mboots018"
              },
              "Repos_PosX": {
                "type": "word",
                "value": 0
              },
              "Repos_Posy": {
                "type": "word",
                "value": 15
              }
            },
            {
              "__struct_id": 34,
              "InventoryRes": {
                "type": "resref",
                "value": "nw_it_mboots019"
              },
              "Repos_PosX": {
                "type": "word",
                "value": 2
              },
              "Repos_Posy": {
                "type": "word",
                "value": 16
              }
            },
            {
              "__struct_id": 35,
              "Infinite": {
                "type": "byte",
                "value": 1
              },
              "InventoryRes": {
                "type": "resref",
                "value": "nw_it_mglove027"
              },
              "Repos_PosX": {
                "type": "word",
                "value": 6
              },
              "Repos_Posy": {
                "type": "word",
                "value": 16
              }
            },
            {
              "__struct_id": 36,
              "Infinite": {
                "type": "byte",
                "value": 1
              },
              "InventoryRes": {
                "type": "resref",
                "value": "nw_it_mglove028"
              },
              "Repos_PosX": {
                "type": "word",
                "value": 8
              },
              "Repos_Posy": {
                "type": "word",
                "value": 16
              }
            }
          ]
        }
      },
      {
        "__struct_id": 4,
        "ItemList": {
          "type": "list",
          "value": [
            {
              "__struct_id": 0,
              "Infinite": {
                "type": "byte",
                "value": 1
              },
              "InventoryRes": {
                "type": "resref",
                "value": "nw_wblcl001"
              },
              "Repos_PosX": {
                "type": "word",
                "value": 0
              },
              "Repos_Posy": {
                "type": "word",
                "value": 0
              }
            },
            {
              "__struct_id": 1,
              "Infinite": {
                "type": "byte",
                "value": 1
              },
              "InventoryRes": {
                "type": "resref",
                "value": "nw_wblfh001"
              },
              "Repos_PosX": {
                "type": "word",
                "value": 1
              },
              "Repos_Posy": {
                "type": "word",
                "value": 0
              }
            },
            {
              "__struct_id": 2,
              "Infinite": {
                "type": "byte",
                "value": 1
              },
              "InventoryRes": {
                "type": "resref",
                "value": "nw_wblfl001"
              },
              "Repos_PosX": {
                "type": "word",
                "value": 3
              },
              "Repos_Posy": {
                "type": "word",
                "value": 0
              }
            },
            {
              "__struct_id": 3,
              "Infinite": {
                "type": "byte",
                "value": 1
              },
              "InventoryRes": {
                "type": "resref",
                "value": "nw_wblhl001"
              },
              "Repos_PosX": {
                "type": "word",
                "value": 4
              },
              "Repos_Posy": {
                "type": "word",
                "value": 0
              }
            },
            {
              "__struct_id": 4,
              "Infinite": {
                "type": "byte",
                "value": 1
              },
              "InventoryRes": {
                "type": "resref",
                "value": "nw_wblhw001"
              },
              "Repos_PosX": {
                "type": "word",
                "value": 5
              },
              "Repos_Posy": {
                "type": "word",
                "value": 0
              }
            },
            {
              "__struct_id": 5,
              "Infinite": {
                "type": "byte",
                "value": 1
              },
              "InventoryRes": {
                "type": "resref",
                "value": "nw_wblml001"
              },
              "Repos_PosX": {
                "type": "word",
                "value": 7
              },
              "Repos_Posy": {
                "type": "word",
                "value": 0
              }
            },
            {
              "__struct_id": 6,
              "Infinite": {
                "type": "byte",
                "value": 1
              },
              "InventoryRes": {
                "type": "resref",
                "value": "nw_wblms001"
              },
              "Repos_PosX": {
                "type": "word",
                "value": 8
              },
              "Repos_Posy": {
                "type": "word",
                "value": 0
              }
            },
            {
              "__struct_id": 7,
              "Infinite": {
                "type": "byte",
                "value": 1
              },
              "InventoryRes": {
                "type": "resref",
                "value": "nw_wdbma001"
              },
              "Repos_PosX": {
                "type": "word",
                "value": 3
              },
              "Repos_Posy": {
                "type": "word",
                "value": 3
              }
            },
            {
              "__struct_id": 8,
              "Infinite": {
                "type": "byte",
                "value": 1
              },
              "InventoryRes": {
                "type": "resref",
                "value": "nw_wdbqs001"
              },
              "Repos_PosX": {
                "type": "word",
                "value": 9
              },
              "Repos_Posy": {
                "type": "word",
                "value": 0
              }
            },
            {
              "__struct_id": 9,
              "Infinite": {
                "type": "byte",
                "value": 1
              },
              "InventoryRes": {
                "type": "resref",
                "value": "nw_wbwsl001"
              },
              "Repos_PosX": {
                "type": "word",
                "value": 7
              },
              "Repos_Posy": {
                "type": "word",
                "value": 2
              }
            },
            {
              "__struct_id": 10,
              "Infinite": {
                "type": "byte",
                "value": 1
              },
              "InventoryRes": {
                "type": "resref",
                "value": "nw_wammbu004"
              },
              "Repos_PosX": {
                "type": "word",
                "value": 4
              },
              "Repos_Posy": {
                "type": "word",
                "value": 2
              }
            },
            {
              "__struct_id": 11,
              "Infinite": {
                "type": "byte",
                "value": 1
              },
              "InventoryRes": {
                "type": "resref",
                "value": "nw_wmgmrd002"
              },
              "Repos_PosX": {
                "type": "word",
                "value": 0
              },
              "Repos_Posy": {
                "type": "word",
                "value": 3
              }
            },
            {
              "__struct_id": 12,
              "Infinite": {
                "type": "byte",
                "value": 1
              },
              "InventoryRes": {
                "type": "resref",
                "value": "nw_wmgwn009"
              },
              "Repos_PosX": {
                "type": "word",
                "value": 5
              },
              "Repos_Posy": {
                "type": "word",
                "value": 3
              }
            },
            {
              "__struct_id": 13,
              "Infinite": {
                "type": "byte",
                "value": 1
              },
              "InventoryRes": {
                "type": "resref",
                "value": "nw_wammbu005"
              },
              "Repos_PosX": {
                "type": "word",
                "value": 6
              },
              "Repos_Posy": {
                "type": "word",
                "value": 3
              }
            },
            {
              "__struct_id": 14,
              "Infinite": {
                "type": "byte",
                "value": 1
              },
              "InventoryRes": {
                "type": "resref",
                "value": "nw_wammbu006"
              },
              "Repos_PosX": {
                "type": "word",
                "value": 8
              },
              "Repos_Posy": {
                "type": "word",
                "value": 3
              }
            },
            {
              "__struct_id": 15,
              "Infinite": {
                "type": "byte",
                "value": 1
              },
              "InventoryRes": {
                "type": "resref",
                "value": "nw_wammbu007"
              },
              "Repos_PosX": {
                "type": "word",
                "value": 1
              },
              "Repos_Posy": {
                "type": "word",
                "value": 4
              }
            },
            {
              "__struct_id": 16,
              "Infinite": {
                "type": "byte",
                "value": 1
              },
              "InventoryRes": {
                "type": "resref",
                "value": "nw_wammbo005"
              },
              "Repos_PosX": {
                "type": "word",
                "value": 2
              },
              "Repos_Posy": {
                "type": "word",
                "value": 4
              }
            },
            {
              "__struct_id": 17,
              "Infinite": {
                "type": "byte",
                "value": 1
              },
              "InventoryRes": {
                "type": "resref",
                "value": "nw_wammbo001"
              },
              "Repos_PosX": {
                "type": "word",
                "value": 6
              },
              "Repos_Posy": {
                "type": "word",
                "value": 4
              }
            },
            {
              "__struct_id": 18,
              "Infinite": {
                "type": "byte",
                "value": 1
              },
              "InventoryRes": {
                "type": "resref",
                "value": "nw_wammbo002"
              },
              "Repos_PosX": {
                "type": "word",
                "value": 7
              },
              "Repos_Posy": {
                "type": "word",
                "value": 4
              }
            },
            {
              "__struct_id": 19,
              "Infinite": {
                "type": "byte",
                "value": 1
              },
              "InventoryRes": {
                "type": "resref",
                "value": "nw_wammbo004"
              },
              "Repos_PosX": {
                "type": "word",
                "value": 8
              },
              "Repos_Posy": {
                "type": "word",
                "value": 4
              }
            },
            {
              "__struct_id": 20,
              "Infinite": {
                "type": "byte",
                "value": 1
              },
              "InventoryRes": {
                "type": "resref",
                "value": "nw_wammar003"
              },
              "Repos_PosX": {
                "type": "word",
                "value": 9
              },
              "Repos_Posy": {
                "type": "word",
                "value": 4
              }
            },
            {
              "__struct_id": 21,
              "Infinite": {
                "type": "byte",
                "value": 1
              },
              "InventoryRes": {
                "type": "resref",
                "value": "nw_wammar002"
              },
              "Repos_PosX": {
                "type": "word",
                "value": 1
              },
              "Repos_Posy": {
                "type": "word",
                "value": 5
              }
            },
            {
              "__struct_id": 22,
              "Infinite": {
                "type": "byte",
                "value": 1
              },
              "InventoryRes": {
                "type": "resref",
                "value": "nw_wammar005"
              },
              "Repos_PosX": {
                "type": "word",
                "value": 5
              },
              "Repos_Posy": {
                "type": "word",
                "value": 5
              }
            },
            {
              "__struct_id": 23,
              "Infinite": {
                "type": "byte",
                "value": 1
              },
              "InventoryRes": {
                "type": "resref",
                "value": "nw_wammar006"
              },
              "Repos_PosX": {
                "type": "word",
                "value": 0
              },
              "Repos_Posy": {
                "type": "word",
                "value": 6
              }
            },
            {
              "__struct_id": 24,
              "Infinite": {
                "type": "byte",
                "value": 1
              },
              "InventoryRes": {
                "type": "resref",
                "value": "nw_wammar004"
              },
              "Repos_PosX": {
                "type": "word",
                "value": 2
              },
              "Repos_Posy": {
                "type": "word",
                "value": 6
              }
            },
            {
              "__struct_id": 25,
              "Infinite": {
                "type": "byte",
                "value": 1
              },
              "InventoryRes": {
                "type": "resref",
                "value": "nw_wamar001"
              },
              "Repos_PosX": {
                "type": "word",
                "value": 6
              },
              "Repos_Posy": {
                "type": "word",
                "value": 6
              }
            },
            {
              "__struct_id": 26,
              "Infinite": {
                "type": "byte",
                "value": 1
              },
              "InventoryRes": {
                "type": "resref",
                "value": "nw_wambo001"
              },
              "Repos_PosX": {
                "type": "word",
                "value": 7
              },
              "Repos_Posy": {
                "type": "word",
                "value": 6
              }
            },
            {
              "__struct_id": 27,
              "Infinite": {
                "type": "byte",
                "value": 1
              },
              "InventoryRes": {
                "type": "resref",
                "value": "nw_wambu001"
              },
              "Repos_PosX": {
                "type": "word",
                "value": 8
              },
              "Repos_Posy": {
                "type": "word",
                "value": 6
              }
            },
            {
              "__struct_id": 28,
              "Infinite": {
                "type": "byte",
                "value": 1
              },
              "InventoryRes": {
                "type": "resref",
                "value": "nw_wspmka002"
              },
              "Repos_PosX": {
                "type": "word",
                "value": 3
              },
              "Repos_Posy": {
                "type": "word",
                "value": 7
              }
            },
            {
              "__struct_id": 29,
              "Infinite": {
                "type": "byte",
                "value": 1
              },
              "InventoryRes": {
                "type": "resref",
                "value": "nw_wspmka008"
              },
              "Repos_PosX": {
                "type": "word",
                "value": 8
              },
              "Repos_Posy": {
                "type": "word",
                "value": 7
              }
            },
            {
              "__struct_id": 30,
              "Infinite": {
                "type": "byte",
                "value": 1
              },
              "InventoryRes": {
                "type": "resref",
                "value": "nw_wbwmln010"
              },
              "Repos_PosX": {
                "type": "word",
                "value": 0
              },
              "Repos_Posy": {
                "type": "word",
                "value": 10
              }
            },
            {
              "__struct_id": 31,
              "Infinite": {
                "type": "byte",
                "value": 1
              },
              "InventoryRes": {
                "type": "resref",
                "value": "nw_wbwmsh010"
              },
              "Repos_PosX": {
                "type": "word",
                "value": 2
              },
              "Repos_Posy": {
                "type": "word",
                "value": 10
              }
            }
          ]
        }
      },
      {
        "__struct_id": 2,
        "ItemList": {
          "type": "list",
          "value": [
            {
              "__struct_id": 0,
              "Infinite": {
                "type": "byte",
                "value": 1
              },
              "InventoryRes": {
                "type": "resref",
                "value": "nw_it_mpotion016"
              },
              "Repos_PosX": {
                "type": "word",
                "value": 0
              },
              "Repos_Posy": {
                "type": "word",
                "value": 0
              }
            },
            {
              "__struct_id": 1,
              "Infinite": {
                "type": "byte",
                "value": 1
              },
              "InventoryRes": {
                "type": "resref",
                "value": "nw_it_mpotion006"
              },
              "Repos_PosX": {
                "type": "word",
                "value": 1
              },
              "Repos_Posy": {
                "type": "word",
                "value": 0
              }
            },
            {
              "__struct_id": 2,
              "Infinite": {
                "type": "byte",
                "value": 1
              },
              "InventoryRes": {
                "type": "resref",
                "value": "nw_it_mpotion009"
              },
              "Repos_PosX": {
                "type": "word",
                "value": 2
              },
              "Repos_Posy": {
                "type": "word",
                "value": 0
              }
            },
            {
              "__struct_id": 3,
              "Infinite": {
                "type": "byte",
                "value": 1
              },
              "InventoryRes": {
                "type": "resref",
                "value": "nw_it_mpotion001"
              },
              "Repos_PosX": {
                "type": "word",
                "value": 3
              },
              "Repos_Posy": {
                "type": "word",
                "value": 0
              }
            },
            {
              "__struct_id": 4,
              "Infinite": {
                "type": "byte",
                "value": 1
              },
              "InventoryRes": {
                "type": "resref",
                "value": "nw_it_mpotion002"
              },
              "Repos_PosX": {
                "type": "word",
                "value": 4
              },
              "Repos_Posy": {
                "type": "word",
                "value": 0
              }
            },
            {
              "__struct_id": 5,
              "Infinite": {
                "type": "byte",
                "value": 1
              },
              "InventoryRes": {
                "type": "resref",
                "value": "nw_it_mpotion003"
              },
              "Repos_PosX": {
                "type": "word",
                "value": 5
              },
              "Repos_Posy": {
                "type": "word",
                "value": 0
              }
            },
            {
              "__struct_id": 6,
              "Infinite": {
                "type": "byte",
                "value": 1
              },
              "InventoryRes": {
                "type": "resref",
                "value": "nw_it_mpotion012"
              },
              "Repos_PosX": {
                "type": "word",
                "value": 6
              },
              "Repos_Posy": {
                "type": "word",
                "value": 0
              }
            },
            {
              "__struct_id": 7,
              "Infinite": {
                "type": "byte",
                "value": 1
              },
              "InventoryRes": {
                "type": "resref",
                "value": "nw_it_spdvscr203"
              },
              "Repos_PosX": {
                "type": "word",
                "value": 7
              },
              "Repos_Posy": {
                "type": "word",
                "value": 0
              }
            },
            {
              "__struct_id": 8,
              "Infinite": {
                "type": "byte",
                "value": 1
              },
              "InventoryRes": {
                "type": "resref",
                "value": "nw_it_spdvscr301"
              },
              "Repos_PosX": {
                "type": "word",
                "value": 8
              },
              "Repos_Posy": {
                "type": "word",
                "value": 0
              }
            },
            {
              "__struct_id": 9,
              "Infinite": {
                "type": "byte",
                "value": 1
              },
              "InventoryRes": {
                "type": "resref",
                "value": "nw_it_spdvscr302"
              },
              "Repos_PosX": {
                "type": "word",
                "value": 9
              },
              "Repos_Posy": {
                "type": "word",
                "value": 0
              }
            },
            {
              "__struct_id": 10,
              "Infinite": {
                "type": "byte",
                "value": 1
              },
              "InventoryRes": {
                "type": "resref",
                "value": "nw_it_spdvscr201"
              },
              "Repos_PosX": {
                "type": "word",
                "value": 7
              },
              "Repos_Posy": {
                "type": "word",
                "value": 1
              }
            },
            {
              "__struct_id": 11,
              "Infinite": {
                "type": "byte",
                "value": 1
              },
              "InventoryRes": {
                "type": "resref",
                "value": "nw_it_spdvscr402"
              },
              "Repos_PosX": {
                "type": "word",
                "value": 8
              },
              "Repos_Posy": {
                "type": "word",
                "value": 1
              }
            },
            {
              "__struct_id": 12,
              "Infinite": {
                "type": "byte",
                "value": 1
              },
              "InventoryRes": {
                "type": "resref",
                "value": "nw_it_spdvscr204"
              },
              "Repos_PosX": {
                "type": "word",
                "value": 9
              },
              "Repos_Posy": {
                "type": "word",
                "value": 1
              }
            },
            {
              "__struct_id": 13,
              "Infinite": {
                "type": "byte",
                "value": 1
              },
              "InventoryRes": {
                "type": "resref",
                "value": "nw_it_spdvscr401"
              },
              "Repos_PosX": {
                "type": "word",
                "value": 0
              },
              "Repos_Posy": {
                "type": "word",
                "value": 2
              }
            },
            {
              "__struct_id": 14,
              "Infinite": {
                "type": "byte",
                "value": 1
              },
              "InventoryRes": {
                "type": "resref",
                "value": "nw_it_spdvscr701"
              },
              "Repos_PosX": {
                "type": "word",
                "value": 1
              },
              "Repos_Posy": {
                "type": "word",
                "value": 2
              }
            },
            {
              "__struct_id": 15,
              "Infinite": {
                "type": "byte",
                "value": 1
              },
              "InventoryRes": {
                "type": "resref",
                "value": "nw_it_spdvscr501"
              },
              "Repos_PosX": {
                "type": "word",
                "value": 2
              },
              "Repos_Posy": {
                "type": "word",
                "value": 2
              }
            },
            {
              "__struct_id": 16,
              "Infinite": {
                "type": "byte",
                "value": 1
              },
              "InventoryRes": {
                "type": "resref",
                "value": "nw_it_spdvscr702"
              },
              "Repos_PosX": {
                "type": "word",
                "value": 3
              },
              "Repos_Posy": {
                "type": "word",
                "value": 2
              }
            },
            {
              "__struct_id": 17,
              "Infinite": {
                "type": "byte",
                "value": 1
              },
              "InventoryRes": {
                "type": "resref",
                "value": "nw_it_mpotion020"
              },
              "Repos_PosX": {
                "type": "word",
                "value": 4
              },
              "Repos_Posy": {
                "type": "word",
                "value": 2
              }
            },
            {
              "__struct_id": 18,
              "Infinite": {
                "type": "byte",
                "value": 1
              },
              "InventoryRes": {
                "type": "resref",
                "value": "nw_it_mpotion007"
              },
              "Repos_PosX": {
                "type": "word",
                "value": 5
              },
              "Repos_Posy": {
                "type": "word",
                "value": 2
              }
            },
            {
              "__struct_id": 19,
              "Infinite": {
                "type": "byte",
                "value": 1
              },
              "InventoryRes": {
                "type": "resref",
                "value": "nw_it_mpotion011"
              },
              "Repos_PosX": {
                "type": "word",
                "value": 6
              },
              "Repos_Posy": {
                "type": "word",
                "value": 2
              }
            }
          ]
        }
      },
      {
        "__struct_id": 3,
        "ItemList": {
          "type": "list",
          "value": [
            {
              "__struct_id": 0,
              "InventoryRes": {
                "type": "resref",
                "value": "nw_it_mneck008"
              },
              "Repos_PosX": {
                "type": "word",
                "value": 0
              },
              "Repos_Posy": {
                "type": "word",
                "value": 0
              }
            },
            {
              "__struct_id": 1,
              "InventoryRes": {
                "type": "resref",
                "value": "nw_it_mring008"
              },
              "Repos_PosX": {
                "type": "word",
                "value": 1
              },
              "Repos_Posy": {
                "type": "word",
                "value": 0
              }
            },
            {
              "__struct_id": 2,
              "InventoryRes": {
                "type": "resref",
                "value": "nw_it_mneck012"
              },
              "Repos_PosX": {
                "type": "word",
                "value": 2
              },
              "Repos_Posy": {
                "type": "word",
                "value": 0
              }
            },
            {
              "__struct_id": 3,
              "InventoryRes": {
                "type": "resref",
                "value": "nw_it_mneck006"
              },
              "Repos_PosX": {
                "type": "word",
                "value": 3
              },
              "Repos_Posy": {
                "type": "word",
                "value": 0
              }
            },
            {
              "__struct_id": 4,
              "InventoryRes": {
                "type": "resref",
                "value": "nw_it_mneck016"
              },
              "Repos_PosX": {
                "type": "word",
                "value": 4
              },
              "Repos_Posy": {
                "type": "word",
                "value": 0
              }
            },
            {
              "__struct_id": 5,
              "InventoryRes": {
                "type": "resref",
                "value": "nw_it_mneck023"
              },
              "Repos_PosX": {
                "type": "word",
                "value": 5
              },
              "Repos_Posy": {
                "type": "word",
                "value": 0
              }
            },
            {
              "__struct_id": 6,
              "InventoryRes": {
                "type": "resref",
                "value": "nw_it_mneck022"
              },
              "Repos_PosX": {
                "type": "word",
                "value": 6
              },
              "Repos_Posy": {
                "type": "word",
                "value": 0
              }
            },
            {
              "__struct_id": 7,
              "InventoryRes": {
                "type": "resref",
                "value": "nw_it_mneck021"
              },
              "Repos_PosX": {
                "type": "word",
                "value": 7
              },
              "Repos_Posy": {
                "type": "word",
                "value": 0
              }
            },
            {
              "__struct_id": 8,
              "InventoryRes": {
                "type": "resref",
                "value": "nw_it_mring023"
              },
              "Repos_PosX": {
                "type": "word",
                "value": 8
              },
              "Repos_Posy": {
                "type": "word",
                "value": 0
              }
            },
            {
              "__struct_id": 9,
              "InventoryRes": {
                "type": "resref",
                "value": "nw_it_mring011"
              },
              "Repos_PosX": {
                "type": "word",
                "value": 9
              },
              "Repos_Posy": {
                "type": "word",
                "value": 0
              }
            },
            {
              "__struct_id": 10,
              "InventoryRes": {
                "type": "resref",
                "value": "nw_it_mring022"
              },
              "Repos_PosX": {
                "type": "word",
                "value": 1
              },
              "Repos_Posy": {
                "type": "word",
                "value": 1
              }
            },
            {
              "__struct_id": 11,
              "InventoryRes": {
                "type": "resref",
                "value": "nw_it_mring029"
              },
              "Repos_PosX": {
                "type": "word",
                "value": 8
              },
              "Repos_Posy": {
                "type": "word",
                "value": 1
              }
            },
            {
              "__struct_id": 12,
              "InventoryRes": {
                "type": "resref",
                "value": "nw_it_mneck033"
              },
              "Repos_PosX": {
                "type": "word",
                "value": 9
              },
              "Repos_Posy": {
                "type": "word",
                "value": 1
              }
            },
            {
              "__struct_id": 13,
              "InventoryRes": {
                "type": "resref",
                "value": "nw_it_mring031"
              },
              "Repos_PosX": {
                "type": "word",
                "value": 0
              },
              "Repos_Posy": {
                "type": "word",
                "value": 2
              }
            },
            {
              "__struct_id": 14,
              "InventoryRes": {
                "type": "resref",
                "value": "nw_it_mring032"
              },
              "Repos_PosX": {
                "type": "word",
                "value": 1
              },
              "Repos_Posy": {
                "type": "word",
                "value": 2
              }
            },
            {
              "__struct_id": 15,
              "InventoryRes": {
                "type": "resref",
                "value": "nw_it_mneck035"
              },
              "Repos_PosX": {
                "type": "word",
                "value": 2
              },
              "Repos_Posy": {
                "type": "word",
                "value": 2
              }
            },
            {
              "__struct_id": 16,
              "InventoryRes": {
                "type": "resref",
                "value": "nw_it_mneck036"
              },
              "Repos_PosX": {
                "type": "word",
                "value": 3
              },
              "Repos_Posy": {
                "type": "word",
                "value": 2
              }
            }
          ]
        }
      },
      {
        "__struct_id": 1,
        "ItemList": {
          "type": "list",
          "value": [
            {
              "__struct_id": 0,
              "Infinite": {
                "type": "byte",
                "value": 1
              },
              "InventoryRes": {
                "type": "resref",
                "value": "nw_it_medkit002"
              },
              "Repos_PosX": {
                "type": "word",
                "value": 0
              },
              "Repos_Posy": {
                "type": "word",
                "value": 0
              }
            },
            {
              "__struct_id": 1,
              "Infinite": {
                "type": "byte",
                "value": 1
              },
              "InventoryRes": {
                "type": "resref",
                "value": "nw_it_medkit003"
              },
              "Repos_PosX": {
                "type": "word",
                "value": 2
              },
              "Repos_Posy": {
                "type": "word",
                "value": 0
              }
            }
          ]
        }
      }
    ]
  },
  "Tag": {
    "type": "cexostring",
    "value": "NW_STORETMPLE002"
  }
}
