{
  "__data_type": "UTI ",
  "AddCost": {
    "type": "dword",
    "value": 6
  },
  "BaseItem": {
    "type": "int",
    "value": 74
  },
  "Charges": {
    "type": "byte",
    "value": 0
  },
  "Comment": {
    "type": "cexostring",
    "value": ""
  },
  "Cost": {
    "type": "dword",
    "value": 7
  },
  "DescIdentified": {
    "type": "cexolocstring",
    "value": {}
  },
  "Description": {
    "type": "cexolocstring",
    "value": {
      "id": 13016
    }
  },
  "Identified": {
    "type": "byte",
    "value": 1
  },
  "LocalizedName": {
    "type": "cexolocstring",
    "value": {
      "id": 13015
    }
  },
  "ModelPart1": {
    "type": "byte",
    "value": 2
  },
  "PaletteID": {
    "type": "byte",
    "value": 60
  },
  "Plot": {
    "type": "byte",
    "value": 0
  },
  "PropertiesList": {
    "type": "list",
    "value": []
  },
  "StackSize": {
    "type": "word",
    "value": 1
  },
  "Stolen": {
    "type": "byte",
    "value": 0
  },
  "Tag": {
    "type": "cexostring",
    "value": "NW_IT_BOOK008"
  },
  "TemplateResRef": {
    "type": "resref",
    "value": "nw_it_book008"
  }
}
