{
  "__data_type": "UTE ",
  "Active": {
    "type": "byte",
    "value": 1
  },
  "Comment": {
    "type": "cexostring",
    "value": ""
  },
  "CreatureList": {
    "type": "list",
    "value": [
      {
        "__struct_id": 0,
        "Appearance": {
          "type": "int",
          "value": 257
        },
        "CR": {
          "type": "float",
          "value": 0.5
        },
        "ResRef": {
          "type": "resref",
          "value": "nw_bandit002"
        },
        "SingleSpawn": {
          "type": "byte",
          "value": 0
        }
      },
      {
        "__struct_id": 0,
        "Appearance": {
          "type": "int",
          "value": 269
        },
        "CR": {
          "type": "float",
          "value": 0.5
        },
        "ResRef": {
          "type": "resref",
          "value": "nw_bandit001"
        },
        "SingleSpawn": {
          "type": "byte",
          "value": 0
        }
      },
      {
        "__struct_id": 0,
        "Appearance": {
          "type": "int",
          "value": 269
        },
        "CR": {
          "type": "float",
          "value": 1.0
        },
        "ResRef": {
          "type": "resref",
          "value": "nw_bandit003"
        },
        "SingleSpawn": {
          "type": "byte",
          "value": 0
        }
      },
      {
        "__struct_id": 0,
        "Appearance": {
          "type": "int",
          "value": 269
        },
        "CR": {
          "type": "float",
          "value": 3.0
        },
        "ResRef": {
          "type": "resref",
          "value": "nw_bandit004"
        },
        "SingleSpawn": {
          "type": "byte",
          "value": 1
        }
      },
      {
        "__struct_id": 0,
        "Appearance": {
          "type": "int",
          "value": 257
        },
        "CR": {
          "type": "float",
          "value": 4.0
        },
        "ResRef": {
          "type": "resref",
          "value": "nw_bandit005"
        },
        "SingleSpawn": {
          "type": "byte",
          "value": 1
        }
      },
      {
        "__struct_id": 0,
        "Appearance": {
          "type": "int",
          "value": 254
        },
        "CR": {
          "type": "float",
          "value": 7.0
        },
        "ResRef": {
          "type": "resref",
          "value": "nw_bandit006"
        },
        "SingleSpawn": {
          "type": "byte",
          "value": 1
        }
      },
      {
        "__struct_id": 0,
        "Appearance": {
          "type": "int",
          "value": 270
        },
        "CR": {
          "type": "float",
          "value": 11.0
        },
        "ResRef": {
          "type": "resref",
          "value": "nw_bandit007"
        },
        "SingleSpawn": {
          "type": "byte",
          "value": 1
        }
      }
    ]
  },
  "Difficulty": {
    "type": "int",
    "value": 1
  },
  "DifficultyIndex": {
    "type": "int",
    "value": 2
  },
  "Faction": {
    "type": "dword",
    "value": 1
  },
  "LocalizedName": {
    "type": "cexolocstring",
    "value": {
      "id": 14491
    }
  },
  "MaxCreatures": {
    "type": "int",
    "value": 6
  },
  "OnEntered": {
    "type": "resref",
    "value": ""
  },
  "OnExhausted": {
    "type": "resref",
    "value": ""
  },
  "OnExit": {
    "type": "resref",
    "value": ""
  },
  "OnHeartbeat": {
    "type": "resref",
    "value": ""
  },
  "OnUserDefined": {
    "type": "resref",
    "value": ""
  },
  "PaletteID": {
    "type": "byte",
    "value": 6
  },
  "PlayerOnly": {
    "type": "byte",
    "value": 1
  },
  "RecCreatures": {
    "type": "int",
    "value": 3
  },
  "Reset": {
    "type": "byte",
    "value": 0
  },
  "ResetTime": {
    "type": "int",
    "value": 60
  },
  "Respawns": {
    "type": "int",
    "value": 0
  },
  "SpawnOption": {
    "type": "int",
    "value": 1
  },
  "Tag": {
    "type": "cexostring",
    "value": "NW_HumBandit"
  },
  "TemplateResRef": {
    "type": "resref",
    "value": "nw_humbandit"
  }
}
