{
  "__data_type": "UTI ",
  "AddCost": {
    "type": "dword",
    "value": 0
  },
  "BaseItem": {
    "type": "int",
    "value": 17
  },
  "Charges": {
    "type": "byte",
    "value": 0
  },
  "Cloth1Color": {
    "type": "byte",
    "value": 52
  },
  "Cloth2Color": {
    "type": "byte",
    "value": 52
  },
  "Comment": {
    "type": "cexostring",
    "value": ""
  },
  "Cost": {
    "type": "dword",
    "value": 23043
  },
  "DescIdentified": {
    "type": "cexolocstring",
    "value": {
      "id": 40663
    }
  },
  "Description": {
    "type": "cexolocstring",
    "value": {}
  },
  "Identified": {
    "type": "byte",
    "value": 0
  },
  "Leather1Color": {
    "type": "byte",
    "value": 52
  },
  "Leather2Color": {
    "type": "byte",
    "value": 52
  },
  "LocalizedName": {
    "type": "cexolocstring",
    "value": {
      "id": 40664
    }
  },
  "Metal1Color": {
    "type": "byte",
    "value": 29
  },
  "Metal2Color": {
    "type": "byte",
    "value": 9
  },
  "ModelPart1": {
    "type": "byte",
    "value": 13
  },
  "PaletteID": {
    "type": "byte",
    "value": 9
  },
  "Plot": {
    "type": "byte",
    "value": 0
  },
  "PropertiesList": {
    "type": "list",
    "value": [
      {
        "__struct_id": 0,
        "ChanceAppear": {
          "type": "byte",
          "value": 100
        },
        "CostTable": {
          "type": "byte",
          "value": 1
        },
        "CostValue": {
          "type": "word",
          "value": 4
        },
        "Param1": {
          "type": "byte",
          "value": 255
        },
        "Param1Value": {
          "type": "byte",
          "value": 0
        },
        "PropertyName": {
          "type": "word",
          "value": 0
        },
        "Subtype": {
          "type": "word",
          "value": 3
        }
      }
    ]
  },
  "StackSize": {
    "type": "word",
    "value": 1
  },
  "Stolen": {
    "type": "byte",
    "value": 0
  },
  "Tag": {
    "type": "cexostring",
    "value": "X0_ARMHE010"
  },
  "TemplateResRef": {
    "type": "resref",
    "value": "x0_armhe010"
  }
}
