{
  "__data_type": "UTC ",
  "Appearance_Type": {
    "type": "word",
    "value": 260
  },
  "BodyBag": {
    "type": "byte",
    "value": 0
  },
  "Cha": {
    "type": "byte",
    "value": 16
  },
  "ChallengeRating": {
    "type": "float",
    "value": 4.0
  },
  "ClassList": {
    "type": "list",
    "value": [
      {
        "__struct_id": 2,
        "Class": {
          "type": "int",
          "value": 9
        },
        "ClassLevel": {
          "type": "short",
          "value": 5
        },
        "KnownList0": {
          "type": "list",
          "value": [
            {
              "__struct_id": 3,
              "Spell": {
                "type": "word",
                "value": 37
              },
              "SpellFlags": {
                "type": "byte",
                "value": 1
              },
              "SpellMetaMagic": {
                "type": "byte",
                "value": 0
              }
            },
            {
              "__struct_id": 3,
              "Spell": {
                "type": "word",
                "value": 37
              },
              "SpellFlags": {
                "type": "byte",
                "value": 1
              },
              "SpellMetaMagic": {
                "type": "byte",
                "value": 0
              }
            },
            {
              "__struct_id": 3,
              "Spell": {
                "type": "word",
                "value": 100
              },
              "SpellFlags": {
                "type": "byte",
                "value": 1
              },
              "SpellMetaMagic": {
                "type": "byte",
                "value": 0
              }
            },
            {
              "__struct_id": 3,
              "Spell": {
                "type": "word",
                "value": 144
              },
              "SpellFlags": {
                "type": "byte",
                "value": 1
              },
              "SpellMetaMagic": {
                "type": "byte",
                "value": 0
              }
            },
            {
              "__struct_id": 3,
              "Spell": {
                "type": "word",
                "value": 144
              },
              "SpellFlags": {
                "type": "byte",
                "value": 1
              },
              "SpellMetaMagic": {
                "type": "byte",
                "value": 0
              }
            }
          ]
        },
        "KnownList1": {
          "type": "list",
          "value": [
            {
              "__struct_id": 3,
              "Spell": {
                "type": "word",
                "value": 16
              },
              "SpellFlags": {
                "type": "byte",
                "value": 1
              },
              "SpellMetaMagic": {
                "type": "byte",
                "value": 0
              }
            },
            {
              "__struct_id": 3,
              "Spell": {
                "type": "word",
                "value": 24
              },
              "SpellFlags": {
                "type": "byte",
                "value": 1
              },
              "SpellMetaMagic": {
                "type": "byte",
                "value": 0
              }
            },
            {
              "__struct_id": 3,
              "Spell": {
                "type": "word",
                "value": 102
              },
              "SpellFlags": {
                "type": "byte",
                "value": 1
              },
              "SpellMetaMagic": {
                "type": "byte",
                "value": 0
              }
            },
            {
              "__struct_id": 3,
              "Spell": {
                "type": "word",
                "value": 107
              },
              "SpellFlags": {
                "type": "byte",
                "value": 1
              },
              "SpellMetaMagic": {
                "type": "byte",
                "value": 0
              }
            }
          ]
        },
        "KnownList2": {
          "type": "list",
          "value": [
            {
              "__struct_id": 3,
              "Spell": {
                "type": "word",
                "value": 90
              },
              "SpellFlags": {
                "type": "byte",
                "value": 1
              },
              "SpellMetaMagic": {
                "type": "byte",
                "value": 0
              }
            },
            {
              "__struct_id": 3,
              "Spell": {
                "type": "word",
                "value": 115
              },
              "SpellFlags": {
                "type": "byte",
                "value": 1
              },
              "SpellMetaMagic": {
                "type": "byte",
                "value": 0
              }
            }
          ]
        }
      }
    ]
  },
  "Comment": {
    "type": "cexostring",
    "value": ""
  },
  "Con": {
    "type": "byte",
    "value": 14
  },
  "Conversation": {
    "type": "resref",
    "value": ""
  },
  "CRAdjust": {
    "type": "int",
    "value": 0
  },
  "CurrentHitPoints": {
    "type": "short",
    "value": 14
  },
  "Deity": {
    "type": "cexostring",
    "value": ""
  },
  "Description": {
    "type": "cexolocstring",
    "value": {}
  },
  "Dex": {
    "type": "byte",
    "value": 14
  },
  "Disarmable": {
    "type": "byte",
    "value": 1
  },
  "Equip_ItemList": {
    "type": "list",
    "value": [
      {
        "__struct_id": 16,
        "EquippedRes": {
          "type": "resref",
          "value": "nw_wswdg001"
        }
      }
    ]
  },
  "FactionID": {
    "type": "word",
    "value": 1
  },
  "FeatList": {
    "type": "list",
    "value": [
      {
        "__struct_id": 1,
        "Feat": {
          "type": "word",
          "value": 7
        }
      },
      {
        "__struct_id": 1,
        "Feat": {
          "type": "word",
          "value": 258
        }
      },
      {
        "__struct_id": 1,
        "Feat": {
          "type": "word",
          "value": 32
        }
      },
      {
        "__struct_id": 1,
        "Feat": {
          "type": "word",
          "value": 40
        }
      },
      {
        "__struct_id": 1,
        "Feat": {
          "type": "word",
          "value": 51
        }
      }
    ]
  },
  "FirstName": {
    "type": "cexolocstring",
    "value": {
      "id": 12587
    }
  },
  "fortbonus": {
    "type": "short",
    "value": 0
  },
  "Gender": {
    "type": "byte",
    "value": 1
  },
  "GoodEvil": {
    "type": "byte",
    "value": 50
  },
  "HitPoints": {
    "type": "short",
    "value": 14
  },
  "Int": {
    "type": "byte",
    "value": 10
  },
  "Interruptable": {
    "type": "byte",
    "value": 1
  },
  "IsPC": {
    "type": "byte",
    "value": 0
  },
  "LastName": {
    "type": "cexolocstring",
    "value": {}
  },
  "LawfulChaotic": {
    "type": "byte",
    "value": 50
  },
  "MaxHitPoints": {
    "type": "short",
    "value": 29
  },
  "NaturalAC": {
    "type": "byte",
    "value": 2
  },
  "NoPermDeath": {
    "type": "byte",
    "value": 0
  },
  "PaletteID": {
    "type": "byte",
    "value": 44
  },
  "PerceptionRange": {
    "type": "byte",
    "value": 11
  },
  "Phenotype": {
    "type": "int",
    "value": 0
  },
  "Plot": {
    "type": "byte",
    "value": 0
  },
  "PortraitId": {
    "type": "word",
    "value": 92
  },
  "Race": {
    "type": "byte",
    "value": 6
  },
  "refbonus": {
    "type": "short",
    "value": 0
  },
  "ScriptAttacked": {
    "type": "resref",
    "value": "nw_c2_default5"
  },
  "ScriptDamaged": {
    "type": "resref",
    "value": "nw_c2_default6"
  },
  "ScriptDeath": {
    "type": "resref",
    "value": "nw_c2_default7"
  },
  "ScriptDialogue": {
    "type": "resref",
    "value": "nw_c2_default4"
  },
  "ScriptDisturbed": {
    "type": "resref",
    "value": "nw_c2_default8"
  },
  "ScriptEndRound": {
    "type": "resref",
    "value": "nw_c2_default3"
  },
  "ScriptHeartbeat": {
    "type": "resref",
    "value": "nw_c2_default1"
  },
  "ScriptOnBlocked": {
    "type": "resref",
    "value": "nw_c2_defaulte"
  },
  "ScriptOnNotice": {
    "type": "resref",
    "value": "nw_c2_default2"
  },
  "ScriptRested": {
    "type": "resref",
    "value": "nw_c2_defaulta"
  },
  "ScriptSpawn": {
    "type": "resref",
    "value": "nw_c2_default9"
  },
  "ScriptSpellAt": {
    "type": "resref",
    "value": "nw_c2_defaultb"
  },
  "ScriptUserDefine": {
    "type": "resref",
    "value": "nw_c2_defaultd"
  },
  "SkillList": {
    "type": "list",
    "value": [
      {
        "__struct_id": 0,
        "Rank": {
          "type": "byte",
          "value": 0
        }
      },
      {
        "__struct_id": 0,
        "Rank": {
          "type": "byte",
          "value": 8
        }
      },
      {
        "__struct_id": 0,
        "Rank": {
          "type": "byte",
          "value": 0
        }
      },
      {
        "__struct_id": 0,
        "Rank": {
          "type": "byte",
          "value": 0
        }
      },
      {
        "__struct_id": 0,
        "Rank": {
          "type": "byte",
          "value": 0
        }
      },
      {
        "__struct_id": 0,
        "Rank": {
          "type": "byte",
          "value": 0
        }
      },
      {
        "__struct_id": 0,
        "Rank": {
          "type": "byte",
          "value": 0
        }
      },
      {
        "__struct_id": 0,
        "Rank": {
          "type": "byte",
          "value": 0
        }
      },
      {
        "__struct_id": 0,
        "Rank": {
          "type": "byte",
          "value": 0
        }
      },
      {
        "__struct_id": 0,
        "Rank": {
          "type": "byte",
          "value": 0
        }
      },
      {
        "__struct_id": 0,
        "Rank": {
          "type": "byte",
          "value": 0
        }
      },
      {
        "__struct_id": 0,
        "Rank": {
          "type": "byte",
          "value": 0
        }
      },
      {
        "__struct_id": 0,
        "Rank": {
          "type": "byte",
          "value": 0
        }
      },
      {
        "__struct_id": 0,
        "Rank": {
          "type": "byte",
          "value": 0
        }
      },
      {
        "__struct_id": 0,
        "Rank": {
          "type": "byte",
          "value": 0
        }
      },
      {
        "__struct_id": 0,
        "Rank": {
          "type": "byte",
          "value": 0
        }
      },
      {
        "__struct_id": 0,
        "Rank": {
          "type": "byte",
          "value": 0
        }
      },
      {
        "__struct_id": 0,
        "Rank": {
          "type": "byte",
          "value": 8
        }
      },
      {
        "__struct_id": 0,
        "Rank": {
          "type": "byte",
          "value": 0
        }
      },
      {
        "__struct_id": 0,
        "Rank": {
          "type": "byte",
          "value": 0
        }
      }
    ]
  },
  "SoundSetFile": {
    "type": "word",
    "value": 180
  },
  "SpecAbilityList": {
    "type": "list",
    "value": []
  },
  "Str": {
    "type": "byte",
    "value": 8
  },
  "Subrace": {
    "type": "cexostring",
    "value": ""
  },
  "Tag": {
    "type": "cexostring",
    "value": "NW_GYPSY004"
  },
  "Tail": {
    "type": "byte",
    "value": 0
  },
  "TemplateList": {
    "type": "list",
    "value": []
  },
  "TemplateResRef": {
    "type": "resref",
    "value": "nw_gypsy004"
  },
  "WalkRate": {
    "type": "int",
    "value": 7
  },
  "willbonus": {
    "type": "short",
    "value": 0
  },
  "Wings": {
    "type": "byte",
    "value": 0
  },
  "Wis": {
    "type": "byte",
    "value": 12
  }
}
