{
  "__data_type": "UTE ",
  "Active": {
    "type": "byte",
    "value": 1
  },
  "Comment": {
    "type": "cexostring",
    "value": ""
  },
  "CreatureList": {
    "type": "list",
    "value": [
      {
        "__struct_id": 0,
        "Appearance": {
          "type": "int",
          "value": 50
        },
        "CR": {
          "type": "float",
          "value": 12.0
        },
        "ResRef": {
          "type": "resref",
          "value": "nw_drgwhite001"
        },
        "SingleSpawn": {
          "type": "byte",
          "value": 1
        }
      },
      {
        "__struct_id": 0,
        "Appearance": {
          "type": "int",
          "value": 41
        },
        "CR": {
          "type": "float",
          "value": 13.0
        },
        "ResRef": {
          "type": "resref",
          "value": "nw_drgblack001"
        },
        "SingleSpawn": {
          "type": "byte",
          "value": 1
        }
      },
      {
        "__struct_id": 0,
        "Appearance": {
          "type": "int",
          "value": 48
        },
        "CR": {
          "type": "float",
          "value": 14.0
        },
        "ResRef": {
          "type": "resref",
          "value": "nw_drggreen001"
        },
        "SingleSpawn": {
          "type": "byte",
          "value": 1
        }
      },
      {
        "__struct_id": 0,
        "Appearance": {
          "type": "int",
          "value": 47
        },
        "CR": {
          "type": "float",
          "value": 14.0
        },
        "ResRef": {
          "type": "resref",
          "value": "nw_drgblue001"
        },
        "SingleSpawn": {
          "type": "byte",
          "value": 1
        }
      },
      {
        "__struct_id": 0,
        "Appearance": {
          "type": "int",
          "value": 49
        },
        "CR": {
          "type": "float",
          "value": 15.0
        },
        "ResRef": {
          "type": "resref",
          "value": "nw_drgred001"
        },
        "SingleSpawn": {
          "type": "byte",
          "value": 1
        }
      }
    ]
  },
  "Difficulty": {
    "type": "int",
    "value": 1
  },
  "DifficultyIndex": {
    "type": "int",
    "value": 2
  },
  "Faction": {
    "type": "dword",
    "value": 1
  },
  "LocalizedName": {
    "type": "cexolocstring",
    "value": {
      "id": 14475
    }
  },
  "MaxCreatures": {
    "type": "int",
    "value": 1
  },
  "OnEntered": {
    "type": "resref",
    "value": ""
  },
  "OnExhausted": {
    "type": "resref",
    "value": ""
  },
  "OnExit": {
    "type": "resref",
    "value": ""
  },
  "OnHeartbeat": {
    "type": "resref",
    "value": ""
  },
  "OnUserDefined": {
    "type": "resref",
    "value": ""
  },
  "PaletteID": {
    "type": "byte",
    "value": 8
  },
  "PlayerOnly": {
    "type": "byte",
    "value": 1
  },
  "RecCreatures": {
    "type": "int",
    "value": 1
  },
  "Reset": {
    "type": "byte",
    "value": 0
  },
  "ResetTime": {
    "type": "int",
    "value": 60
  },
  "Respawns": {
    "type": "int",
    "value": 0
  },
  "SpawnOption": {
    "type": "int",
    "value": 1
  },
  "Tag": {
    "type": "cexostring",
    "value": "NW_DRAGONWEAK"
  },
  "TemplateResRef": {
    "type": "resref",
    "value": "nw_dragonweak"
  }
}
