{
  "__data_type": "UTE ",
  "Active": {
    "type": "byte",
    "value": 1
  },
  "Comment": {
    "type": "cexostring",
    "value": ""
  },
  "CreatureList": {
    "type": "list",
    "value": [
      {
        "__struct_id": 0,
        "Appearance": {
          "type": "int",
          "value": 140
        },
        "CR": {
          "type": "float",
          "value": 0.25
        },
        "ResRef": {
          "type": "resref",
          "value": "nw_orca"
        },
        "SingleSpawn": {
          "type": "byte",
          "value": 0
        }
      },
      {
        "__struct_id": 0,
        "Appearance": {
          "type": "int",
          "value": 141
        },
        "CR": {
          "type": "float",
          "value": 0.25
        },
        "ResRef": {
          "type": "resref",
          "value": "nw_orcb"
        },
        "SingleSpawn": {
          "type": "byte",
          "value": 0
        }
      },
      {
        "__struct_id": 0,
        "Appearance": {
          "type": "int",
          "value": 127
        },
        "CR": {
          "type": "float",
          "value": 3.0
        },
        "ResRef": {
          "type": "resref",
          "value": "nw_ogre01"
        },
        "SingleSpawn": {
          "type": "byte",
          "value": 1
        }
      },
      {
        "__struct_id": 0,
        "Appearance": {
          "type": "int",
          "value": 207
        },
        "CR": {
          "type": "float",
          "value": 3.0
        },
        "ResRef": {
          "type": "resref",
          "value": "nw_ogre02"
        },
        "SingleSpawn": {
          "type": "byte",
          "value": 1
        }
      },
      {
        "__struct_id": 0,
        "Appearance": {
          "type": "int",
          "value": 136
        },
        "CR": {
          "type": "float",
          "value": 3.0
        },
        "ResRef": {
          "type": "resref",
          "value": "nw_orcchiefa"
        },
        "SingleSpawn": {
          "type": "byte",
          "value": 1
        }
      },
      {
        "__struct_id": 0,
        "Appearance": {
          "type": "int",
          "value": 137
        },
        "CR": {
          "type": "float",
          "value": 3.0
        },
        "ResRef": {
          "type": "resref",
          "value": "nw_orcchiefb"
        },
        "SingleSpawn": {
          "type": "byte",
          "value": 1
        }
      },
      {
        "__struct_id": 0,
        "Appearance": {
          "type": "int",
          "value": 138
        },
        "CR": {
          "type": "float",
          "value": 4.0
        },
        "ResRef": {
          "type": "resref",
          "value": "nw_orcwiza"
        },
        "SingleSpawn": {
          "type": "byte",
          "value": 1
        }
      },
      {
        "__struct_id": 0,
        "Appearance": {
          "type": "int",
          "value": 139
        },
        "CR": {
          "type": "float",
          "value": 4.0
        },
        "ResRef": {
          "type": "resref",
          "value": "nw_orcwizb"
        },
        "SingleSpawn": {
          "type": "byte",
          "value": 1
        }
      }
    ]
  },
  "Difficulty": {
    "type": "int",
    "value": 1
  },
  "DifficultyIndex": {
    "type": "int",
    "value": 2
  },
  "Faction": {
    "type": "dword",
    "value": 1
  },
  "LocalizedName": {
    "type": "cexolocstring",
    "value": {
      "id": 14505
    }
  },
  "MaxCreatures": {
    "type": "int",
    "value": 6
  },
  "OnEntered": {
    "type": "resref",
    "value": ""
  },
  "OnExhausted": {
    "type": "resref",
    "value": ""
  },
  "OnExit": {
    "type": "resref",
    "value": ""
  },
  "OnHeartbeat": {
    "type": "resref",
    "value": ""
  },
  "OnUserDefined": {
    "type": "resref",
    "value": ""
  },
  "PaletteID": {
    "type": "byte",
    "value": 6
  },
  "PlayerOnly": {
    "type": "byte",
    "value": 1
  },
  "RecCreatures": {
    "type": "int",
    "value": 3
  },
  "Reset": {
    "type": "byte",
    "value": 0
  },
  "ResetTime": {
    "type": "int",
    "value": 60
  },
  "Respawns": {
    "type": "int",
    "value": 0
  },
  "SpawnOption": {
    "type": "int",
    "value": 1
  },
  "Tag": {
    "type": "cexostring",
    "value": "NW_OrcHigh"
  },
  "TemplateResRef": {
    "type": "resref",
    "value": "nw_orchigh"
  }
}
