{
  "__data_type": "UTE ",
  "Active": {
    "type": "byte",
    "value": 1
  },
  "Comment": {
    "type": "cexostring",
    "value": ""
  },
  "CreatureList": {
    "type": "list",
    "value": [
      {
        "__struct_id": 0,
        "Appearance": {
          "type": "int",
          "value": 302
        },
        "CR": {
          "type": "float",
          "value": 0.3333333432674408
        },
        "ResRef": {
          "type": "resref",
          "value": "nw_kobold001"
        },
        "SingleSpawn": {
          "type": "byte",
          "value": 0
        }
      },
      {
        "__struct_id": 0,
        "Appearance": {
          "type": "int",
          "value": 305
        },
        "CR": {
          "type": "float",
          "value": 0.3333333432674408
        },
        "ResRef": {
          "type": "resref",
          "value": "nw_kobold002"
        },
        "SingleSpawn": {
          "type": "byte",
          "value": 0
        }
      },
      {
        "__struct_id": 0,
        "Appearance": {
          "type": "int",
          "value": 303
        },
        "CR": {
          "type": "float",
          "value": 2.0
        },
        "ResRef": {
          "type": "resref",
          "value": "nw_kobold004"
        },
        "SingleSpawn": {
          "type": "byte",
          "value": 0
        }
      },
      {
        "__struct_id": 0,
        "Appearance": {
          "type": "int",
          "value": 304
        },
        "CR": {
          "type": "float",
          "value": 2.0
        },
        "ResRef": {
          "type": "resref",
          "value": "nw_kobold006"
        },
        "SingleSpawn": {
          "type": "byte",
          "value": 1
        }
      },
      {
        "__struct_id": 0,
        "Appearance": {
          "type": "int",
          "value": 301
        },
        "CR": {
          "type": "float",
          "value": 2.0
        },
        "ResRef": {
          "type": "resref",
          "value": "nw_kobold005"
        },
        "SingleSpawn": {
          "type": "byte",
          "value": 1
        }
      },
      {
        "__struct_id": 0,
        "Appearance": {
          "type": "int",
          "value": 300
        },
        "CR": {
          "type": "float",
          "value": 2.0
        },
        "ResRef": {
          "type": "resref",
          "value": "nw_kobold003"
        },
        "SingleSpawn": {
          "type": "byte",
          "value": 0
        }
      }
    ]
  },
  "Difficulty": {
    "type": "int",
    "value": 0
  },
  "DifficultyIndex": {
    "type": "int",
    "value": 2
  },
  "Faction": {
    "type": "dword",
    "value": 1
  },
  "LocalizedName": {
    "type": "cexolocstring",
    "value": {
      "id": 91348
    }
  },
  "MaxCreatures": {
    "type": "int",
    "value": 8
  },
  "OnEntered": {
    "type": "resref",
    "value": ""
  },
  "OnExhausted": {
    "type": "resref",
    "value": ""
  },
  "OnExit": {
    "type": "resref",
    "value": ""
  },
  "OnHeartbeat": {
    "type": "resref",
    "value": ""
  },
  "OnUserDefined": {
    "type": "resref",
    "value": ""
  },
  "PaletteID": {
    "type": "byte",
    "value": 5
  },
  "PlayerOnly": {
    "type": "byte",
    "value": 1
  },
  "RecCreatures": {
    "type": "int",
    "value": 4
  },
  "Reset": {
    "type": "byte",
    "value": 0
  },
  "ResetTime": {
    "type": "int",
    "value": 60
  },
  "Respawns": {
    "type": "int",
    "value": 0
  },
  "SpawnOption": {
    "type": "int",
    "value": 1
  },
  "Tag": {
    "type": "cexostring",
    "value": "X2_KOBOLD001"
  },
  "TemplateResRef": {
    "type": "resref",
    "value": "x2_kobold001"
  }
}
