{
  "__data_type": "UTD ",
  "AnimationState": {
    "type": "byte",
    "value": 0
  },
  "Appearance": {
    "type": "dword",
    "value": 0
  },
  "AutoRemoveKey": {
    "type": "byte",
    "value": 0
  },
  "CloseLockDC": {
    "type": "byte",
    "value": 0
  },
  "Comment": {
    "type": "cexostring",
    "value": "RuralExit"
  },
  "Conversation": {
    "type": "resref",
    "value": ""
  },
  "CurrentHP": {
    "type": "short",
    "value": 80
  },
  "Description": {
    "type": "cexolocstring",
    "value": {}
  },
  "DisarmDC": {
    "type": "byte",
    "value": 15
  },
  "Faction": {
    "type": "dword",
    "value": 1
  },
  "Fort": {
    "type": "byte",
    "value": 16
  },
  "GenericType": {
    "type": "byte",
    "value": 0
  },
  "Hardness": {
    "type": "byte",
    "value": 5
  },
  "HP": {
    "type": "short",
    "value": 80
  },
  "Interruptable": {
    "type": "byte",
    "value": 1
  },
  "KeyName": {
    "type": "cexostring",
    "value": ""
  },
  "KeyRequired": {
    "type": "byte",
    "value": 0
  },
  "LinkedTo": {
    "type": "cexostring",
    "value": ""
  },
  "LinkedToFlags": {
    "type": "byte",
    "value": 0
  },
  "LoadScreenID": {
    "type": "word",
    "value": 0
  },
  "Lockable": {
    "type": "byte",
    "value": 0
  },
  "Locked": {
    "type": "byte",
    "value": 0
  },
  "LocName": {
    "type": "cexolocstring",
    "value": {
      "id": 5349
    }
  },
  "OnClick": {
    "type": "resref",
    "value": ""
  },
  "OnClosed": {
    "type": "resref",
    "value": ""
  },
  "OnDamaged": {
    "type": "resref",
    "value": ""
  },
  "OnDeath": {
    "type": "resref",
    "value": "x2_door_death"
  },
  "OnDisarm": {
    "type": "resref",
    "value": ""
  },
  "OnFailToOpen": {
    "type": "resref",
    "value": ""
  },
  "OnHeartbeat": {
    "type": "resref",
    "value": ""
  },
  "OnLock": {
    "type": "resref",
    "value": ""
  },
  "OnMeleeAttacked": {
    "type": "resref",
    "value": ""
  },
  "OnOpen": {
    "type": "resref",
    "value": ""
  },
  "OnSpellCastAt": {
    "type": "resref",
    "value": ""
  },
  "OnTrapTriggered": {
    "type": "resref",
    "value": ""
  },
  "OnUnlock": {
    "type": "resref",
    "value": ""
  },
  "OnUserDefined": {
    "type": "resref",
    "value": ""
  },
  "OpenLockDC": {
    "type": "byte",
    "value": 18
  },
  "PaletteID": {
    "type": "byte",
    "value": 5
  },
  "Plot": {
    "type": "byte",
    "value": 0
  },
  "PortraitId": {
    "type": "word",
    "value": 0
  },
  "Ref": {
    "type": "byte",
    "value": 0
  },
  "Tag": {
    "type": "cexostring",
    "value": "RuralExit"
  },
  "TemplateResRef": {
    "type": "resref",
    "value": "nw_door_ttr_29"
  },
  "TrapDetectable": {
    "type": "byte",
    "value": 1
  },
  "TrapDetectDC": {
    "type": "byte",
    "value": 0
  },
  "TrapDisarmable": {
    "type": "byte",
    "value": 1
  },
  "TrapFlag": {
    "type": "byte",
    "value": 0
  },
  "TrapOneShot": {
    "type": "byte",
    "value": 1
  },
  "TrapType": {
    "type": "byte",
    "value": 0
  },
  "Will": {
    "type": "byte",
    "value": 0
  }
}
