{
  "__data_type": "UTS ",
  "Active": {
    "type": "byte",
    "value": 1
  },
  "Comment": {
    "type": "cexostring",
    "value": ""
  },
  "Continuous": {
    "type": "byte",
    "value": 1
  },
  "Elevation": {
    "type": "float",
    "value": 1.5
  },
  "Hours": {
    "type": "dword",
    "value": 0
  },
  "Interval": {
    "type": "dword",
    "value": 25000
  },
  "IntervalVrtn": {
    "type": "dword",
    "value": 5000
  },
  "LocName": {
    "type": "cexolocstring",
    "value": {
      "id": 67943
    }
  },
  "Looping": {
    "type": "byte",
    "value": 0
  },
  "MaxDistance": {
    "type": "float",
    "value": 10.0
  },
  "MinDistance": {
    "type": "float",
    "value": 1.0
  },
  "PaletteID": {
    "type": "byte",
    "value": 6
  },
  "PitchVariation": {
    "type": "float",
    "value": 0.2000000029802322
  },
  "Positional": {
    "type": "byte",
    "value": 1
  },
  "Priority": {
    "type": "byte",
    "value": 18
  },
  "Random": {
    "type": "byte",
    "value": 0
  },
  "RandomPosition": {
    "type": "byte",
    "value": 0
  },
  "RandomRangeX": {
    "type": "float",
    "value": 0.0
  },
  "RandomRangeY": {
    "type": "float",
    "value": 0.0
  },
  "Sounds": {
    "type": "list",
    "value": [
      {
        "__struct_id": 1243572,
        "Sound": {
          "type": "resref",
          "value": "as_an_rooster1"
        }
      }
    ]
  },
  "Tag": {
    "type": "cexostring",
    "value": "Rooster"
  },
  "TemplateResRef": {
    "type": "resref",
    "value": "rooster"
  },
  "Times": {
    "type": "byte",
    "value": 3
  },
  "Volume": {
    "type": "byte",
    "value": 127
  },
  "VolumeVrtn": {
    "type": "byte",
    "value": 0
  }
}
