{
  "__data_type": "UTI ",
  "AddCost": {
    "type": "dword",
    "value": 0
  },
  "ArmorPart_Belt": {
    "type": "byte",
    "value": 0
  },
  "ArmorPart_LBicep": {
    "type": "byte",
    "value": 4
  },
  "ArmorPart_LFArm": {
    "type": "byte",
    "value": 12
  },
  "ArmorPart_LFoot": {
    "type": "byte",
    "value": 4
  },
  "ArmorPart_LHand": {
    "type": "byte",
    "value": 1
  },
  "ArmorPart_LShin": {
    "type": "byte",
    "value": 14
  },
  "ArmorPart_LShoul": {
    "type": "byte",
    "value": 12
  },
  "ArmorPart_LThigh": {
    "type": "byte",
    "value": 4
  },
  "ArmorPart_Neck": {
    "type": "byte",
    "value": 1
  },
  "ArmorPart_Pelvis": {
    "type": "byte",
    "value": 22
  },
  "ArmorPart_RBicep": {
    "type": "byte",
    "value": 4
  },
  "ArmorPart_RFArm": {
    "type": "byte",
    "value": 12
  },
  "ArmorPart_RFoot": {
    "type": "byte",
    "value": 4
  },
  "ArmorPart_RHand": {
    "type": "byte",
    "value": 1
  },
  "ArmorPart_RShin": {
    "type": "byte",
    "value": 14
  },
  "ArmorPart_RShoul": {
    "type": "byte",
    "value": 12
  },
  "ArmorPart_RThigh": {
    "type": "byte",
    "value": 4
  },
  "ArmorPart_Torso": {
    "type": "byte",
    "value": 49
  },
  "BaseItem": {
    "type": "int",
    "value": 16
  },
  "Charges": {
    "type": "byte",
    "value": 0
  },
  "Cloth1Color": {
    "type": "byte",
    "value": 23
  },
  "Cloth2Color": {
    "type": "byte",
    "value": 37
  },
  "Comment": {
    "type": "cexostring",
    "value": ""
  },
  "Cost": {
    "type": "dword",
    "value": 98019
  },
  "DescIdentified": {
    "type": "cexolocstring",
    "value": {
      "id": 13776
    }
  },
  "Description": {
    "type": "cexolocstring",
    "value": {}
  },
  "Identified": {
    "type": "byte",
    "value": 1
  },
  "Leather1Color": {
    "type": "byte",
    "value": 23
  },
  "Leather2Color": {
    "type": "byte",
    "value": 37
  },
  "LocalizedName": {
    "type": "cexolocstring",
    "value": {
      "id": 91036
    }
  },
  "Metal1Color": {
    "type": "byte",
    "value": 3
  },
  "Metal2Color": {
    "type": "byte",
    "value": 25
  },
  "PaletteID": {
    "type": "byte",
    "value": 6
  },
  "Plot": {
    "type": "byte",
    "value": 0
  },
  "PropertiesList": {
    "type": "list",
    "value": [
      {
        "__struct_id": 0,
        "ChanceAppear": {
          "type": "byte",
          "value": 100
        },
        "CostTable": {
          "type": "byte",
          "value": 2
        },
        "CostValue": {
          "type": "word",
          "value": 7
        },
        "Param1": {
          "type": "byte",
          "value": 255
        },
        "Param1Value": {
          "type": "byte",
          "value": 255
        },
        "PropertyName": {
          "type": "word",
          "value": 1
        },
        "Subtype": {
          "type": "word",
          "value": 0
        }
      }
    ]
  },
  "StackSize": {
    "type": "word",
    "value": 1
  },
  "Stolen": {
    "type": "byte",
    "value": 0
  },
  "Tag": {
    "type": "cexostring",
    "value": "X2_MDROWAR007"
  },
  "TemplateResRef": {
    "type": "resref",
    "value": "x2_mdrowar007"
  }
}
