{
  "__data_type": "UTM ",
  "BlackMarket": {
    "type": "byte",
    "value": 1
  },
  "BM_MarkDown": {
    "type": "int",
    "value": 25
  },
  "Comment": {
    "type": "cexostring",
    "value": "XP2 Chapter 2"
  },
  "ID": {
    "type": "byte",
    "value": 5
  },
  "LocName": {
    "type": "cexolocstring",
    "value": {
      "id": 14810
    }
  },
  "MarkDown": {
    "type": "int",
    "value": 35
  },
  "MarkUp": {
    "type": "int",
    "value": 150
  },
  "OnOpenStore": {
    "type": "resref",
    "value": "nw_d1_startstore"
  },
  "ResRef": {
    "type": "resref",
    "value": "x2_storethief002"
  },
  "StoreList": {
    "type": "list",
    "value": [
      {
        "__struct_id": 0,
        "ItemList": {
          "type": "list",
          "value": [
            {
              "__struct_id": 0,
              "Infinite": {
                "type": "byte",
                "value": 1
              },
              "InventoryRes": {
                "type": "resref",
                "value": "x0_maarcl001"
              },
              "Repos_PosX": {
                "type": "word",
                "value": 0
              },
              "Repos_Posy": {
                "type": "word",
                "value": 0
              }
            },
            {
              "__struct_id": 1,
              "Infinite": {
                "type": "byte",
                "value": 1
              },
              "InventoryRes": {
                "type": "resref",
                "value": "x0_maarcl009"
              },
              "Repos_PosX": {
                "type": "word",
                "value": 2
              },
              "Repos_Posy": {
                "type": "word",
                "value": 0
              }
            },
            {
              "__struct_id": 2,
              "Infinite": {
                "type": "byte",
                "value": 1
              },
              "InventoryRes": {
                "type": "resref",
                "value": "x0_ashmsw001"
              },
              "Repos_PosX": {
                "type": "word",
                "value": 4
              },
              "Repos_Posy": {
                "type": "word",
                "value": 0
              }
            },
            {
              "__struct_id": 3,
              "Infinite": {
                "type": "byte",
                "value": 1
              },
              "InventoryRes": {
                "type": "resref",
                "value": "nw_it_mboots013"
              },
              "Repos_PosX": {
                "type": "word",
                "value": 6
              },
              "Repos_Posy": {
                "type": "word",
                "value": 0
              }
            },
            {
              "__struct_id": 4,
              "Infinite": {
                "type": "byte",
                "value": 1
              },
              "InventoryRes": {
                "type": "resref",
                "value": "nw_it_mbelt021"
              },
              "Repos_PosX": {
                "type": "word",
                "value": 8
              },
              "Repos_Posy": {
                "type": "word",
                "value": 0
              }
            },
            {
              "__struct_id": 5,
              "Infinite": {
                "type": "byte",
                "value": 1
              },
              "InventoryRes": {
                "type": "resref",
                "value": "nw_it_mbracer005"
              },
              "Repos_PosX": {
                "type": "word",
                "value": 8
              },
              "Repos_Posy": {
                "type": "word",
                "value": 1
              }
            },
            {
              "__struct_id": 6,
              "Infinite": {
                "type": "byte",
                "value": 1
              },
              "InventoryRes": {
                "type": "resref",
                "value": "x0_maarcl002"
              },
              "Repos_PosX": {
                "type": "word",
                "value": 4
              },
              "Repos_Posy": {
                "type": "word",
                "value": 2
              }
            },
            {
              "__struct_id": 7,
              "Infinite": {
                "type": "byte",
                "value": 1
              },
              "InventoryRes": {
                "type": "resref",
                "value": "x0_maarcl010"
              },
              "Repos_PosX": {
                "type": "word",
                "value": 6
              },
              "Repos_Posy": {
                "type": "word",
                "value": 2
              }
            },
            {
              "__struct_id": 8,
              "Infinite": {
                "type": "byte",
                "value": 1
              },
              "InventoryRes": {
                "type": "resref",
                "value": "x0_ashmsw002"
              },
              "Repos_PosX": {
                "type": "word",
                "value": 8
              },
              "Repos_Posy": {
                "type": "word",
                "value": 2
              }
            },
            {
              "__struct_id": 9,
              "Infinite": {
                "type": "byte",
                "value": 1
              },
              "InventoryRes": {
                "type": "resref",
                "value": "nw_it_mboots014"
              },
              "Repos_PosX": {
                "type": "word",
                "value": 0
              },
              "Repos_Posy": {
                "type": "word",
                "value": 3
              }
            },
            {
              "__struct_id": 10,
              "Infinite": {
                "type": "byte",
                "value": 1
              },
              "InventoryRes": {
                "type": "resref",
                "value": "x2_it_mbelt003"
              },
              "Repos_PosX": {
                "type": "word",
                "value": 2
              },
              "Repos_Posy": {
                "type": "word",
                "value": 3
              }
            },
            {
              "__struct_id": 11,
              "Infinite": {
                "type": "byte",
                "value": 1
              },
              "InventoryRes": {
                "type": "resref",
                "value": "nw_it_mbracer006"
              },
              "Repos_PosX": {
                "type": "word",
                "value": 2
              },
              "Repos_Posy": {
                "type": "word",
                "value": 4
              }
            },
            {
              "__struct_id": 12,
              "Infinite": {
                "type": "byte",
                "value": 1
              },
              "InventoryRes": {
                "type": "resref",
                "value": "x2_mdrowar004"
              },
              "Repos_PosX": {
                "type": "word",
                "value": 8
              },
              "Repos_Posy": {
                "type": "word",
                "value": 4
              }
            },
            {
              "__struct_id": 13,
              "Infinite": {
                "type": "byte",
                "value": 1
              },
              "InventoryRes": {
                "type": "resref",
                "value": "x2_mdrowar011"
              },
              "Repos_PosX": {
                "type": "word",
                "value": 0
              },
              "Repos_Posy": {
                "type": "word",
                "value": 5
              }
            },
            {
              "__struct_id": 14,
              "Infinite": {
                "type": "byte",
                "value": 1
              },
              "InventoryRes": {
                "type": "resref",
                "value": "x2_mdrowar005"
              },
              "Repos_PosX": {
                "type": "word",
                "value": 2
              },
              "Repos_Posy": {
                "type": "word",
                "value": 5
              }
            },
            {
              "__struct_id": 15,
              "Infinite": {
                "type": "byte",
                "value": 1
              },
              "InventoryRes": {
                "type": "resref",
                "value": "x2_mdrowar012"
              },
              "Repos_PosX": {
                "type": "word",
                "value": 4
              },
              "Repos_Posy": {
                "type": "word",
                "value": 5
              }
            }
          ]
        }
      },
      {
        "__struct_id": 4,
        "ItemList": {
          "type": "list",
          "value": [
            {
              "__struct_id": 0,
              "Infinite": {
                "type": "byte",
                "value": 1
              },
              "InventoryRes": {
                "type": "resref",
                "value": "nw_wammar004"
              },
              "Repos_PosX": {
                "type": "word",
                "value": 0
              },
              "Repos_Posy": {
                "type": "word",
                "value": 0
              }
            },
            {
              "__struct_id": 1,
              "Infinite": {
                "type": "byte",
                "value": 1
              },
              "InventoryRes": {
                "type": "resref",
                "value": "nw_wambo001"
              },
              "Repos_PosX": {
                "type": "word",
                "value": 1
              },
              "Repos_Posy": {
                "type": "word",
                "value": 0
              }
            },
            {
              "__struct_id": 2,
              "Infinite": {
                "type": "byte",
                "value": 1
              },
              "InventoryRes": {
                "type": "resref",
                "value": "nw_wammbo004"
              },
              "Repos_PosX": {
                "type": "word",
                "value": 2
              },
              "Repos_Posy": {
                "type": "word",
                "value": 0
              }
            },
            {
              "__struct_id": 3,
              "Infinite": {
                "type": "byte",
                "value": 1
              },
              "InventoryRes": {
                "type": "resref",
                "value": "nw_wammar007"
              },
              "Repos_PosX": {
                "type": "word",
                "value": 3
              },
              "Repos_Posy": {
                "type": "word",
                "value": 0
              }
            },
            {
              "__struct_id": 4,
              "Infinite": {
                "type": "byte",
                "value": 1
              },
              "InventoryRes": {
                "type": "resref",
                "value": "nw_wammar008"
              },
              "Repos_PosX": {
                "type": "word",
                "value": 4
              },
              "Repos_Posy": {
                "type": "word",
                "value": 0
              }
            },
            {
              "__struct_id": 5,
              "Infinite": {
                "type": "byte",
                "value": 1
              },
              "InventoryRes": {
                "type": "resref",
                "value": "nw_wammbo006"
              },
              "Repos_PosX": {
                "type": "word",
                "value": 5
              },
              "Repos_Posy": {
                "type": "word",
                "value": 0
              }
            },
            {
              "__struct_id": 6,
              "Infinite": {
                "type": "byte",
                "value": 1
              },
              "InventoryRes": {
                "type": "resref",
                "value": "nw_wammbo007"
              },
              "Repos_PosX": {
                "type": "word",
                "value": 6
              },
              "Repos_Posy": {
                "type": "word",
                "value": 0
              }
            },
            {
              "__struct_id": 7,
              "Infinite": {
                "type": "byte",
                "value": 1
              },
              "InventoryRes": {
                "type": "resref",
                "value": "nw_wswmdg008"
              },
              "Repos_PosX": {
                "type": "word",
                "value": 7
              },
              "Repos_Posy": {
                "type": "word",
                "value": 0
              }
            },
            {
              "__struct_id": 8,
              "Infinite": {
                "type": "byte",
                "value": 1
              },
              "InventoryRes": {
                "type": "resref",
                "value": "nw_wswmdg009"
              },
              "Repos_PosX": {
                "type": "word",
                "value": 8
              },
              "Repos_Posy": {
                "type": "word",
                "value": 0
              }
            },
            {
              "__struct_id": 9,
              "Infinite": {
                "type": "byte",
                "value": 1
              },
              "InventoryRes": {
                "type": "resref",
                "value": "nw_wswmrp010"
              },
              "Repos_PosX": {
                "type": "word",
                "value": 9
              },
              "Repos_Posy": {
                "type": "word",
                "value": 0
              }
            },
            {
              "__struct_id": 10,
              "Infinite": {
                "type": "byte",
                "value": 1
              },
              "InventoryRes": {
                "type": "resref",
                "value": "nw_wswmrp011"
              },
              "Repos_PosX": {
                "type": "word",
                "value": 7
              },
              "Repos_Posy": {
                "type": "word",
                "value": 1
              }
            },
            {
              "__struct_id": 11,
              "Infinite": {
                "type": "byte",
                "value": 1
              },
              "InventoryRes": {
                "type": "resref",
                "value": "nw_wswmss009"
              },
              "Repos_PosX": {
                "type": "word",
                "value": 8
              },
              "Repos_Posy": {
                "type": "word",
                "value": 1
              }
            },
            {
              "__struct_id": 12,
              "Infinite": {
                "type": "byte",
                "value": 1
              },
              "InventoryRes": {
                "type": "resref",
                "value": "nw_wswmss011"
              },
              "Repos_PosX": {
                "type": "word",
                "value": 0
              },
              "Repos_Posy": {
                "type": "word",
                "value": 2
              }
            },
            {
              "__struct_id": 13,
              "Infinite": {
                "type": "byte",
                "value": 1
              },
              "InventoryRes": {
                "type": "resref",
                "value": "nw_wblmcl010"
              },
              "Repos_PosX": {
                "type": "word",
                "value": 1
              },
              "Repos_Posy": {
                "type": "word",
                "value": 2
              }
            },
            {
              "__struct_id": 14,
              "Infinite": {
                "type": "byte",
                "value": 1
              },
              "InventoryRes": {
                "type": "resref",
                "value": "nw_wblmcl011"
              },
              "Repos_PosX": {
                "type": "word",
                "value": 2
              },
              "Repos_Posy": {
                "type": "word",
                "value": 2
              }
            },
            {
              "__struct_id": 15,
              "Infinite": {
                "type": "byte",
                "value": 1
              },
              "InventoryRes": {
                "type": "resref",
                "value": "nw_wblmml011"
              },
              "Repos_PosX": {
                "type": "word",
                "value": 3
              },
              "Repos_Posy": {
                "type": "word",
                "value": 2
              }
            },
            {
              "__struct_id": 16,
              "Infinite": {
                "type": "byte",
                "value": 1
              },
              "InventoryRes": {
                "type": "resref",
                "value": "nw_wblmml012"
              },
              "Repos_PosX": {
                "type": "word",
                "value": 4
              },
              "Repos_Posy": {
                "type": "word",
                "value": 2
              }
            },
            {
              "__struct_id": 17,
              "Infinite": {
                "type": "byte",
                "value": 1
              },
              "InventoryRes": {
                "type": "resref",
                "value": "nw_wblmms010"
              },
              "Repos_PosX": {
                "type": "word",
                "value": 5
              },
              "Repos_Posy": {
                "type": "word",
                "value": 2
              }
            },
            {
              "__struct_id": 18,
              "Infinite": {
                "type": "byte",
                "value": 1
              },
              "InventoryRes": {
                "type": "resref",
                "value": "nw_wblmms011"
              },
              "Repos_PosX": {
                "type": "word",
                "value": 6
              },
              "Repos_Posy": {
                "type": "word",
                "value": 2
              }
            },
            {
              "__struct_id": 19,
              "Infinite": {
                "type": "byte",
                "value": 1
              },
              "InventoryRes": {
                "type": "resref",
                "value": "nw_wdbmqs008"
              },
              "Repos_PosX": {
                "type": "word",
                "value": 8
              },
              "Repos_Posy": {
                "type": "word",
                "value": 3
              }
            },
            {
              "__struct_id": 20,
              "Infinite": {
                "type": "byte",
                "value": 1
              },
              "InventoryRes": {
                "type": "resref",
                "value": "nw_wdbmqs009"
              },
              "Repos_PosX": {
                "type": "word",
                "value": 9
              },
              "Repos_Posy": {
                "type": "word",
                "value": 3
              }
            },
            {
              "__struct_id": 21,
              "Infinite": {
                "type": "byte",
                "value": 1
              },
              "InventoryRes": {
                "type": "resref",
                "value": "nw_wbwmxh008"
              },
              "Repos_PosX": {
                "type": "word",
                "value": 3
              },
              "Repos_Posy": {
                "type": "word",
                "value": 4
              }
            },
            {
              "__struct_id": 22,
              "Infinite": {
                "type": "byte",
                "value": 1
              },
              "InventoryRes": {
                "type": "resref",
                "value": "nw_wbwmxh009"
              },
              "Repos_PosX": {
                "type": "word",
                "value": 0
              },
              "Repos_Posy": {
                "type": "word",
                "value": 5
              }
            },
            {
              "__struct_id": 23,
              "Infinite": {
                "type": "byte",
                "value": 1
              },
              "InventoryRes": {
                "type": "resref",
                "value": "nw_wbwmxl008"
              },
              "Repos_PosX": {
                "type": "word",
                "value": 5
              },
              "Repos_Posy": {
                "type": "word",
                "value": 5
              }
            },
            {
              "__struct_id": 24,
              "Infinite": {
                "type": "byte",
                "value": 1
              },
              "InventoryRes": {
                "type": "resref",
                "value": "nw_wbwmxl009"
              },
              "Repos_PosX": {
                "type": "word",
                "value": 7
              },
              "Repos_Posy": {
                "type": "word",
                "value": 7
              }
            },
            {
              "__struct_id": 25,
              "Infinite": {
                "type": "byte",
                "value": 1
              },
              "InventoryRes": {
                "type": "resref",
                "value": "nw_wbwmsh011"
              },
              "Repos_PosX": {
                "type": "word",
                "value": 0
              },
              "Repos_Posy": {
                "type": "word",
                "value": 10
              }
            },
            {
              "__struct_id": 26,
              "Infinite": {
                "type": "byte",
                "value": 1
              },
              "InventoryRes": {
                "type": "resref",
                "value": "nw_wbwmsh012"
              },
              "Repos_PosX": {
                "type": "word",
                "value": 2
              },
              "Repos_Posy": {
                "type": "word",
                "value": 10
              }
            },
            {
              "__struct_id": 27,
              "Infinite": {
                "type": "byte",
                "value": 1
              },
              "InventoryRes": {
                "type": "resref",
                "value": "nw_wbwmsh008"
              },
              "Repos_PosX": {
                "type": "word",
                "value": 4
              },
              "Repos_Posy": {
                "type": "word",
                "value": 10
              }
            },
            {
              "__struct_id": 28,
              "Infinite": {
                "type": "byte",
                "value": 1
              },
              "InventoryRes": {
                "type": "resref",
                "value": "nw_wbwmsh009"
              },
              "Repos_PosX": {
                "type": "word",
                "value": 6
              },
              "Repos_Posy": {
                "type": "word",
                "value": 10
              }
            },
            {
              "__struct_id": 29,
              "Infinite": {
                "type": "byte",
                "value": 1
              },
              "InventoryRes": {
                "type": "resref",
                "value": "nw_wammar009"
              },
              "Repos_PosX": {
                "type": "word",
                "value": 7
              },
              "Repos_Posy": {
                "type": "word",
                "value": 4
              }
            },
            {
              "__struct_id": 30,
              "Infinite": {
                "type": "byte",
                "value": 1
              },
              "InventoryRes": {
                "type": "resref",
                "value": "nw_wammar010"
              },
              "Repos_PosX": {
                "type": "word",
                "value": 2
              },
              "Repos_Posy": {
                "type": "word",
                "value": 5
              }
            },
            {
              "__struct_id": 31,
              "Infinite": {
                "type": "byte",
                "value": 1
              },
              "InventoryRes": {
                "type": "resref",
                "value": "nw_wammar011"
              },
              "Repos_PosX": {
                "type": "word",
                "value": 2
              },
              "Repos_Posy": {
                "type": "word",
                "value": 7
              }
            },
            {
              "__struct_id": 32,
              "Infinite": {
                "type": "byte",
                "value": 1
              },
              "InventoryRes": {
                "type": "resref",
                "value": "nw_wammbo008"
              },
              "Repos_PosX": {
                "type": "word",
                "value": 9
              },
              "Repos_Posy": {
                "type": "word",
                "value": 7
              }
            },
            {
              "__struct_id": 33,
              "Infinite": {
                "type": "byte",
                "value": 1
              },
              "InventoryRes": {
                "type": "resref",
                "value": "nw_wammbo009"
              },
              "Repos_PosX": {
                "type": "word",
                "value": 3
              },
              "Repos_Posy": {
                "type": "word",
                "value": 8
              }
            },
            {
              "__struct_id": 34,
              "Infinite": {
                "type": "byte",
                "value": 1
              },
              "InventoryRes": {
                "type": "resref",
                "value": "nw_wammbo010"
              },
              "Repos_PosX": {
                "type": "word",
                "value": 4
              },
              "Repos_Posy": {
                "type": "word",
                "value": 8
              }
            },
            {
              "__struct_id": 35,
              "Infinite": {
                "type": "byte",
                "value": 1
              },
              "InventoryRes": {
                "type": "resref",
                "value": "nw_wamar001"
              },
              "Repos_PosX": {
                "type": "word",
                "value": 5
              },
              "Repos_Posy": {
                "type": "word",
                "value": 8
              }
            },
            {
              "__struct_id": 36,
              "Infinite": {
                "type": "byte",
                "value": 1
              },
              "InventoryRes": {
                "type": "resref",
                "value": "x0_wswmdg001"
              },
              "Repos_PosX": {
                "type": "word",
                "value": 0
              },
              "Repos_Posy": {
                "type": "word",
                "value": 4
              }
            },
            {
              "__struct_id": 37,
              "Infinite": {
                "type": "byte",
                "value": 1
              },
              "InventoryRes": {
                "type": "resref",
                "value": "x0_wswmrp001"
              },
              "Repos_PosX": {
                "type": "word",
                "value": 8
              },
              "Repos_Posy": {
                "type": "word",
                "value": 10
              }
            },
            {
              "__struct_id": 38,
              "Infinite": {
                "type": "byte",
                "value": 1
              },
              "InventoryRes": {
                "type": "resref",
                "value": "x0_wswmss001"
              },
              "Repos_PosX": {
                "type": "word",
                "value": 6
              },
              "Repos_Posy": {
                "type": "word",
                "value": 8
              }
            },
            {
              "__struct_id": 39,
              "Infinite": {
                "type": "byte",
                "value": 1
              },
              "InventoryRes": {
                "type": "resref",
                "value": "x0_wblmcl001"
              },
              "Repos_PosX": {
                "type": "word",
                "value": 9
              },
              "Repos_Posy": {
                "type": "word",
                "value": 10
              }
            },
            {
              "__struct_id": 40,
              "Infinite": {
                "type": "byte",
                "value": 1
              },
              "InventoryRes": {
                "type": "resref",
                "value": "x0_wblmml001"
              },
              "Repos_PosX": {
                "type": "word",
                "value": 0
              },
              "Repos_Posy": {
                "type": "word",
                "value": 13
              }
            },
            {
              "__struct_id": 41,
              "Infinite": {
                "type": "byte",
                "value": 1
              },
              "InventoryRes": {
                "type": "resref",
                "value": "x0_wblmms001"
              },
              "Repos_PosX": {
                "type": "word",
                "value": 1
              },
              "Repos_Posy": {
                "type": "word",
                "value": 13
              }
            },
            {
              "__struct_id": 42,
              "Infinite": {
                "type": "byte",
                "value": 1
              },
              "InventoryRes": {
                "type": "resref",
                "value": "x0_wdbmqs001"
              },
              "Repos_PosX": {
                "type": "word",
                "value": 2
              },
              "Repos_Posy": {
                "type": "word",
                "value": 13
              }
            },
            {
              "__struct_id": 43,
              "Infinite": {
                "type": "byte",
                "value": 1
              },
              "InventoryRes": {
                "type": "resref",
                "value": "x0_wbwmxh001"
              },
              "Repos_PosX": {
                "type": "word",
                "value": 3
              },
              "Repos_Posy": {
                "type": "word",
                "value": 13
              }
            },
            {
              "__struct_id": 44,
              "Infinite": {
                "type": "byte",
                "value": 1
              },
              "InventoryRes": {
                "type": "resref",
                "value": "x0_wbwmxl001"
              },
              "Repos_PosX": {
                "type": "word",
                "value": 5
              },
              "Repos_Posy": {
                "type": "word",
                "value": 13
              }
            },
            {
              "__struct_id": 45,
              "Infinite": {
                "type": "byte",
                "value": 1
              },
              "InventoryRes": {
                "type": "resref",
                "value": "x0_wbwmsh003"
              },
              "Repos_PosX": {
                "type": "word",
                "value": 7
              },
              "Repos_Posy": {
                "type": "word",
                "value": 13
              }
            },
            {
              "__struct_id": 46,
              "Infinite": {
                "type": "byte",
                "value": 1
              },
              "InventoryRes": {
                "type": "resref",
                "value": "x0_wbwmsh001"
              },
              "Repos_PosX": {
                "type": "word",
                "value": 0
              },
              "Repos_Posy": {
                "type": "word",
                "value": 16
              }
            }
          ]
        }
      },
      {
        "__struct_id": 2,
        "ItemList": {
          "type": "list",
          "value": [
            {
              "__struct_id": 0,
              "Infinite": {
                "type": "byte",
                "value": 1
              },
              "InventoryRes": {
                "type": "resref",
                "value": "nw_it_mpotion014"
              },
              "Repos_PosX": {
                "type": "word",
                "value": 0
              },
              "Repos_Posy": {
                "type": "word",
                "value": 0
              }
            },
            {
              "__struct_id": 1,
              "Infinite": {
                "type": "byte",
                "value": 1
              },
              "InventoryRes": {
                "type": "resref",
                "value": "nw_it_mpotion002"
              },
              "Repos_PosX": {
                "type": "word",
                "value": 1
              },
              "Repos_Posy": {
                "type": "word",
                "value": 0
              }
            },
            {
              "__struct_id": 2,
              "Infinite": {
                "type": "byte",
                "value": 1
              },
              "InventoryRes": {
                "type": "resref",
                "value": "nw_it_mpotion008"
              },
              "Repos_PosX": {
                "type": "word",
                "value": 2
              },
              "Repos_Posy": {
                "type": "word",
                "value": 0
              }
            },
            {
              "__struct_id": 3,
              "Infinite": {
                "type": "byte",
                "value": 1
              },
              "InventoryRes": {
                "type": "resref",
                "value": "nw_it_mpotion019"
              },
              "Repos_PosX": {
                "type": "word",
                "value": 3
              },
              "Repos_Posy": {
                "type": "word",
                "value": 0
              }
            },
            {
              "__struct_id": 4,
              "Infinite": {
                "type": "byte",
                "value": 1
              },
              "InventoryRes": {
                "type": "resref",
                "value": "nw_it_mpotion004"
              },
              "Repos_PosX": {
                "type": "word",
                "value": 4
              },
              "Repos_Posy": {
                "type": "word",
                "value": 0
              }
            },
            {
              "__struct_id": 5,
              "Infinite": {
                "type": "byte",
                "value": 1
              },
              "InventoryRes": {
                "type": "resref",
                "value": "nw_it_mpotion003"
              },
              "Repos_PosX": {
                "type": "word",
                "value": 5
              },
              "Repos_Posy": {
                "type": "word",
                "value": 0
              }
            },
            {
              "__struct_id": 6,
              "Infinite": {
                "type": "byte",
                "value": 1
              },
              "InventoryRes": {
                "type": "resref",
                "value": "nw_it_mpotion012"
              },
              "Repos_PosX": {
                "type": "word",
                "value": 6
              },
              "Repos_Posy": {
                "type": "word",
                "value": 0
              }
            }
          ]
        }
      },
      {
        "__struct_id": 3,
        "ItemList": {
          "type": "list",
          "value": [
            {
              "__struct_id": 0,
              "Infinite": {
                "type": "byte",
                "value": 1
              },
              "InventoryRes": {
                "type": "resref",
                "value": "nw_it_mneck012"
              },
              "Repos_PosX": {
                "type": "word",
                "value": 0
              },
              "Repos_Posy": {
                "type": "word",
                "value": 0
              }
            },
            {
              "__struct_id": 1,
              "Infinite": {
                "type": "byte",
                "value": 1
              },
              "InventoryRes": {
                "type": "resref",
                "value": "nw_it_mneck013"
              },
              "Repos_PosX": {
                "type": "word",
                "value": 1
              },
              "Repos_Posy": {
                "type": "word",
                "value": 0
              }
            },
            {
              "__struct_id": 2,
              "Infinite": {
                "type": "byte",
                "value": 1
              },
              "InventoryRes": {
                "type": "resref",
                "value": "nw_it_mneck025"
              },
              "Repos_PosX": {
                "type": "word",
                "value": 2
              },
              "Repos_Posy": {
                "type": "word",
                "value": 0
              }
            },
            {
              "__struct_id": 3,
              "Infinite": {
                "type": "byte",
                "value": 1
              },
              "InventoryRes": {
                "type": "resref",
                "value": "nw_it_mneck026"
              },
              "Repos_PosX": {
                "type": "word",
                "value": 3
              },
              "Repos_Posy": {
                "type": "word",
                "value": 0
              }
            },
            {
              "__struct_id": 4,
              "Infinite": {
                "type": "byte",
                "value": 1
              },
              "InventoryRes": {
                "type": "resref",
                "value": "nw_it_mneck016"
              },
              "Repos_PosX": {
                "type": "word",
                "value": 4
              },
              "Repos_Posy": {
                "type": "word",
                "value": 0
              }
            },
            {
              "__struct_id": 5,
              "Infinite": {
                "type": "byte",
                "value": 1
              },
              "InventoryRes": {
                "type": "resref",
                "value": "nw_it_mneck017"
              },
              "Repos_PosX": {
                "type": "word",
                "value": 5
              },
              "Repos_Posy": {
                "type": "word",
                "value": 0
              }
            },
            {
              "__struct_id": 6,
              "Infinite": {
                "type": "byte",
                "value": 1
              },
              "InventoryRes": {
                "type": "resref",
                "value": "nw_it_mring025"
              },
              "Repos_PosX": {
                "type": "word",
                "value": 6
              },
              "Repos_Posy": {
                "type": "word",
                "value": 0
              }
            },
            {
              "__struct_id": 7,
              "Infinite": {
                "type": "byte",
                "value": 1
              },
              "InventoryRes": {
                "type": "resref",
                "value": "nw_it_mring026"
              },
              "Repos_PosX": {
                "type": "word",
                "value": 7
              },
              "Repos_Posy": {
                "type": "word",
                "value": 0
              }
            },
            {
              "__struct_id": 8,
              "Infinite": {
                "type": "byte",
                "value": 1
              },
              "InventoryRes": {
                "type": "resref",
                "value": "nw_it_mring008"
              },
              "Repos_PosX": {
                "type": "word",
                "value": 8
              },
              "Repos_Posy": {
                "type": "word",
                "value": 0
              }
            },
            {
              "__struct_id": 9,
              "Infinite": {
                "type": "byte",
                "value": 1
              },
              "InventoryRes": {
                "type": "resref",
                "value": "nw_it_mring018"
              },
              "Repos_PosX": {
                "type": "word",
                "value": 9
              },
              "Repos_Posy": {
                "type": "word",
                "value": 0
              }
            },
            {
              "__struct_id": 10,
              "Infinite": {
                "type": "byte",
                "value": 1
              },
              "InventoryRes": {
                "type": "resref",
                "value": "nw_it_mring032"
              },
              "Repos_PosX": {
                "type": "word",
                "value": 6
              },
              "Repos_Posy": {
                "type": "word",
                "value": 1
              }
            },
            {
              "__struct_id": 11,
              "Infinite": {
                "type": "byte",
                "value": 1
              },
              "InventoryRes": {
                "type": "resref",
                "value": "nw_it_mring033"
              },
              "Repos_PosX": {
                "type": "word",
                "value": 7
              },
              "Repos_Posy": {
                "type": "word",
                "value": 1
              }
            },
            {
              "__struct_id": 12,
              "Infinite": {
                "type": "byte",
                "value": 1
              },
              "InventoryRes": {
                "type": "resref",
                "value": "nw_it_mneck014"
              },
              "Repos_PosX": {
                "type": "word",
                "value": 8
              },
              "Repos_Posy": {
                "type": "word",
                "value": 1
              }
            },
            {
              "__struct_id": 13,
              "Infinite": {
                "type": "byte",
                "value": 1
              },
              "InventoryRes": {
                "type": "resref",
                "value": "nw_it_mneck018"
              },
              "Repos_PosX": {
                "type": "word",
                "value": 9
              },
              "Repos_Posy": {
                "type": "word",
                "value": 1
              }
            },
            {
              "__struct_id": 14,
              "Infinite": {
                "type": "byte",
                "value": 1
              },
              "InventoryRes": {
                "type": "resref",
                "value": "nw_it_mneck027"
              },
              "Repos_PosX": {
                "type": "word",
                "value": 0
              },
              "Repos_Posy": {
                "type": "word",
                "value": 2
              }
            },
            {
              "__struct_id": 15,
              "Infinite": {
                "type": "byte",
                "value": 1
              },
              "InventoryRes": {
                "type": "resref",
                "value": "nw_it_mring027"
              },
              "Repos_PosX": {
                "type": "word",
                "value": 1
              },
              "Repos_Posy": {
                "type": "word",
                "value": 2
              }
            },
            {
              "__struct_id": 16,
              "Infinite": {
                "type": "byte",
                "value": 1
              },
              "InventoryRes": {
                "type": "resref",
                "value": "nw_it_mring019"
              },
              "Repos_PosX": {
                "type": "word",
                "value": 2
              },
              "Repos_Posy": {
                "type": "word",
                "value": 2
              }
            }
          ]
        }
      },
      {
        "__struct_id": 1,
        "ItemList": {
          "type": "list",
          "value": [
            {
              "__struct_id": 0,
              "InventoryRes": {
                "type": "resref",
                "value": "nw_it_torch001"
              },
              "Repos_PosX": {
                "type": "word",
                "value": 0
              },
              "Repos_Posy": {
                "type": "word",
                "value": 0
              }
            },
            {
              "__struct_id": 1,
              "InventoryRes": {
                "type": "resref",
                "value": "x1_wmgrenade003"
              },
              "Repos_PosX": {
                "type": "word",
                "value": 1
              },
              "Repos_Posy": {
                "type": "word",
                "value": 0
              }
            },
            {
              "__struct_id": 2,
              "InventoryRes": {
                "type": "resref",
                "value": "x1_wmgrenade003"
              },
              "Repos_PosX": {
                "type": "word",
                "value": 2
              },
              "Repos_Posy": {
                "type": "word",
                "value": 0
              }
            },
            {
              "__struct_id": 3,
              "InventoryRes": {
                "type": "resref",
                "value": "x1_wmgrenade003"
              },
              "Repos_PosX": {
                "type": "word",
                "value": 3
              },
              "Repos_Posy": {
                "type": "word",
                "value": 0
              }
            },
            {
              "__struct_id": 4,
              "InventoryRes": {
                "type": "resref",
                "value": "x1_wmgrenade004"
              },
              "Repos_PosX": {
                "type": "word",
                "value": 4
              },
              "Repos_Posy": {
                "type": "word",
                "value": 0
              }
            },
            {
              "__struct_id": 5,
              "InventoryRes": {
                "type": "resref",
                "value": "x1_wmgrenade004"
              },
              "Repos_PosX": {
                "type": "word",
                "value": 5
              },
              "Repos_Posy": {
                "type": "word",
                "value": 0
              }
            },
            {
              "__struct_id": 6,
              "InventoryRes": {
                "type": "resref",
                "value": "x1_wmgrenade004"
              },
              "Repos_PosX": {
                "type": "word",
                "value": 6
              },
              "Repos_Posy": {
                "type": "word",
                "value": 0
              }
            },
            {
              "__struct_id": 7,
              "Infinite": {
                "type": "byte",
                "value": 1
              },
              "InventoryRes": {
                "type": "resref",
                "value": "nw_it_picks003"
              },
              "Repos_PosX": {
                "type": "word",
                "value": 7
              },
              "Repos_Posy": {
                "type": "word",
                "value": 0
              }
            },
            {
              "__struct_id": 8,
              "Infinite": {
                "type": "byte",
                "value": 1
              },
              "InventoryRes": {
                "type": "resref",
                "value": "x2_it_picks001"
              },
              "Repos_PosX": {
                "type": "word",
                "value": 8
              },
              "Repos_Posy": {
                "type": "word",
                "value": 0
              }
            }
          ]
        }
      }
    ]
  },
  "Tag": {
    "type": "cexostring",
    "value": "X2_STORETHIEF002"
  }
}
