{
  "__data_type": "UTT ",
  "AutoRemoveKey": {
    "type": "byte",
    "value": 0
  },
  "Comment": {
    "type": "cexostring",
    "value": "Minor Electrical\r\nDetect DC: 14\r\nDisarm DC: 26\r\nSet DC: 20\r\nDamage / Effect: 6d8\r\nAverage Damage: 21\r\nArea of Effect: Large, Sphere\r\nMin to Max player level: 3 - 12"
  },
  "Cursor": {
    "type": "byte",
    "value": 0
  },
  "DisarmDC": {
    "type": "byte",
    "value": 26
  },
  "Faction": {
    "type": "dword",
    "value": 1
  },
  "HighlightHeight": {
    "type": "float",
    "value": 0.0
  },
  "KeyName": {
    "type": "cexostring",
    "value": ""
  },
  "LinkedTo": {
    "type": "cexostring",
    "value": ""
  },
  "LinkedToFlags": {
    "type": "byte",
    "value": 0
  },
  "LoadScreenID": {
    "type": "word",
    "value": 0
  },
  "LocalizedName": {
    "type": "cexolocstring",
    "value": {
      "id": 14786
    }
  },
  "OnClick": {
    "type": "resref",
    "value": ""
  },
  "OnDisarm": {
    "type": "resref",
    "value": ""
  },
  "OnTrapTriggered": {
    "type": "resref",
    "value": ""
  },
  "PaletteID": {
    "type": "byte",
    "value": 13
  },
  "PortraitId": {
    "type": "word",
    "value": 0
  },
  "ScriptHeartbeat": {
    "type": "resref",
    "value": ""
  },
  "ScriptOnEnter": {
    "type": "resref",
    "value": ""
  },
  "ScriptOnExit": {
    "type": "resref",
    "value": ""
  },
  "ScriptUserDefine": {
    "type": "resref",
    "value": ""
  },
  "Tag": {
    "type": "cexostring",
    "value": "NW_MELECTRAP001"
  },
  "TemplateResRef": {
    "type": "resref",
    "value": "nw_melectrap001"
  },
  "TrapDetectable": {
    "type": "byte",
    "value": 1
  },
  "TrapDetectDC": {
    "type": "byte",
    "value": 14
  },
  "TrapDisarmable": {
    "type": "byte",
    "value": 1
  },
  "TrapFlag": {
    "type": "byte",
    "value": 1
  },
  "TrapOneShot": {
    "type": "byte",
    "value": 1
  },
  "TrapType": {
    "type": "byte",
    "value": 20
  },
  "Type": {
    "type": "int",
    "value": 2
  }
}
