{
  "__data_type": "UTI ",
  "AddCost": {
    "type": "dword",
    "value": 5
  },
  "BaseItem": {
    "type": "int",
    "value": 101
  },
  "Charges": {
    "type": "byte",
    "value": 0
  },
  "Comment": {
    "type": "cexostring",
    "value": ""
  },
  "Cost": {
    "type": "dword",
    "value": 5
  },
  "Cursed": {
    "type": "byte",
    "value": 0
  },
  "DescIdentified": {
    "type": "cexolocstring",
    "value": {}
  },
  "Description": {
    "type": "cexolocstring",
    "value": {}
  },
  "Identified": {
    "type": "byte",
    "value": 1
  },
  "LocalizedName": {
    "type": "cexolocstring",
    "value": {
      "id": 90535
    }
  },
  "ModelPart1": {
    "type": "byte",
    "value": 28
  },
  "ModelPart2": {
    "type": "byte",
    "value": 73
  },
  "ModelPart3": {
    "type": "byte",
    "value": 71
  },
  "PaletteID": {
    "type": "byte",
    "value": 64
  },
  "Plot": {
    "type": "byte",
    "value": 0
  },
  "PropertiesList": {
    "type": "list",
    "value": []
  },
  "StackSize": {
    "type": "word",
    "value": 1
  },
  "Stolen": {
    "type": "byte",
    "value": 0
  },
  "Tag": {
    "type": "cexostring",
    "value": "x2_it_cfm_pbottl"
  },
  "TemplateResRef": {
    "type": "resref",
    "value": "x2_it_cfm_pbottl"
  }
}
