{
  "__data_type": "UTP ",
  "AnimationState": {
    "type": "byte",
    "value": 0
  },
  "Appearance": {
    "type": "dword",
    "value": 15427
  },
  "AutoRemoveKey": {
    "type": "byte",
    "value": 0
  },
  "BodyBag": {
    "type": "byte",
    "value": 0
  },
  "CloseLockDC": {
    "type": "byte",
    "value": 0
  },
  "Comment": {
    "type": "cexostring",
    "value": ""
  },
  "Conversation": {
    "type": "resref",
    "value": ""
  },
  "CurrentHP": {
    "type": "short",
    "value": 10
  },
  "Description": {
    "type": "cexolocstring",
    "value": {}
  },
  "DisarmDC": {
    "type": "byte",
    "value": 0
  },
  "Faction": {
    "type": "dword",
    "value": 1
  },
  "Fort": {
    "type": "byte",
    "value": 5
  },
  "Hardness": {
    "type": "byte",
    "value": 5
  },
  "HasInventory": {
    "type": "byte",
    "value": 0
  },
  "HP": {
    "type": "short",
    "value": 10
  },
  "Interruptable": {
    "type": "byte",
    "value": 1
  },
  "KeyName": {
    "type": "cexostring",
    "value": ""
  },
  "KeyRequired": {
    "type": "byte",
    "value": 0
  },
  "Lockable": {
    "type": "byte",
    "value": 1
  },
  "Locked": {
    "type": "byte",
    "value": 0
  },
  "LocName": {
    "type": "cexolocstring",
    "value": {
      "0": "Gaming - Card 01, Black"
    }
  },
  "OnClick": {
    "type": "resref",
    "value": ""
  },
  "OnClosed": {
    "type": "resref",
    "value": ""
  },
  "OnDamaged": {
    "type": "resref",
    "value": ""
  },
  "OnDeath": {
    "type": "resref",
    "value": ""
  },
  "OnDisarm": {
    "type": "resref",
    "value": ""
  },
  "OnHeartbeat": {
    "type": "resref",
    "value": ""
  },
  "OnInvDisturbed": {
    "type": "resref",
    "value": ""
  },
  "OnLock": {
    "type": "resref",
    "value": ""
  },
  "OnMeleeAttacked": {
    "type": "resref",
    "value": ""
  },
  "OnOpen": {
    "type": "resref",
    "value": ""
  },
  "OnSpellCastAt": {
    "type": "resref",
    "value": ""
  },
  "OnTrapTriggered": {
    "type": "resref",
    "value": ""
  },
  "OnUnlock": {
    "type": "resref",
    "value": ""
  },
  "OnUsed": {
    "type": "resref",
    "value": ""
  },
  "OnUserDefined": {
    "type": "resref",
    "value": ""
  },
  "OpenLockDC": {
    "type": "byte",
    "value": 0
  },
  "PaletteID": {
    "type": "byte",
    "value": 13
  },
  "Plot": {
    "type": "byte",
    "value": 0
  },
  "PortraitId": {
    "type": "word",
    "value": 15216
  },
  "Ref": {
    "type": "byte",
    "value": 0
  },
  "Static": {
    "type": "byte",
    "value": 1
  },
  "Tag": {
    "type": "cexostring",
    "value": "tm_pl_card01b"
  },
  "TemplateResRef": {
    "type": "resref",
    "value": "tm_pl_card01b"
  },
  "TrapDetectable": {
    "type": "byte",
    "value": 1
  },
  "TrapDetectDC": {
    "type": "byte",
    "value": 0
  },
  "TrapDisarmable": {
    "type": "byte",
    "value": 1
  },
  "TrapFlag": {
    "type": "byte",
    "value": 0
  },
  "TrapOneShot": {
    "type": "byte",
    "value": 1
  },
  "TrapType": {
    "type": "byte",
    "value": 0
  },
  "Type": {
    "type": "byte",
    "value": 0
  },
  "Useable": {
    "type": "byte",
    "value": 0
  },
  "Will": {
    "type": "byte",
    "value": 0
  }
}
