{
  "__data_type": "UTP ",
  "AnimationState": {
    "type": "byte",
    "value": 0
  },
  "Appearance": {
    "type": "dword",
    "value": 84
  },
  "AutoRemoveKey": {
    "type": "byte",
    "value": 0
  },
  "BodyBag": {
    "type": "byte",
    "value": 0
  },
  "CloseLockDC": {
    "type": "byte",
    "value": 0
  },
  "Comment": {
    "type": "cexostring",
    "value": "Plot container"
  },
  "Conversation": {
    "type": "resref",
    "value": ""
  },
  "CurrentHP": {
    "type": "short",
    "value": 10
  },
  "Description": {
    "type": "cexolocstring",
    "value": {
      "id": 67630
    }
  },
  "DisarmDC": {
    "type": "byte",
    "value": 0
  },
  "Faction": {
    "type": "dword",
    "value": 1
  },
  "Fort": {
    "type": "byte",
    "value": 5
  },
  "Hardness": {
    "type": "byte",
    "value": 5
  },
  "HasInventory": {
    "type": "byte",
    "value": 1
  },
  "HP": {
    "type": "short",
    "value": 10
  },
  "Interruptable": {
    "type": "byte",
    "value": 0
  },
  "ItemList": {
    "type": "list",
    "value": [
      {
        "__struct_id": 0,
        "InventoryRes": {
          "type": "resref",
          "value": "nw_it_msmlmisc11"
        },
        "Repos_PosX": {
          "type": "word",
          "value": 0
        },
        "Repos_Posy": {
          "type": "word",
          "value": 0
        }
      }
    ]
  },
  "KeyName": {
    "type": "cexostring",
    "value": ""
  },
  "KeyRequired": {
    "type": "byte",
    "value": 0
  },
  "Lockable": {
    "type": "byte",
    "value": 1
  },
  "Locked": {
    "type": "byte",
    "value": 0
  },
  "LocName": {
    "type": "cexolocstring",
    "value": {
      "id": 14682
    }
  },
  "OnClosed": {
    "type": "resref",
    "value": ""
  },
  "OnDamaged": {
    "type": "resref",
    "value": ""
  },
  "OnDeath": {
    "type": "resref",
    "value": ""
  },
  "OnDisarm": {
    "type": "resref",
    "value": ""
  },
  "OnHeartbeat": {
    "type": "resref",
    "value": ""
  },
  "OnInvDisturbed": {
    "type": "resref",
    "value": ""
  },
  "OnLock": {
    "type": "resref",
    "value": ""
  },
  "OnMeleeAttacked": {
    "type": "resref",
    "value": ""
  },
  "OnOpen": {
    "type": "resref",
    "value": ""
  },
  "OnSpellCastAt": {
    "type": "resref",
    "value": ""
  },
  "OnTrapTriggered": {
    "type": "resref",
    "value": ""
  },
  "OnUnlock": {
    "type": "resref",
    "value": ""
  },
  "OnUsed": {
    "type": "resref",
    "value": ""
  },
  "OnUserDefined": {
    "type": "resref",
    "value": ""
  },
  "OpenLockDC": {
    "type": "byte",
    "value": 0
  },
  "PaletteID": {
    "type": "byte",
    "value": 6
  },
  "Plot": {
    "type": "byte",
    "value": 1
  },
  "PortraitId": {
    "type": "word",
    "value": 442
  },
  "Ref": {
    "type": "byte",
    "value": 0
  },
  "Static": {
    "type": "byte",
    "value": 0
  },
  "Tag": {
    "type": "cexostring",
    "value": "PLC_PileStones"
  },
  "TemplateResRef": {
    "type": "resref",
    "value": "plc_pilestones"
  },
  "TrapDetectable": {
    "type": "byte",
    "value": 1
  },
  "TrapDetectDC": {
    "type": "byte",
    "value": 0
  },
  "TrapDisarmable": {
    "type": "byte",
    "value": 1
  },
  "TrapFlag": {
    "type": "byte",
    "value": 0
  },
  "TrapOneShot": {
    "type": "byte",
    "value": 1
  },
  "TrapType": {
    "type": "byte",
    "value": 1
  },
  "Type": {
    "type": "byte",
    "value": 0
  },
  "Useable": {
    "type": "byte",
    "value": 1
  },
  "Will": {
    "type": "byte",
    "value": 0
  }
}
