{
  "__data_type": "UTC ",
  "Appearance_Type": {
    "type": "word",
    "value": 403
  },
  "BodyBag": {
    "type": "byte",
    "value": 0
  },
  "Cha": {
    "type": "byte",
    "value": 12
  },
  "ChallengeRating": {
    "type": "float",
    "value": 8.0
  },
  "ClassList": {
    "type": "list",
    "value": [
      {
        "__struct_id": 2,
        "Class": {
          "type": "int",
          "value": 11
        },
        "ClassLevel": {
          "type": "short",
          "value": 9
        }
      }
    ]
  },
  "Comment": {
    "type": "cexostring",
    "value": "Eyeball (Familiar Level 09)"
  },
  "Con": {
    "type": "byte",
    "value": 9
  },
  "Conversation": {
    "type": "resref",
    "value": "nw_g_fam"
  },
  "CRAdjust": {
    "type": "int",
    "value": -2
  },
  "CurrentHitPoints": {
    "type": "short",
    "value": 43
  },
  "DecayTime": {
    "type": "dword",
    "value": 5000
  },
  "Deity": {
    "type": "cexostring",
    "value": ""
  },
  "Description": {
    "type": "cexolocstring",
    "value": {}
  },
  "Dex": {
    "type": "byte",
    "value": 18
  },
  "Disarmable": {
    "type": "byte",
    "value": 0
  },
  "Equip_ItemList": {
    "type": "list",
    "value": [
      {
        "__struct_id": 16384,
        "EquippedRes": {
          "type": "resref",
          "value": "nw_it_crewps002"
        }
      },
      {
        "__struct_id": 131072,
        "EquippedRes": {
          "type": "resref",
          "value": "x2_it_fm_eye005"
        }
      }
    ]
  },
  "FactionID": {
    "type": "word",
    "value": 2
  },
  "FeatList": {
    "type": "list",
    "value": [
      {
        "__struct_id": 1,
        "Feat": {
          "type": "word",
          "value": 0
        }
      },
      {
        "__struct_id": 1,
        "Feat": {
          "type": "word",
          "value": 10
        }
      },
      {
        "__struct_id": 1,
        "Feat": {
          "type": "word",
          "value": 26
        }
      },
      {
        "__struct_id": 1,
        "Feat": {
          "type": "word",
          "value": 42
        }
      },
      {
        "__struct_id": 1,
        "Feat": {
          "type": "word",
          "value": 289
        }
      }
    ]
  },
  "FirstName": {
    "type": "cexolocstring",
    "value": {
      "id": 90390
    }
  },
  "fortbonus": {
    "type": "short",
    "value": 0
  },
  "Gender": {
    "type": "byte",
    "value": 4
  },
  "GoodEvil": {
    "type": "byte",
    "value": 0
  },
  "HitPoints": {
    "type": "short",
    "value": 43
  },
  "Int": {
    "type": "byte",
    "value": 6
  },
  "Interruptable": {
    "type": "byte",
    "value": 1
  },
  "IsImmortal": {
    "type": "byte",
    "value": 0
  },
  "IsPC": {
    "type": "byte",
    "value": 0
  },
  "LastName": {
    "type": "cexolocstring",
    "value": {}
  },
  "LawfulChaotic": {
    "type": "byte",
    "value": 50
  },
  "Lootable": {
    "type": "byte",
    "value": 0
  },
  "MaxHitPoints": {
    "type": "short",
    "value": 34
  },
  "NaturalAC": {
    "type": "byte",
    "value": 6
  },
  "NoPermDeath": {
    "type": "byte",
    "value": 0
  },
  "PaletteID": {
    "type": "byte",
    "value": 254
  },
  "PerceptionRange": {
    "type": "byte",
    "value": 11
  },
  "Phenotype": {
    "type": "int",
    "value": 0
  },
  "Plot": {
    "type": "byte",
    "value": 0
  },
  "PortraitId": {
    "type": "word",
    "value": 703
  },
  "Race": {
    "type": "byte",
    "value": 7
  },
  "refbonus": {
    "type": "short",
    "value": 0
  },
  "ScriptAttacked": {
    "type": "resref",
    "value": "nw_ch_ac5"
  },
  "ScriptDamaged": {
    "type": "resref",
    "value": "nw_ch_ac5"
  },
  "ScriptDeath": {
    "type": "resref",
    "value": "nw_ch_ac7"
  },
  "ScriptDialogue": {
    "type": "resref",
    "value": "nw_ch_ac4"
  },
  "ScriptDisturbed": {
    "type": "resref",
    "value": "nw_ch_ac8"
  },
  "ScriptEndRound": {
    "type": "resref",
    "value": "nw_ch_ac3"
  },
  "ScriptHeartbeat": {
    "type": "resref",
    "value": "nw_ch_ac1"
  },
  "ScriptOnBlocked": {
    "type": "resref",
    "value": "nw_ch_ace"
  },
  "ScriptOnNotice": {
    "type": "resref",
    "value": "nw_ch_ac2"
  },
  "ScriptRested": {
    "type": "resref",
    "value": "nw_ch_aca"
  },
  "ScriptSpawn": {
    "type": "resref",
    "value": "nw_ch_ac9"
  },
  "ScriptSpellAt": {
    "type": "resref",
    "value": "nw_ch_acb"
  },
  "ScriptUserDefine": {
    "type": "resref",
    "value": "nw_ch_acd"
  },
  "SkillList": {
    "type": "list",
    "value": [
      {
        "__struct_id": 0,
        "Rank": {
          "type": "byte",
          "value": 0
        }
      },
      {
        "__struct_id": 0,
        "Rank": {
          "type": "byte",
          "value": 0
        }
      },
      {
        "__struct_id": 0,
        "Rank": {
          "type": "byte",
          "value": 0
        }
      },
      {
        "__struct_id": 0,
        "Rank": {
          "type": "byte",
          "value": 0
        }
      },
      {
        "__struct_id": 0,
        "Rank": {
          "type": "byte",
          "value": 0
        }
      },
      {
        "__struct_id": 0,
        "Rank": {
          "type": "byte",
          "value": 16
        }
      },
      {
        "__struct_id": 0,
        "Rank": {
          "type": "byte",
          "value": 6
        }
      },
      {
        "__struct_id": 0,
        "Rank": {
          "type": "byte",
          "value": 0
        }
      },
      {
        "__struct_id": 0,
        "Rank": {
          "type": "byte",
          "value": 0
        }
      },
      {
        "__struct_id": 0,
        "Rank": {
          "type": "byte",
          "value": 0
        }
      },
      {
        "__struct_id": 0,
        "Rank": {
          "type": "byte",
          "value": 0
        }
      },
      {
        "__struct_id": 0,
        "Rank": {
          "type": "byte",
          "value": 0
        }
      },
      {
        "__struct_id": 0,
        "Rank": {
          "type": "byte",
          "value": 0
        }
      },
      {
        "__struct_id": 0,
        "Rank": {
          "type": "byte",
          "value": 0
        }
      },
      {
        "__struct_id": 0,
        "Rank": {
          "type": "byte",
          "value": 13
        }
      },
      {
        "__struct_id": 0,
        "Rank": {
          "type": "byte",
          "value": 0
        }
      },
      {
        "__struct_id": 0,
        "Rank": {
          "type": "byte",
          "value": 0
        }
      },
      {
        "__struct_id": 0,
        "Rank": {
          "type": "byte",
          "value": 13
        }
      },
      {
        "__struct_id": 0,
        "Rank": {
          "type": "byte",
          "value": 0
        }
      },
      {
        "__struct_id": 0,
        "Rank": {
          "type": "byte",
          "value": 0
        }
      },
      {
        "__struct_id": 0,
        "Rank": {
          "type": "byte",
          "value": 0
        }
      },
      {
        "__struct_id": 0,
        "Rank": {
          "type": "byte",
          "value": 0
        }
      },
      {
        "__struct_id": 0,
        "Rank": {
          "type": "byte",
          "value": 0
        }
      },
      {
        "__struct_id": 0,
        "Rank": {
          "type": "byte",
          "value": 0
        }
      },
      {
        "__struct_id": 0,
        "Rank": {
          "type": "byte",
          "value": 0
        }
      },
      {
        "__struct_id": 0,
        "Rank": {
          "type": "byte",
          "value": 0
        }
      },
      {
        "__struct_id": 0,
        "Rank": {
          "type": "byte",
          "value": 0
        }
      }
    ]
  },
  "SoundSetFile": {
    "type": "word",
    "value": 374
  },
  "SpecAbilityList": {
    "type": "list",
    "value": [
      {
        "__struct_id": 4,
        "Spell": {
          "type": "word",
          "value": 710
        },
        "SpellCasterLevel": {
          "type": "byte",
          "value": 0
        },
        "SpellFlags": {
          "type": "byte",
          "value": 1
        }
      },
      {
        "__struct_id": 4,
        "Spell": {
          "type": "word",
          "value": 710
        },
        "SpellCasterLevel": {
          "type": "byte",
          "value": 0
        },
        "SpellFlags": {
          "type": "byte",
          "value": 1
        }
      },
      {
        "__struct_id": 4,
        "Spell": {
          "type": "word",
          "value": 710
        },
        "SpellCasterLevel": {
          "type": "byte",
          "value": 0
        },
        "SpellFlags": {
          "type": "byte",
          "value": 1
        }
      },
      {
        "__struct_id": 4,
        "Spell": {
          "type": "word",
          "value": 710
        },
        "SpellCasterLevel": {
          "type": "byte",
          "value": 0
        },
        "SpellFlags": {
          "type": "byte",
          "value": 1
        }
      },
      {
        "__struct_id": 4,
        "Spell": {
          "type": "word",
          "value": 710
        },
        "SpellCasterLevel": {
          "type": "byte",
          "value": 0
        },
        "SpellFlags": {
          "type": "byte",
          "value": 1
        }
      },
      {
        "__struct_id": 4,
        "Spell": {
          "type": "word",
          "value": 710
        },
        "SpellCasterLevel": {
          "type": "byte",
          "value": 0
        },
        "SpellFlags": {
          "type": "byte",
          "value": 1
        }
      },
      {
        "__struct_id": 4,
        "Spell": {
          "type": "word",
          "value": 710
        },
        "SpellCasterLevel": {
          "type": "byte",
          "value": 0
        },
        "SpellFlags": {
          "type": "byte",
          "value": 1
        }
      },
      {
        "__struct_id": 4,
        "Spell": {
          "type": "word",
          "value": 710
        },
        "SpellCasterLevel": {
          "type": "byte",
          "value": 0
        },
        "SpellFlags": {
          "type": "byte",
          "value": 1
        }
      },
      {
        "__struct_id": 4,
        "Spell": {
          "type": "word",
          "value": 710
        },
        "SpellCasterLevel": {
          "type": "byte",
          "value": 0
        },
        "SpellFlags": {
          "type": "byte",
          "value": 1
        }
      },
      {
        "__struct_id": 4,
        "Spell": {
          "type": "word",
          "value": 710
        },
        "SpellCasterLevel": {
          "type": "byte",
          "value": 0
        },
        "SpellFlags": {
          "type": "byte",
          "value": 1
        }
      },
      {
        "__struct_id": 4,
        "Spell": {
          "type": "word",
          "value": 710
        },
        "SpellCasterLevel": {
          "type": "byte",
          "value": 0
        },
        "SpellFlags": {
          "type": "byte",
          "value": 1
        }
      },
      {
        "__struct_id": 4,
        "Spell": {
          "type": "word",
          "value": 710
        },
        "SpellCasterLevel": {
          "type": "byte",
          "value": 0
        },
        "SpellFlags": {
          "type": "byte",
          "value": 1
        }
      },
      {
        "__struct_id": 4,
        "Spell": {
          "type": "word",
          "value": 710
        },
        "SpellCasterLevel": {
          "type": "byte",
          "value": 0
        },
        "SpellFlags": {
          "type": "byte",
          "value": 1
        }
      },
      {
        "__struct_id": 4,
        "Spell": {
          "type": "word",
          "value": 710
        },
        "SpellCasterLevel": {
          "type": "byte",
          "value": 0
        },
        "SpellFlags": {
          "type": "byte",
          "value": 1
        }
      },
      {
        "__struct_id": 4,
        "Spell": {
          "type": "word",
          "value": 710
        },
        "SpellCasterLevel": {
          "type": "byte",
          "value": 0
        },
        "SpellFlags": {
          "type": "byte",
          "value": 1
        }
      },
      {
        "__struct_id": 4,
        "Spell": {
          "type": "word",
          "value": 710
        },
        "SpellCasterLevel": {
          "type": "byte",
          "value": 0
        },
        "SpellFlags": {
          "type": "byte",
          "value": 1
        }
      },
      {
        "__struct_id": 4,
        "Spell": {
          "type": "word",
          "value": 710
        },
        "SpellCasterLevel": {
          "type": "byte",
          "value": 0
        },
        "SpellFlags": {
          "type": "byte",
          "value": 1
        }
      },
      {
        "__struct_id": 4,
        "Spell": {
          "type": "word",
          "value": 710
        },
        "SpellCasterLevel": {
          "type": "byte",
          "value": 0
        },
        "SpellFlags": {
          "type": "byte",
          "value": 1
        }
      },
      {
        "__struct_id": 4,
        "Spell": {
          "type": "word",
          "value": 710
        },
        "SpellCasterLevel": {
          "type": "byte",
          "value": 0
        },
        "SpellFlags": {
          "type": "byte",
          "value": 1
        }
      },
      {
        "__struct_id": 4,
        "Spell": {
          "type": "word",
          "value": 710
        },
        "SpellCasterLevel": {
          "type": "byte",
          "value": 0
        },
        "SpellFlags": {
          "type": "byte",
          "value": 1
        }
      },
      {
        "__struct_id": 4,
        "Spell": {
          "type": "word",
          "value": 710
        },
        "SpellCasterLevel": {
          "type": "byte",
          "value": 0
        },
        "SpellFlags": {
          "type": "byte",
          "value": 1
        }
      },
      {
        "__struct_id": 4,
        "Spell": {
          "type": "word",
          "value": 710
        },
        "SpellCasterLevel": {
          "type": "byte",
          "value": 0
        },
        "SpellFlags": {
          "type": "byte",
          "value": 1
        }
      },
      {
        "__struct_id": 4,
        "Spell": {
          "type": "word",
          "value": 710
        },
        "SpellCasterLevel": {
          "type": "byte",
          "value": 0
        },
        "SpellFlags": {
          "type": "byte",
          "value": 1
        }
      },
      {
        "__struct_id": 4,
        "Spell": {
          "type": "word",
          "value": 710
        },
        "SpellCasterLevel": {
          "type": "byte",
          "value": 0
        },
        "SpellFlags": {
          "type": "byte",
          "value": 1
        }
      },
      {
        "__struct_id": 4,
        "Spell": {
          "type": "word",
          "value": 711
        },
        "SpellCasterLevel": {
          "type": "byte",
          "value": 0
        },
        "SpellFlags": {
          "type": "byte",
          "value": 1
        }
      },
      {
        "__struct_id": 4,
        "Spell": {
          "type": "word",
          "value": 711
        },
        "SpellCasterLevel": {
          "type": "byte",
          "value": 0
        },
        "SpellFlags": {
          "type": "byte",
          "value": 1
        }
      },
      {
        "__struct_id": 4,
        "Spell": {
          "type": "word",
          "value": 711
        },
        "SpellCasterLevel": {
          "type": "byte",
          "value": 0
        },
        "SpellFlags": {
          "type": "byte",
          "value": 1
        }
      },
      {
        "__struct_id": 4,
        "Spell": {
          "type": "word",
          "value": 711
        },
        "SpellCasterLevel": {
          "type": "byte",
          "value": 0
        },
        "SpellFlags": {
          "type": "byte",
          "value": 1
        }
      },
      {
        "__struct_id": 4,
        "Spell": {
          "type": "word",
          "value": 711
        },
        "SpellCasterLevel": {
          "type": "byte",
          "value": 0
        },
        "SpellFlags": {
          "type": "byte",
          "value": 1
        }
      },
      {
        "__struct_id": 4,
        "Spell": {
          "type": "word",
          "value": 711
        },
        "SpellCasterLevel": {
          "type": "byte",
          "value": 0
        },
        "SpellFlags": {
          "type": "byte",
          "value": 1
        }
      },
      {
        "__struct_id": 4,
        "Spell": {
          "type": "word",
          "value": 711
        },
        "SpellCasterLevel": {
          "type": "byte",
          "value": 0
        },
        "SpellFlags": {
          "type": "byte",
          "value": 1
        }
      },
      {
        "__struct_id": 4,
        "Spell": {
          "type": "word",
          "value": 711
        },
        "SpellCasterLevel": {
          "type": "byte",
          "value": 0
        },
        "SpellFlags": {
          "type": "byte",
          "value": 1
        }
      },
      {
        "__struct_id": 4,
        "Spell": {
          "type": "word",
          "value": 711
        },
        "SpellCasterLevel": {
          "type": "byte",
          "value": 0
        },
        "SpellFlags": {
          "type": "byte",
          "value": 1
        }
      },
      {
        "__struct_id": 4,
        "Spell": {
          "type": "word",
          "value": 711
        },
        "SpellCasterLevel": {
          "type": "byte",
          "value": 0
        },
        "SpellFlags": {
          "type": "byte",
          "value": 1
        }
      },
      {
        "__struct_id": 4,
        "Spell": {
          "type": "word",
          "value": 711
        },
        "SpellCasterLevel": {
          "type": "byte",
          "value": 0
        },
        "SpellFlags": {
          "type": "byte",
          "value": 1
        }
      },
      {
        "__struct_id": 4,
        "Spell": {
          "type": "word",
          "value": 711
        },
        "SpellCasterLevel": {
          "type": "byte",
          "value": 0
        },
        "SpellFlags": {
          "type": "byte",
          "value": 1
        }
      }
    ]
  },
  "StartingPackage": {
    "type": "byte",
    "value": 73
  },
  "Str": {
    "type": "byte",
    "value": 7
  },
  "Subrace": {
    "type": "cexostring",
    "value": "Eyeball"
  },
  "Tag": {
    "type": "cexostring",
    "value": "X2_FM_EYE009"
  },
  "Tail": {
    "type": "byte",
    "value": 0
  },
  "TemplateList": {
    "type": "list",
    "value": []
  },
  "TemplateResRef": {
    "type": "resref",
    "value": "x2_fm_eye009"
  },
  "WalkRate": {
    "type": "int",
    "value": 7
  },
  "willbonus": {
    "type": "short",
    "value": 0
  },
  "Wings": {
    "type": "byte",
    "value": 0
  },
  "Wis": {
    "type": "byte",
    "value": 10
  }
}
