{
  "__data_type": "UTC ",
  "Appearance_Type": {
    "type": "word",
    "value": 118
  },
  "BodyBag": {
    "type": "byte",
    "value": 0
  },
  "Cha": {
    "type": "byte",
    "value": 16
  },
  "ChallengeRating": {
    "type": "float",
    "value": 14.0
  },
  "ClassList": {
    "type": "list",
    "value": [
      {
        "__struct_id": 2,
        "Class": {
          "type": "int",
          "value": 18
        },
        "ClassLevel": {
          "type": "short",
          "value": 21
        }
      }
    ]
  },
  "Comment": {
    "type": "cexostring",
    "value": ""
  },
  "Con": {
    "type": "byte",
    "value": 21
  },
  "Conversation": {
    "type": "resref",
    "value": ""
  },
  "CRAdjust": {
    "type": "int",
    "value": 0
  },
  "CurrentHitPoints": {
    "type": "short",
    "value": 136
  },
  "DecayTime": {
    "type": "dword",
    "value": 5000
  },
  "Deity": {
    "type": "cexostring",
    "value": ""
  },
  "Description": {
    "type": "cexolocstring",
    "value": {
      "id": 111394
    }
  },
  "Dex": {
    "type": "byte",
    "value": 10
  },
  "Disarmable": {
    "type": "byte",
    "value": 0
  },
  "Equip_ItemList": {
    "type": "list",
    "value": [
      {
        "__struct_id": 16384,
        "EquippedRes": {
          "type": "resref",
          "value": "nw_it_crewpsp015"
        }
      },
      {
        "__struct_id": 32768,
        "EquippedRes": {
          "type": "resref",
          "value": "nw_it_crewpsp015"
        }
      },
      {
        "__struct_id": 65536,
        "EquippedRes": {
          "type": "resref",
          "value": "nw_it_crewps017"
        }
      },
      {
        "__struct_id": 131072,
        "EquippedRes": {
          "type": "resref",
          "value": "nw_it_creitemdra"
        }
      }
    ]
  },
  "FactionID": {
    "type": "word",
    "value": 1
  },
  "FeatList": {
    "type": "list",
    "value": [
      {
        "__struct_id": 1,
        "Feat": {
          "type": "word",
          "value": 6
        }
      },
      {
        "__struct_id": 1,
        "Feat": {
          "type": "word",
          "value": 228
        }
      },
      {
        "__struct_id": 1,
        "Feat": {
          "type": "word",
          "value": 28
        }
      },
      {
        "__struct_id": 1,
        "Feat": {
          "type": "word",
          "value": 289
        }
      }
    ]
  },
  "FirstName": {
    "type": "cexolocstring",
    "value": {
      "id": 111393
    }
  },
  "fortbonus": {
    "type": "short",
    "value": 0
  },
  "Gender": {
    "type": "byte",
    "value": 0
  },
  "GoodEvil": {
    "type": "byte",
    "value": 50
  },
  "HitPoints": {
    "type": "short",
    "value": 136
  },
  "Int": {
    "type": "byte",
    "value": 16
  },
  "Interruptable": {
    "type": "byte",
    "value": 1
  },
  "IsImmortal": {
    "type": "byte",
    "value": 0
  },
  "IsPC": {
    "type": "byte",
    "value": 0
  },
  "LastName": {
    "type": "cexolocstring",
    "value": {}
  },
  "LawfulChaotic": {
    "type": "byte",
    "value": 50
  },
  "Lootable": {
    "type": "byte",
    "value": 0
  },
  "MaxHitPoints": {
    "type": "short",
    "value": 241
  },
  "NaturalAC": {
    "type": "byte",
    "value": 20
  },
  "NoPermDeath": {
    "type": "byte",
    "value": 0
  },
  "PaletteID": {
    "type": "byte",
    "value": 21
  },
  "PerceptionRange": {
    "type": "byte",
    "value": 11
  },
  "Phenotype": {
    "type": "int",
    "value": 0
  },
  "Plot": {
    "type": "byte",
    "value": 0
  },
  "PortraitId": {
    "type": "word",
    "value": 1268
  },
  "Race": {
    "type": "byte",
    "value": 11
  },
  "refbonus": {
    "type": "short",
    "value": 0
  },
  "ScriptAttacked": {
    "type": "resref",
    "value": "x2_def_attacked"
  },
  "ScriptDamaged": {
    "type": "resref",
    "value": "x2_def_ondamage"
  },
  "ScriptDeath": {
    "type": "resref",
    "value": "x2_def_ondeath"
  },
  "ScriptDialogue": {
    "type": "resref",
    "value": "x2_def_onconv"
  },
  "ScriptDisturbed": {
    "type": "resref",
    "value": "x2_def_ondisturb"
  },
  "ScriptEndRound": {
    "type": "resref",
    "value": "x2_def_endcombat"
  },
  "ScriptHeartbeat": {
    "type": "resref",
    "value": "x2_def_heartbeat"
  },
  "ScriptOnBlocked": {
    "type": "resref",
    "value": "x2_def_onblocked"
  },
  "ScriptOnNotice": {
    "type": "resref",
    "value": "x2_def_percept"
  },
  "ScriptRested": {
    "type": "resref",
    "value": "x2_def_rested"
  },
  "ScriptSpawn": {
    "type": "resref",
    "value": "x2_def_spawn"
  },
  "ScriptSpellAt": {
    "type": "resref",
    "value": "x2_def_spellcast"
  },
  "ScriptUserDefine": {
    "type": "resref",
    "value": "x2_def_userdef"
  },
  "SkillList": {
    "type": "list",
    "value": [
      {
        "__struct_id": 0,
        "Rank": {
          "type": "byte",
          "value": 0
        }
      },
      {
        "__struct_id": 0,
        "Rank": {
          "type": "byte",
          "value": 0
        }
      },
      {
        "__struct_id": 0,
        "Rank": {
          "type": "byte",
          "value": 0
        }
      },
      {
        "__struct_id": 0,
        "Rank": {
          "type": "byte",
          "value": 0
        }
      },
      {
        "__struct_id": 0,
        "Rank": {
          "type": "byte",
          "value": 0
        }
      },
      {
        "__struct_id": 0,
        "Rank": {
          "type": "byte",
          "value": 0
        }
      },
      {
        "__struct_id": 0,
        "Rank": {
          "type": "byte",
          "value": 8
        }
      },
      {
        "__struct_id": 0,
        "Rank": {
          "type": "byte",
          "value": 0
        }
      },
      {
        "__struct_id": 0,
        "Rank": {
          "type": "byte",
          "value": 8
        }
      },
      {
        "__struct_id": 0,
        "Rank": {
          "type": "byte",
          "value": 0
        }
      },
      {
        "__struct_id": 0,
        "Rank": {
          "type": "byte",
          "value": 0
        }
      },
      {
        "__struct_id": 0,
        "Rank": {
          "type": "byte",
          "value": 0
        }
      },
      {
        "__struct_id": 0,
        "Rank": {
          "type": "byte",
          "value": 4
        }
      },
      {
        "__struct_id": 0,
        "Rank": {
          "type": "byte",
          "value": 0
        }
      },
      {
        "__struct_id": 0,
        "Rank": {
          "type": "byte",
          "value": 0
        }
      },
      {
        "__struct_id": 0,
        "Rank": {
          "type": "byte",
          "value": 0
        }
      },
      {
        "__struct_id": 0,
        "Rank": {
          "type": "byte",
          "value": 0
        }
      },
      {
        "__struct_id": 0,
        "Rank": {
          "type": "byte",
          "value": 15
        }
      },
      {
        "__struct_id": 0,
        "Rank": {
          "type": "byte",
          "value": 0
        }
      },
      {
        "__struct_id": 0,
        "Rank": {
          "type": "byte",
          "value": 0
        }
      },
      {
        "__struct_id": 0,
        "Rank": {
          "type": "byte",
          "value": 0
        }
      },
      {
        "__struct_id": 0,
        "Rank": {
          "type": "byte",
          "value": 0
        }
      },
      {
        "__struct_id": 0,
        "Rank": {
          "type": "byte",
          "value": 0
        }
      },
      {
        "__struct_id": 0,
        "Rank": {
          "type": "byte",
          "value": 21
        }
      },
      {
        "__struct_id": 0,
        "Rank": {
          "type": "byte",
          "value": 10
        }
      },
      {
        "__struct_id": 0,
        "Rank": {
          "type": "byte",
          "value": 0
        }
      },
      {
        "__struct_id": 0,
        "Rank": {
          "type": "byte",
          "value": 0
        }
      },
      {
        "__struct_id": 0,
        "Rank": {
          "type": "byte",
          "value": 0
        }
      }
    ]
  },
  "SoundSetFile": {
    "type": "word",
    "value": 208
  },
  "SpecAbilityList": {
    "type": "list",
    "value": [
      {
        "__struct_id": 4,
        "Spell": {
          "type": "word",
          "value": 412
        },
        "SpellCasterLevel": {
          "type": "byte",
          "value": 0
        },
        "SpellFlags": {
          "type": "byte",
          "value": 1
        }
      },
      {
        "__struct_id": 4,
        "Spell": {
          "type": "word",
          "value": 569
        },
        "SpellCasterLevel": {
          "type": "byte",
          "value": 9
        },
        "SpellFlags": {
          "type": "byte",
          "value": 1
        }
      },
      {
        "__struct_id": 4,
        "Spell": {
          "type": "word",
          "value": 26
        },
        "SpellCasterLevel": {
          "type": "byte",
          "value": 7
        },
        "SpellFlags": {
          "type": "byte",
          "value": 1
        }
      },
      {
        "__struct_id": 4,
        "Spell": {
          "type": "word",
          "value": 236
        },
        "SpellCasterLevel": {
          "type": "byte",
          "value": 0
        },
        "SpellFlags": {
          "type": "byte",
          "value": 1
        }
      },
      {
        "__struct_id": 4,
        "Spell": {
          "type": "word",
          "value": 797
        },
        "SpellCasterLevel": {
          "type": "byte",
          "value": 0
        },
        "SpellFlags": {
          "type": "byte",
          "value": 1
        }
      },
      {
        "__struct_id": 4,
        "Spell": {
          "type": "word",
          "value": 75
        },
        "SpellCasterLevel": {
          "type": "byte",
          "value": 9
        },
        "SpellFlags": {
          "type": "byte",
          "value": 1
        }
      },
      {
        "__struct_id": 4,
        "Spell": {
          "type": "word",
          "value": 75
        },
        "SpellCasterLevel": {
          "type": "byte",
          "value": 9
        },
        "SpellFlags": {
          "type": "byte",
          "value": 1
        }
      },
      {
        "__struct_id": 4,
        "Spell": {
          "type": "word",
          "value": 75
        },
        "SpellCasterLevel": {
          "type": "byte",
          "value": 9
        },
        "SpellFlags": {
          "type": "byte",
          "value": 1
        }
      },
      {
        "__struct_id": 4,
        "Spell": {
          "type": "word",
          "value": 83
        },
        "SpellCasterLevel": {
          "type": "byte",
          "value": 9
        },
        "SpellFlags": {
          "type": "byte",
          "value": 1
        }
      },
      {
        "__struct_id": 4,
        "Spell": {
          "type": "word",
          "value": 368
        },
        "SpellCasterLevel": {
          "type": "byte",
          "value": 9
        },
        "SpellFlags": {
          "type": "byte",
          "value": 1
        }
      }
    ]
  },
  "StartingPackage": {
    "type": "byte",
    "value": 80
  },
  "Str": {
    "type": "byte",
    "value": 27
  },
  "Subrace": {
    "type": "cexostring",
    "value": ""
  },
  "Tag": {
    "type": "cexostring",
    "value": "X3_DRAGMIST001"
  },
  "Tail": {
    "type": "byte",
    "value": 0
  },
  "TemplateList": {
    "type": "list",
    "value": []
  },
  "TemplateResRef": {
    "type": "resref",
    "value": "x3_dragmist001"
  },
  "WalkRate": {
    "type": "int",
    "value": 7
  },
  "willbonus": {
    "type": "short",
    "value": 0
  },
  "Wings": {
    "type": "byte",
    "value": 0
  },
  "Wis": {
    "type": "byte",
    "value": 17
  }
}
