{
  "__data_type": "UTE ",
  "Active": {
    "type": "byte",
    "value": 1
  },
  "Comment": {
    "type": "cexostring",
    "value": ""
  },
  "CreatureList": {
    "type": "list",
    "value": [
      {
        "__struct_id": 0,
        "Appearance": {
          "type": "int",
          "value": 102
        },
        "CR": {
          "type": "float",
          "value": 5.0
        },
        "ResRef": {
          "type": "resref",
          "value": "nw_horror"
        },
        "SingleSpawn": {
          "type": "byte",
          "value": 0
        }
      },
      {
        "__struct_id": 0,
        "Appearance": {
          "type": "int",
          "value": 117
        },
        "CR": {
          "type": "float",
          "value": 7.0
        },
        "ResRef": {
          "type": "resref",
          "value": "nw_devour"
        },
        "SingleSpawn": {
          "type": "byte",
          "value": 0
        }
      },
      {
        "__struct_id": 0,
        "Appearance": {
          "type": "int",
          "value": 168
        },
        "CR": {
          "type": "float",
          "value": 9.0
        },
        "ResRef": {
          "type": "resref",
          "value": "nw_umberhulk"
        },
        "SingleSpawn": {
          "type": "byte",
          "value": 0
        }
      },
      {
        "__struct_id": 0,
        "Appearance": {
          "type": "int",
          "value": 54
        },
        "CR": {
          "type": "float",
          "value": 11.0
        },
        "ResRef": {
          "type": "resref",
          "value": "nw_battdevour"
        },
        "SingleSpawn": {
          "type": "byte",
          "value": 1
        }
      }
    ]
  },
  "Difficulty": {
    "type": "int",
    "value": 1
  },
  "DifficultyIndex": {
    "type": "int",
    "value": 2
  },
  "Faction": {
    "type": "dword",
    "value": 1
  },
  "LocalizedName": {
    "type": "cexolocstring",
    "value": {
      "id": 14460
    }
  },
  "MaxCreatures": {
    "type": "int",
    "value": 4
  },
  "OnEntered": {
    "type": "resref",
    "value": ""
  },
  "OnExhausted": {
    "type": "resref",
    "value": ""
  },
  "OnExit": {
    "type": "resref",
    "value": ""
  },
  "OnHeartbeat": {
    "type": "resref",
    "value": ""
  },
  "OnUserDefined": {
    "type": "resref",
    "value": ""
  },
  "PaletteID": {
    "type": "byte",
    "value": 7
  },
  "PlayerOnly": {
    "type": "byte",
    "value": 1
  },
  "RecCreatures": {
    "type": "int",
    "value": 2
  },
  "Reset": {
    "type": "byte",
    "value": 0
  },
  "ResetTime": {
    "type": "int",
    "value": 60
  },
  "Respawns": {
    "type": "int",
    "value": 0
  },
  "SpawnOption": {
    "type": "int",
    "value": 1
  },
  "Tag": {
    "type": "cexostring",
    "value": "NW_Aberration"
  },
  "TemplateResRef": {
    "type": "resref",
    "value": "nw_aberration"
  }
}
