{
  "__data_type": "UTC ",
  "Appearance_Type": {
    "type": "word",
    "value": 55
  },
  "BodyBag": {
    "type": "byte",
    "value": 0
  },
  "Cha": {
    "type": "byte",
    "value": 16
  },
  "ChallengeRating": {
    "type": "float",
    "value": 6.0
  },
  "ClassList": {
    "type": "list",
    "value": [
      {
        "__struct_id": 2,
        "Class": {
          "type": "int",
          "value": 8
        },
        "ClassLevel": {
          "type": "short",
          "value": 7
        }
      }
    ]
  },
  "Comment": {
    "type": "cexostring",
    "value": ""
  },
  "Con": {
    "type": "byte",
    "value": 11
  },
  "Conversation": {
    "type": "resref",
    "value": "nw_g_fam"
  },
  "CRAdjust": {
    "type": "int",
    "value": 0
  },
  "CurrentHitPoints": {
    "type": "short",
    "value": 24
  },
  "Deity": {
    "type": "cexostring",
    "value": ""
  },
  "Description": {
    "type": "cexolocstring",
    "value": {
      "id": 12545
    }
  },
  "Dex": {
    "type": "byte",
    "value": 18
  },
  "Disarmable": {
    "type": "byte",
    "value": 1
  },
  "Equip_ItemList": {
    "type": "list",
    "value": [
      {
        "__struct_id": 16,
        "EquippedRes": {
          "type": "resref",
          "value": "nw_wswmdg008"
        }
      },
      {
        "__struct_id": 131072,
        "EquippedRes": {
          "type": "resref",
          "value": "nw_it_creitem092"
        }
      }
    ]
  },
  "FactionID": {
    "type": "word",
    "value": 2
  },
  "FeatList": {
    "type": "list",
    "value": [
      {
        "__struct_id": 1,
        "Feat": {
          "type": "word",
          "value": 10
        }
      },
      {
        "__struct_id": 1,
        "Feat": {
          "type": "word",
          "value": 174
        }
      },
      {
        "__struct_id": 1,
        "Feat": {
          "type": "word",
          "value": 182
        }
      },
      {
        "__struct_id": 1,
        "Feat": {
          "type": "word",
          "value": 221
        }
      },
      {
        "__struct_id": 1,
        "Feat": {
          "type": "word",
          "value": 42
        }
      },
      {
        "__struct_id": 1,
        "Feat": {
          "type": "word",
          "value": 289
        }
      },
      {
        "__struct_id": 1,
        "Feat": {
          "type": "word",
          "value": 46
        }
      }
    ]
  },
  "FirstName": {
    "type": "cexolocstring",
    "value": {
      "id": 12546
    }
  },
  "fortbonus": {
    "type": "short",
    "value": 0
  },
  "Gender": {
    "type": "byte",
    "value": 1
  },
  "GoodEvil": {
    "type": "byte",
    "value": 100
  },
  "HitPoints": {
    "type": "short",
    "value": 24
  },
  "Int": {
    "type": "byte",
    "value": 16
  },
  "Interruptable": {
    "type": "byte",
    "value": 1
  },
  "IsPC": {
    "type": "byte",
    "value": 0
  },
  "LastName": {
    "type": "cexolocstring",
    "value": {}
  },
  "LawfulChaotic": {
    "type": "byte",
    "value": 50
  },
  "MaxHitPoints": {
    "type": "short",
    "value": 24
  },
  "NaturalAC": {
    "type": "byte",
    "value": 1
  },
  "NoPermDeath": {
    "type": "byte",
    "value": 0
  },
  "PaletteID": {
    "type": "byte",
    "value": 254
  },
  "PerceptionRange": {
    "type": "byte",
    "value": 11
  },
  "Phenotype": {
    "type": "int",
    "value": 0
  },
  "Plot": {
    "type": "byte",
    "value": 0
  },
  "PortraitId": {
    "type": "word",
    "value": 559
  },
  "Race": {
    "type": "byte",
    "value": 17
  },
  "refbonus": {
    "type": "short",
    "value": 0
  },
  "ScriptAttacked": {
    "type": "resref",
    "value": "nw_ch_ac5"
  },
  "ScriptDamaged": {
    "type": "resref",
    "value": "nw_ch_ac5"
  },
  "ScriptDeath": {
    "type": "resref",
    "value": "nw_ch_ac7"
  },
  "ScriptDialogue": {
    "type": "resref",
    "value": "nw_ch_ac4"
  },
  "ScriptDisturbed": {
    "type": "resref",
    "value": "nw_ch_ac8"
  },
  "ScriptEndRound": {
    "type": "resref",
    "value": "nw_ch_ac3"
  },
  "ScriptHeartbeat": {
    "type": "resref",
    "value": "nw_ch_ac1"
  },
  "ScriptOnBlocked": {
    "type": "resref",
    "value": "nw_ch_ace"
  },
  "ScriptOnNotice": {
    "type": "resref",
    "value": "nw_ch_ac2"
  },
  "ScriptRested": {
    "type": "resref",
    "value": "nw_ch_aca"
  },
  "ScriptSpawn": {
    "type": "resref",
    "value": "nw_ch_ac9"
  },
  "ScriptSpellAt": {
    "type": "resref",
    "value": "nw_ch_acb"
  },
  "ScriptUserDefine": {
    "type": "resref",
    "value": "nw_ch_acd"
  },
  "SkillList": {
    "type": "list",
    "value": [
      {
        "__struct_id": 0,
        "Rank": {
          "type": "byte",
          "value": 0
        }
      },
      {
        "__struct_id": 0,
        "Rank": {
          "type": "byte",
          "value": 0
        }
      },
      {
        "__struct_id": 0,
        "Rank": {
          "type": "byte",
          "value": 10
        }
      },
      {
        "__struct_id": 0,
        "Rank": {
          "type": "byte",
          "value": 0
        }
      },
      {
        "__struct_id": 0,
        "Rank": {
          "type": "byte",
          "value": 0
        }
      },
      {
        "__struct_id": 0,
        "Rank": {
          "type": "byte",
          "value": 10
        }
      },
      {
        "__struct_id": 0,
        "Rank": {
          "type": "byte",
          "value": 10
        }
      },
      {
        "__struct_id": 0,
        "Rank": {
          "type": "byte",
          "value": 0
        }
      },
      {
        "__struct_id": 0,
        "Rank": {
          "type": "byte",
          "value": 10
        }
      },
      {
        "__struct_id": 0,
        "Rank": {
          "type": "byte",
          "value": 10
        }
      },
      {
        "__struct_id": 0,
        "Rank": {
          "type": "byte",
          "value": 0
        }
      },
      {
        "__struct_id": 0,
        "Rank": {
          "type": "byte",
          "value": 0
        }
      },
      {
        "__struct_id": 0,
        "Rank": {
          "type": "byte",
          "value": 0
        }
      },
      {
        "__struct_id": 0,
        "Rank": {
          "type": "byte",
          "value": 0
        }
      },
      {
        "__struct_id": 0,
        "Rank": {
          "type": "byte",
          "value": 10
        }
      },
      {
        "__struct_id": 0,
        "Rank": {
          "type": "byte",
          "value": 0
        }
      },
      {
        "__struct_id": 0,
        "Rank": {
          "type": "byte",
          "value": 0
        }
      },
      {
        "__struct_id": 0,
        "Rank": {
          "type": "byte",
          "value": 10
        }
      },
      {
        "__struct_id": 0,
        "Rank": {
          "type": "byte",
          "value": 0
        }
      },
      {
        "__struct_id": 0,
        "Rank": {
          "type": "byte",
          "value": 0
        }
      }
    ]
  },
  "SoundSetFile": {
    "type": "word",
    "value": 37
  },
  "SpecAbilityList": {
    "type": "list",
    "value": [
      {
        "__struct_id": 4,
        "Spell": {
          "type": "word",
          "value": 88
        },
        "SpellCasterLevel": {
          "type": "byte",
          "value": 7
        },
        "SpellFlags": {
          "type": "byte",
          "value": 1
        }
      }
    ]
  },
  "Str": {
    "type": "byte",
    "value": 7
  },
  "Subrace": {
    "type": "cexostring",
    "value": ""
  },
  "Tag": {
    "type": "cexostring",
    "value": "NW_FM_PIXI07"
  },
  "Tail": {
    "type": "byte",
    "value": 0
  },
  "TemplateList": {
    "type": "list",
    "value": []
  },
  "TemplateResRef": {
    "type": "resref",
    "value": "nw_fm_pixi07"
  },
  "WalkRate": {
    "type": "int",
    "value": 7
  },
  "willbonus": {
    "type": "short",
    "value": 0
  },
  "Wings": {
    "type": "byte",
    "value": 0
  },
  "Wis": {
    "type": "byte",
    "value": 15
  }
}
