{
  "__data_type": "UTC ",
  "Appearance_Type": {
    "type": "word",
    "value": 153
  },
  "BodyBag": {
    "type": "byte",
    "value": 0
  },
  "Cha": {
    "type": "byte",
    "value": 14
  },
  "ChallengeRating": {
    "type": "float",
    "value": 10.0
  },
  "ClassList": {
    "type": "list",
    "value": [
      {
        "__struct_id": 2,
        "Class": {
          "type": "int",
          "value": 24
        },
        "ClassLevel": {
          "type": "short",
          "value": 10
        }
      }
    ]
  },
  "Comment": {
    "type": "cexostring",
    "value": ""
  },
  "Con": {
    "type": "byte",
    "value": 17
  },
  "Conversation": {
    "type": "resref",
    "value": ""
  },
  "CRAdjust": {
    "type": "int",
    "value": 0
  },
  "CurrentHitPoints": {
    "type": "short",
    "value": 45
  },
  "Deity": {
    "type": "cexostring",
    "value": ""
  },
  "Description": {
    "type": "cexolocstring",
    "value": {
      "id": 12709
    }
  },
  "Dex": {
    "type": "byte",
    "value": 13
  },
  "Disarmable": {
    "type": "byte",
    "value": 0
  },
  "Equip_ItemList": {
    "type": "list",
    "value": [
      {
        "__struct_id": 16384,
        "EquippedRes": {
          "type": "resref",
          "value": "nw_it_crewpsp006"
        }
      },
      {
        "__struct_id": 32768,
        "EquippedRes": {
          "type": "resref",
          "value": "nw_it_crewpsp006"
        }
      },
      {
        "__struct_id": 65536,
        "EquippedRes": {
          "type": "resref",
          "value": "nw_it_crewps017"
        }
      },
      {
        "__struct_id": 131072,
        "EquippedRes": {
          "type": "resref",
          "value": "nw_it_creitem041"
        }
      }
    ]
  },
  "FactionID": {
    "type": "word",
    "value": 1
  },
  "FeatList": {
    "type": "list",
    "value": [
      {
        "__struct_id": 1,
        "Feat": {
          "type": "word",
          "value": 228
        }
      },
      {
        "__struct_id": 1,
        "Feat": {
          "type": "word",
          "value": 289
        }
      }
    ]
  },
  "FirstName": {
    "type": "cexolocstring",
    "value": {
      "id": 12710
    }
  },
  "fortbonus": {
    "type": "short",
    "value": 0
  },
  "Gender": {
    "type": "byte",
    "value": 3
  },
  "GoodEvil": {
    "type": "byte",
    "value": 50
  },
  "HitPoints": {
    "type": "short",
    "value": 45
  },
  "Int": {
    "type": "byte",
    "value": 14
  },
  "Interruptable": {
    "type": "byte",
    "value": 1
  },
  "IsPC": {
    "type": "byte",
    "value": 0
  },
  "ItemList": {
    "type": "list",
    "value": [
      {
        "__struct_id": 0,
        "Dropable": {
          "type": "byte",
          "value": 1
        },
        "InventoryRes": {
          "type": "resref",
          "value": "nw_it_msmlmisc10"
        },
        "Repos_PosX": {
          "type": "word",
          "value": 0
        },
        "Repos_Posy": {
          "type": "word",
          "value": 0
        }
      }
    ]
  },
  "LastName": {
    "type": "cexolocstring",
    "value": {}
  },
  "LawfulChaotic": {
    "type": "byte",
    "value": 0
  },
  "MaxHitPoints": {
    "type": "short",
    "value": 75
  },
  "NaturalAC": {
    "type": "byte",
    "value": 11
  },
  "NoPermDeath": {
    "type": "byte",
    "value": 0
  },
  "PaletteID": {
    "type": "byte",
    "value": 26
  },
  "PerceptionRange": {
    "type": "byte",
    "value": 11
  },
  "Phenotype": {
    "type": "int",
    "value": 0
  },
  "Plot": {
    "type": "byte",
    "value": 0
  },
  "PortraitId": {
    "type": "word",
    "value": 296
  },
  "Race": {
    "type": "byte",
    "value": 20
  },
  "refbonus": {
    "type": "short",
    "value": 0
  },
  "ScriptAttacked": {
    "type": "resref",
    "value": "nw_c2_default5"
  },
  "ScriptDamaged": {
    "type": "resref",
    "value": "nw_c2_default6"
  },
  "ScriptDeath": {
    "type": "resref",
    "value": "nw_c2_default7"
  },
  "ScriptDialogue": {
    "type": "resref",
    "value": "nw_c2_default4"
  },
  "ScriptDisturbed": {
    "type": "resref",
    "value": "nw_c2_default8"
  },
  "ScriptEndRound": {
    "type": "resref",
    "value": "nw_c2_default3"
  },
  "ScriptHeartbeat": {
    "type": "resref",
    "value": "nw_c2_default1"
  },
  "ScriptOnBlocked": {
    "type": "resref",
    "value": "nw_c2_defaulte"
  },
  "ScriptOnNotice": {
    "type": "resref",
    "value": "nw_c2_default2"
  },
  "ScriptRested": {
    "type": "resref",
    "value": "nw_c2_defaulta"
  },
  "ScriptSpawn": {
    "type": "resref",
    "value": "nw_c2_default9"
  },
  "ScriptSpellAt": {
    "type": "resref",
    "value": "nw_c2_defaultb"
  },
  "ScriptUserDefine": {
    "type": "resref",
    "value": "nw_c2_defaultd"
  },
  "SkillList": {
    "type": "list",
    "value": [
      {
        "__struct_id": 0,
        "Rank": {
          "type": "byte",
          "value": 0
        }
      },
      {
        "__struct_id": 0,
        "Rank": {
          "type": "byte",
          "value": 0
        }
      },
      {
        "__struct_id": 0,
        "Rank": {
          "type": "byte",
          "value": 0
        }
      },
      {
        "__struct_id": 0,
        "Rank": {
          "type": "byte",
          "value": 0
        }
      },
      {
        "__struct_id": 0,
        "Rank": {
          "type": "byte",
          "value": 0
        }
      },
      {
        "__struct_id": 0,
        "Rank": {
          "type": "byte",
          "value": 14
        }
      },
      {
        "__struct_id": 0,
        "Rank": {
          "type": "byte",
          "value": 15
        }
      },
      {
        "__struct_id": 0,
        "Rank": {
          "type": "byte",
          "value": 0
        }
      },
      {
        "__struct_id": 0,
        "Rank": {
          "type": "byte",
          "value": 14
        }
      },
      {
        "__struct_id": 0,
        "Rank": {
          "type": "byte",
          "value": 0
        }
      },
      {
        "__struct_id": 0,
        "Rank": {
          "type": "byte",
          "value": 0
        }
      },
      {
        "__struct_id": 0,
        "Rank": {
          "type": "byte",
          "value": 0
        }
      },
      {
        "__struct_id": 0,
        "Rank": {
          "type": "byte",
          "value": 0
        }
      },
      {
        "__struct_id": 0,
        "Rank": {
          "type": "byte",
          "value": 0
        }
      },
      {
        "__struct_id": 0,
        "Rank": {
          "type": "byte",
          "value": 15
        }
      },
      {
        "__struct_id": 0,
        "Rank": {
          "type": "byte",
          "value": 0
        }
      },
      {
        "__struct_id": 0,
        "Rank": {
          "type": "byte",
          "value": 0
        }
      },
      {
        "__struct_id": 0,
        "Rank": {
          "type": "byte",
          "value": 15
        }
      },
      {
        "__struct_id": 0,
        "Rank": {
          "type": "byte",
          "value": 0
        }
      },
      {
        "__struct_id": 0,
        "Rank": {
          "type": "byte",
          "value": 0
        }
      }
    ]
  },
  "SoundSetFile": {
    "type": "word",
    "value": 83
  },
  "SpecAbilityList": {
    "type": "list",
    "value": [
      {
        "__struct_id": 4,
        "Spell": {
          "type": "word",
          "value": 36
        },
        "SpellCasterLevel": {
          "type": "byte",
          "value": 15
        },
        "SpellFlags": {
          "type": "byte",
          "value": 1
        }
      },
      {
        "__struct_id": 4,
        "Spell": {
          "type": "word",
          "value": 36
        },
        "SpellCasterLevel": {
          "type": "byte",
          "value": 15
        },
        "SpellFlags": {
          "type": "byte",
          "value": 1
        }
      },
      {
        "__struct_id": 4,
        "Spell": {
          "type": "word",
          "value": 36
        },
        "SpellCasterLevel": {
          "type": "byte",
          "value": 15
        },
        "SpellFlags": {
          "type": "byte",
          "value": 1
        }
      },
      {
        "__struct_id": 4,
        "Spell": {
          "type": "word",
          "value": 41
        },
        "SpellCasterLevel": {
          "type": "byte",
          "value": 15
        },
        "SpellFlags": {
          "type": "byte",
          "value": 1
        }
      },
      {
        "__struct_id": 4,
        "Spell": {
          "type": "word",
          "value": 41
        },
        "SpellCasterLevel": {
          "type": "byte",
          "value": 15
        },
        "SpellFlags": {
          "type": "byte",
          "value": 1
        }
      },
      {
        "__struct_id": 4,
        "Spell": {
          "type": "word",
          "value": 41
        },
        "SpellCasterLevel": {
          "type": "byte",
          "value": 15
        },
        "SpellFlags": {
          "type": "byte",
          "value": 1
        }
      },
      {
        "__struct_id": 4,
        "Spell": {
          "type": "word",
          "value": 76
        },
        "SpellCasterLevel": {
          "type": "byte",
          "value": 15
        },
        "SpellFlags": {
          "type": "byte",
          "value": 1
        }
      },
      {
        "__struct_id": 4,
        "Spell": {
          "type": "word",
          "value": 76
        },
        "SpellCasterLevel": {
          "type": "byte",
          "value": 15
        },
        "SpellFlags": {
          "type": "byte",
          "value": 1
        }
      },
      {
        "__struct_id": 4,
        "Spell": {
          "type": "word",
          "value": 76
        },
        "SpellCasterLevel": {
          "type": "byte",
          "value": 15
        },
        "SpellFlags": {
          "type": "byte",
          "value": 1
        }
      },
      {
        "__struct_id": 4,
        "Spell": {
          "type": "word",
          "value": 90
        },
        "SpellCasterLevel": {
          "type": "byte",
          "value": 15
        },
        "SpellFlags": {
          "type": "byte",
          "value": 1
        }
      },
      {
        "__struct_id": 4,
        "Spell": {
          "type": "word",
          "value": 90
        },
        "SpellCasterLevel": {
          "type": "byte",
          "value": 15
        },
        "SpellFlags": {
          "type": "byte",
          "value": 1
        }
      },
      {
        "__struct_id": 4,
        "Spell": {
          "type": "word",
          "value": 90
        },
        "SpellCasterLevel": {
          "type": "byte",
          "value": 15
        },
        "SpellFlags": {
          "type": "byte",
          "value": 1
        }
      },
      {
        "__struct_id": 4,
        "Spell": {
          "type": "word",
          "value": 101
        },
        "SpellCasterLevel": {
          "type": "byte",
          "value": 15
        },
        "SpellFlags": {
          "type": "byte",
          "value": 1
        }
      },
      {
        "__struct_id": 4,
        "Spell": {
          "type": "word",
          "value": 101
        },
        "SpellCasterLevel": {
          "type": "byte",
          "value": 15
        },
        "SpellFlags": {
          "type": "byte",
          "value": 1
        }
      },
      {
        "__struct_id": 4,
        "Spell": {
          "type": "word",
          "value": 101
        },
        "SpellCasterLevel": {
          "type": "byte",
          "value": 15
        },
        "SpellFlags": {
          "type": "byte",
          "value": 1
        }
      },
      {
        "__struct_id": 4,
        "Spell": {
          "type": "word",
          "value": 322
        },
        "SpellCasterLevel": {
          "type": "byte",
          "value": 15
        },
        "SpellFlags": {
          "type": "byte",
          "value": 1
        }
      },
      {
        "__struct_id": 4,
        "Spell": {
          "type": "word",
          "value": 322
        },
        "SpellCasterLevel": {
          "type": "byte",
          "value": 15
        },
        "SpellFlags": {
          "type": "byte",
          "value": 1
        }
      },
      {
        "__struct_id": 4,
        "Spell": {
          "type": "word",
          "value": 322
        },
        "SpellCasterLevel": {
          "type": "byte",
          "value": 15
        },
        "SpellFlags": {
          "type": "byte",
          "value": 1
        }
      },
      {
        "__struct_id": 4,
        "Spell": {
          "type": "word",
          "value": 157
        },
        "SpellCasterLevel": {
          "type": "byte",
          "value": 15
        },
        "SpellFlags": {
          "type": "byte",
          "value": 1
        }
      },
      {
        "__struct_id": 4,
        "Spell": {
          "type": "word",
          "value": 157
        },
        "SpellCasterLevel": {
          "type": "byte",
          "value": 15
        },
        "SpellFlags": {
          "type": "byte",
          "value": 1
        }
      },
      {
        "__struct_id": 4,
        "Spell": {
          "type": "word",
          "value": 157
        },
        "SpellCasterLevel": {
          "type": "byte",
          "value": 15
        },
        "SpellFlags": {
          "type": "byte",
          "value": 1
        }
      },
      {
        "__struct_id": 4,
        "Spell": {
          "type": "word",
          "value": 303
        },
        "SpellCasterLevel": {
          "type": "byte",
          "value": 1
        },
        "SpellFlags": {
          "type": "byte",
          "value": 1
        }
      }
    ]
  },
  "Str": {
    "type": "byte",
    "value": 19
  },
  "Subrace": {
    "type": "cexostring",
    "value": ""
  },
  "Tag": {
    "type": "cexostring",
    "value": "NW_SLAADGRAY"
  },
  "Tail": {
    "type": "byte",
    "value": 0
  },
  "TemplateList": {
    "type": "list",
    "value": []
  },
  "TemplateResRef": {
    "type": "resref",
    "value": "nw_slaadgray"
  },
  "WalkRate": {
    "type": "int",
    "value": 7
  },
  "willbonus": {
    "type": "short",
    "value": 0
  },
  "Wings": {
    "type": "byte",
    "value": 0
  },
  "Wis": {
    "type": "byte",
    "value": 14
  }
}
