{
  "__data_type": "UTM ",
  "BlackMarket": {
    "type": "byte",
    "value": 0
  },
  "BM_MarkDown": {
    "type": "int",
    "value": 25
  },
  "Comment": {
    "type": "cexostring",
    "value": "Chapter 2"
  },
  "ID": {
    "type": "byte",
    "value": 5
  },
  "LocName": {
    "type": "cexolocstring",
    "value": {
      "id": 14813
    }
  },
  "MarkDown": {
    "type": "int",
    "value": 35
  },
  "MarkUp": {
    "type": "int",
    "value": 150
  },
  "OnOpenStore": {
    "type": "resref",
    "value": "nw_d1_startstore"
  },
  "ResRef": {
    "type": "resref",
    "value": "nw_storgenral002"
  },
  "StoreList": {
    "type": "list",
    "value": [
      {
        "__struct_id": 0,
        "ItemList": {
          "type": "list",
          "value": [
            {
              "__struct_id": 0,
              "Infinite": {
                "type": "byte",
                "value": 1
              },
              "InventoryRes": {
                "type": "resref",
                "value": "nw_aarcl009"
              },
              "Repos_PosX": {
                "type": "word",
                "value": 0
              },
              "Repos_Posy": {
                "type": "word",
                "value": 0
              }
            },
            {
              "__struct_id": 1,
              "Infinite": {
                "type": "byte",
                "value": 1
              },
              "InventoryRes": {
                "type": "resref",
                "value": "nw_aarcl001"
              },
              "Repos_PosX": {
                "type": "word",
                "value": 2
              },
              "Repos_Posy": {
                "type": "word",
                "value": 0
              }
            },
            {
              "__struct_id": 2,
              "Infinite": {
                "type": "byte",
                "value": 1
              },
              "InventoryRes": {
                "type": "resref",
                "value": "nw_aarcl002"
              },
              "Repos_PosX": {
                "type": "word",
                "value": 4
              },
              "Repos_Posy": {
                "type": "word",
                "value": 0
              }
            },
            {
              "__struct_id": 3,
              "Infinite": {
                "type": "byte",
                "value": 1
              },
              "InventoryRes": {
                "type": "resref",
                "value": "nw_aarcl008"
              },
              "Repos_PosX": {
                "type": "word",
                "value": 6
              },
              "Repos_Posy": {
                "type": "word",
                "value": 0
              }
            },
            {
              "__struct_id": 4,
              "Infinite": {
                "type": "byte",
                "value": 1
              },
              "InventoryRes": {
                "type": "resref",
                "value": "nw_aarcl003"
              },
              "Repos_PosX": {
                "type": "word",
                "value": 8
              },
              "Repos_Posy": {
                "type": "word",
                "value": 0
              }
            },
            {
              "__struct_id": 5,
              "Infinite": {
                "type": "byte",
                "value": 1
              },
              "InventoryRes": {
                "type": "resref",
                "value": "nw_aarcl005"
              },
              "Repos_PosX": {
                "type": "word",
                "value": 0
              },
              "Repos_Posy": {
                "type": "word",
                "value": 3
              }
            },
            {
              "__struct_id": 6,
              "Infinite": {
                "type": "byte",
                "value": 1
              },
              "InventoryRes": {
                "type": "resref",
                "value": "nw_aarcl011"
              },
              "Repos_PosX": {
                "type": "word",
                "value": 2
              },
              "Repos_Posy": {
                "type": "word",
                "value": 3
              }
            },
            {
              "__struct_id": 7,
              "Infinite": {
                "type": "byte",
                "value": 1
              },
              "InventoryRes": {
                "type": "resref",
                "value": "nw_aarcl006"
              },
              "Repos_PosX": {
                "type": "word",
                "value": 4
              },
              "Repos_Posy": {
                "type": "word",
                "value": 3
              }
            },
            {
              "__struct_id": 8,
              "Infinite": {
                "type": "byte",
                "value": 1
              },
              "InventoryRes": {
                "type": "resref",
                "value": "nw_ashsw001"
              },
              "Repos_PosX": {
                "type": "word",
                "value": 6
              },
              "Repos_Posy": {
                "type": "word",
                "value": 3
              }
            },
            {
              "__struct_id": 9,
              "InventoryRes": {
                "type": "resref",
                "value": "nw_it_mboots006"
              },
              "Repos_PosX": {
                "type": "word",
                "value": 8
              },
              "Repos_Posy": {
                "type": "word",
                "value": 3
              }
            },
            {
              "__struct_id": 10,
              "InventoryRes": {
                "type": "resref",
                "value": "nw_it_mbracer007"
              },
              "Repos_PosX": {
                "type": "word",
                "value": 6
              },
              "Repos_Posy": {
                "type": "word",
                "value": 5
              }
            },
            {
              "__struct_id": 11,
              "InventoryRes": {
                "type": "resref",
                "value": "nw_it_mbracer003"
              },
              "Repos_PosX": {
                "type": "word",
                "value": 8
              },
              "Repos_Posy": {
                "type": "word",
                "value": 5
              }
            },
            {
              "__struct_id": 12,
              "InventoryRes": {
                "type": "resref",
                "value": "nw_maarcl088"
              },
              "Repos_PosX": {
                "type": "word",
                "value": 0
              },
              "Repos_Posy": {
                "type": "word",
                "value": 6
              }
            },
            {
              "__struct_id": 13,
              "InventoryRes": {
                "type": "resref",
                "value": "nw_maarcl092"
              },
              "Repos_PosX": {
                "type": "word",
                "value": 2
              },
              "Repos_Posy": {
                "type": "word",
                "value": 6
              }
            },
            {
              "__struct_id": 14,
              "Infinite": {
                "type": "byte",
                "value": 1
              },
              "InventoryRes": {
                "type": "resref",
                "value": "nw_ashlw001"
              },
              "Repos_PosX": {
                "type": "word",
                "value": 4
              },
              "Repos_Posy": {
                "type": "word",
                "value": 6
              }
            },
            {
              "__struct_id": 15,
              "Infinite": {
                "type": "byte",
                "value": 1
              },
              "InventoryRes": {
                "type": "resref",
                "value": "nw_ashto001"
              },
              "Repos_PosX": {
                "type": "word",
                "value": 6
              },
              "Repos_Posy": {
                "type": "word",
                "value": 6
              }
            },
            {
              "__struct_id": 16,
              "Infinite": {
                "type": "byte",
                "value": 1
              },
              "InventoryRes": {
                "type": "resref",
                "value": "nw_arhe004"
              },
              "Repos_PosX": {
                "type": "word",
                "value": 8
              },
              "Repos_Posy": {
                "type": "word",
                "value": 6
              }
            },
            {
              "__struct_id": 17,
              "Infinite": {
                "type": "byte",
                "value": 1
              },
              "InventoryRes": {
                "type": "resref",
                "value": "nw_arhe001"
              },
              "Repos_PosX": {
                "type": "word",
                "value": 8
              },
              "Repos_Posy": {
                "type": "word",
                "value": 8
              }
            },
            {
              "__struct_id": 18,
              "Infinite": {
                "type": "byte",
                "value": 1
              },
              "InventoryRes": {
                "type": "resref",
                "value": "nw_arhe002"
              },
              "Repos_PosX": {
                "type": "word",
                "value": 0
              },
              "Repos_Posy": {
                "type": "word",
                "value": 10
              }
            },
            {
              "__struct_id": 19,
              "Infinite": {
                "type": "byte",
                "value": 1
              },
              "InventoryRes": {
                "type": "resref",
                "value": "nw_arhe005"
              },
              "Repos_PosX": {
                "type": "word",
                "value": 2
              },
              "Repos_Posy": {
                "type": "word",
                "value": 10
              }
            },
            {
              "__struct_id": 20,
              "Infinite": {
                "type": "byte",
                "value": 1
              },
              "InventoryRes": {
                "type": "resref",
                "value": "nw_arhe003"
              },
              "Repos_PosX": {
                "type": "word",
                "value": 4
              },
              "Repos_Posy": {
                "type": "word",
                "value": 10
              }
            }
          ]
        }
      },
      {
        "__struct_id": 4,
        "ItemList": {
          "type": "list",
          "value": [
            {
              "__struct_id": 0,
              "Infinite": {
                "type": "byte",
                "value": 1
              },
              "InventoryRes": {
                "type": "resref",
                "value": "nw_waxhn001"
              },
              "Repos_PosX": {
                "type": "word",
                "value": 0
              },
              "Repos_Posy": {
                "type": "word",
                "value": 0
              }
            },
            {
              "__struct_id": 1,
              "Infinite": {
                "type": "byte",
                "value": 1
              },
              "InventoryRes": {
                "type": "resref",
                "value": "nw_waxbt001"
              },
              "Repos_PosX": {
                "type": "word",
                "value": 1
              },
              "Repos_Posy": {
                "type": "word",
                "value": 0
              }
            },
            {
              "__struct_id": 2,
              "Infinite": {
                "type": "byte",
                "value": 1
              },
              "InventoryRes": {
                "type": "resref",
                "value": "nw_waxgr001"
              },
              "Repos_PosX": {
                "type": "word",
                "value": 3
              },
              "Repos_Posy": {
                "type": "word",
                "value": 0
              }
            },
            {
              "__struct_id": 3,
              "Infinite": {
                "type": "byte",
                "value": 1
              },
              "InventoryRes": {
                "type": "resref",
                "value": "nw_wswbs001"
              },
              "Repos_PosX": {
                "type": "word",
                "value": 5
              },
              "Repos_Posy": {
                "type": "word",
                "value": 0
              }
            },
            {
              "__struct_id": 4,
              "Infinite": {
                "type": "byte",
                "value": 1
              },
              "InventoryRes": {
                "type": "resref",
                "value": "nw_wswdg001"
              },
              "Repos_PosX": {
                "type": "word",
                "value": 7
              },
              "Repos_Posy": {
                "type": "word",
                "value": 0
              }
            },
            {
              "__struct_id": 5,
              "Infinite": {
                "type": "byte",
                "value": 1
              },
              "InventoryRes": {
                "type": "resref",
                "value": "nw_wswgs001"
              },
              "Repos_PosX": {
                "type": "word",
                "value": 8
              },
              "Repos_Posy": {
                "type": "word",
                "value": 0
              }
            },
            {
              "__struct_id": 6,
              "Infinite": {
                "type": "byte",
                "value": 1
              },
              "InventoryRes": {
                "type": "resref",
                "value": "nw_wswls001"
              },
              "Repos_PosX": {
                "type": "word",
                "value": 7
              },
              "Repos_Posy": {
                "type": "word",
                "value": 1
              }
            },
            {
              "__struct_id": 7,
              "Infinite": {
                "type": "byte",
                "value": 1
              },
              "InventoryRes": {
                "type": "resref",
                "value": "nw_wswka001"
              },
              "Repos_PosX": {
                "type": "word",
                "value": 0
              },
              "Repos_Posy": {
                "type": "word",
                "value": 3
              }
            },
            {
              "__struct_id": 8,
              "Infinite": {
                "type": "byte",
                "value": 1
              },
              "InventoryRes": {
                "type": "resref",
                "value": "nw_wswrp001"
              },
              "Repos_PosX": {
                "type": "word",
                "value": 2
              },
              "Repos_Posy": {
                "type": "word",
                "value": 3
              }
            },
            {
              "__struct_id": 9,
              "Infinite": {
                "type": "byte",
                "value": 1
              },
              "InventoryRes": {
                "type": "resref",
                "value": "nw_wswsc001"
              },
              "Repos_PosX": {
                "type": "word",
                "value": 3
              },
              "Repos_Posy": {
                "type": "word",
                "value": 4
              }
            },
            {
              "__struct_id": 10,
              "Infinite": {
                "type": "byte",
                "value": 1
              },
              "InventoryRes": {
                "type": "resref",
                "value": "nw_wswss001"
              },
              "Repos_PosX": {
                "type": "word",
                "value": 4
              },
              "Repos_Posy": {
                "type": "word",
                "value": 4
              }
            },
            {
              "__struct_id": 11,
              "Infinite": {
                "type": "byte",
                "value": 1
              },
              "InventoryRes": {
                "type": "resref",
                "value": "nw_wblcl001"
              },
              "Repos_PosX": {
                "type": "word",
                "value": 5
              },
              "Repos_Posy": {
                "type": "word",
                "value": 4
              }
            },
            {
              "__struct_id": 12,
              "Infinite": {
                "type": "byte",
                "value": 1
              },
              "InventoryRes": {
                "type": "resref",
                "value": "nw_wblfh001"
              },
              "Repos_PosX": {
                "type": "word",
                "value": 6
              },
              "Repos_Posy": {
                "type": "word",
                "value": 5
              }
            },
            {
              "__struct_id": 13,
              "Infinite": {
                "type": "byte",
                "value": 1
              },
              "InventoryRes": {
                "type": "resref",
                "value": "nw_wblfl001"
              },
              "Repos_PosX": {
                "type": "word",
                "value": 8
              },
              "Repos_Posy": {
                "type": "word",
                "value": 5
              }
            },
            {
              "__struct_id": 14,
              "Infinite": {
                "type": "byte",
                "value": 1
              },
              "InventoryRes": {
                "type": "resref",
                "value": "nw_wblhl001"
              },
              "Repos_PosX": {
                "type": "word",
                "value": 9
              },
              "Repos_Posy": {
                "type": "word",
                "value": 5
              }
            },
            {
              "__struct_id": 15,
              "Infinite": {
                "type": "byte",
                "value": 1
              },
              "InventoryRes": {
                "type": "resref",
                "value": "nw_wblhw001"
              },
              "Repos_PosX": {
                "type": "word",
                "value": 0
              },
              "Repos_Posy": {
                "type": "word",
                "value": 6
              }
            },
            {
              "__struct_id": 16,
              "Infinite": {
                "type": "byte",
                "value": 1
              },
              "InventoryRes": {
                "type": "resref",
                "value": "nw_wblml001"
              },
              "Repos_PosX": {
                "type": "word",
                "value": 2
              },
              "Repos_Posy": {
                "type": "word",
                "value": 6
              }
            },
            {
              "__struct_id": 17,
              "Infinite": {
                "type": "byte",
                "value": 1
              },
              "InventoryRes": {
                "type": "resref",
                "value": "nw_wblms001"
              },
              "Repos_PosX": {
                "type": "word",
                "value": 4
              },
              "Repos_Posy": {
                "type": "word",
                "value": 6
              }
            },
            {
              "__struct_id": 18,
              "Infinite": {
                "type": "byte",
                "value": 1
              },
              "InventoryRes": {
                "type": "resref",
                "value": "nw_wdbma001"
              },
              "Repos_PosX": {
                "type": "word",
                "value": 0
              },
              "Repos_Posy": {
                "type": "word",
                "value": 10
              }
            },
            {
              "__struct_id": 19,
              "Infinite": {
                "type": "byte",
                "value": 1
              },
              "InventoryRes": {
                "type": "resref",
                "value": "nw_wdbax001"
              },
              "Repos_PosX": {
                "type": "word",
                "value": 2
              },
              "Repos_Posy": {
                "type": "word",
                "value": 10
              }
            },
            {
              "__struct_id": 20,
              "Infinite": {
                "type": "byte",
                "value": 1
              },
              "InventoryRes": {
                "type": "resref",
                "value": "nw_wdbqs001"
              },
              "Repos_PosX": {
                "type": "word",
                "value": 4
              },
              "Repos_Posy": {
                "type": "word",
                "value": 10
              }
            },
            {
              "__struct_id": 21,
              "Infinite": {
                "type": "byte",
                "value": 1
              },
              "InventoryRes": {
                "type": "resref",
                "value": "nw_wdbsw001"
              },
              "Repos_PosX": {
                "type": "word",
                "value": 5
              },
              "Repos_Posy": {
                "type": "word",
                "value": 10
              }
            },
            {
              "__struct_id": 22,
              "Infinite": {
                "type": "byte",
                "value": 1
              },
              "InventoryRes": {
                "type": "resref",
                "value": "nw_wspka001"
              },
              "Repos_PosX": {
                "type": "word",
                "value": 2
              },
              "Repos_Posy": {
                "type": "word",
                "value": 8
              }
            },
            {
              "__struct_id": 23,
              "Infinite": {
                "type": "byte",
                "value": 1
              },
              "InventoryRes": {
                "type": "resref",
                "value": "nw_wspku001"
              },
              "Repos_PosX": {
                "type": "word",
                "value": 5
              },
              "Repos_Posy": {
                "type": "word",
                "value": 7
              }
            },
            {
              "__struct_id": 24,
              "Infinite": {
                "type": "byte",
                "value": 1
              },
              "InventoryRes": {
                "type": "resref",
                "value": "nw_wspsc001"
              },
              "Repos_PosX": {
                "type": "word",
                "value": 8
              },
              "Repos_Posy": {
                "type": "word",
                "value": 8
              }
            },
            {
              "__struct_id": 25,
              "Infinite": {
                "type": "byte",
                "value": 1
              },
              "InventoryRes": {
                "type": "resref",
                "value": "nw_wplhb001"
              },
              "Repos_PosX": {
                "type": "word",
                "value": 7
              },
              "Repos_Posy": {
                "type": "word",
                "value": 10
              }
            },
            {
              "__struct_id": 26,
              "Infinite": {
                "type": "byte",
                "value": 1
              },
              "InventoryRes": {
                "type": "resref",
                "value": "nw_wplsc001"
              },
              "Repos_PosX": {
                "type": "word",
                "value": 0
              },
              "Repos_Posy": {
                "type": "word",
                "value": 14
              }
            },
            {
              "__struct_id": 27,
              "Infinite": {
                "type": "byte",
                "value": 1
              },
              "InventoryRes": {
                "type": "resref",
                "value": "nw_wplss001"
              },
              "Repos_PosX": {
                "type": "word",
                "value": 9
              },
              "Repos_Posy": {
                "type": "word",
                "value": 10
              }
            },
            {
              "__struct_id": 28,
              "Infinite": {
                "type": "byte",
                "value": 1
              },
              "InventoryRes": {
                "type": "resref",
                "value": "nw_wbwxh001"
              },
              "Repos_PosX": {
                "type": "word",
                "value": 2
              },
              "Repos_Posy": {
                "type": "word",
                "value": 14
              }
            },
            {
              "__struct_id": 29,
              "Infinite": {
                "type": "byte",
                "value": 1
              },
              "InventoryRes": {
                "type": "resref",
                "value": "nw_wbwxl001"
              },
              "Repos_PosX": {
                "type": "word",
                "value": 4
              },
              "Repos_Posy": {
                "type": "word",
                "value": 15
              }
            },
            {
              "__struct_id": 30,
              "Infinite": {
                "type": "byte",
                "value": 1
              },
              "InventoryRes": {
                "type": "resref",
                "value": "nw_wbwln001"
              },
              "Repos_PosX": {
                "type": "word",
                "value": 6
              },
              "Repos_Posy": {
                "type": "word",
                "value": 15
              }
            },
            {
              "__struct_id": 31,
              "Infinite": {
                "type": "byte",
                "value": 1
              },
              "InventoryRes": {
                "type": "resref",
                "value": "nw_wbwsh001"
              },
              "Repos_PosX": {
                "type": "word",
                "value": 8
              },
              "Repos_Posy": {
                "type": "word",
                "value": 15
              }
            },
            {
              "__struct_id": 32,
              "Infinite": {
                "type": "byte",
                "value": 1
              },
              "InventoryRes": {
                "type": "resref",
                "value": "nw_wbwsl001"
              },
              "Repos_PosX": {
                "type": "word",
                "value": 0
              },
              "Repos_Posy": {
                "type": "word",
                "value": 18
              }
            },
            {
              "__struct_id": 33,
              "Infinite": {
                "type": "byte",
                "value": 1
              },
              "InventoryRes": {
                "type": "resref",
                "value": "nw_wamar001"
              },
              "Repos_PosX": {
                "type": "word",
                "value": 1
              },
              "Repos_Posy": {
                "type": "word",
                "value": 18
              }
            },
            {
              "__struct_id": 34,
              "Infinite": {
                "type": "byte",
                "value": 1
              },
              "InventoryRes": {
                "type": "resref",
                "value": "nw_wambo001"
              },
              "Repos_PosX": {
                "type": "word",
                "value": 2
              },
              "Repos_Posy": {
                "type": "word",
                "value": 18
              }
            },
            {
              "__struct_id": 35,
              "Infinite": {
                "type": "byte",
                "value": 1
              },
              "InventoryRes": {
                "type": "resref",
                "value": "nw_wambu001"
              },
              "Repos_PosX": {
                "type": "word",
                "value": 0
              },
              "Repos_Posy": {
                "type": "word",
                "value": 2
              }
            },
            {
              "__struct_id": 36,
              "Infinite": {
                "type": "byte",
                "value": 1
              },
              "InventoryRes": {
                "type": "resref",
                "value": "nw_wthdt001"
              },
              "Repos_PosX": {
                "type": "word",
                "value": 6
              },
              "Repos_Posy": {
                "type": "word",
                "value": 4
              }
            },
            {
              "__struct_id": 37,
              "Infinite": {
                "type": "byte",
                "value": 1
              },
              "InventoryRes": {
                "type": "resref",
                "value": "nw_wthsh001"
              },
              "Repos_PosX": {
                "type": "word",
                "value": 3
              },
              "Repos_Posy": {
                "type": "word",
                "value": 7
              }
            },
            {
              "__struct_id": 38,
              "Infinite": {
                "type": "byte",
                "value": 1
              },
              "InventoryRes": {
                "type": "resref",
                "value": "nw_wthax001"
              },
              "Repos_PosX": {
                "type": "word",
                "value": 3
              },
              "Repos_Posy": {
                "type": "word",
                "value": 18
              }
            }
          ]
        }
      },
      {
        "__struct_id": 2,
        "ItemList": {
          "type": "list",
          "value": [
            {
              "__struct_id": 0,
              "Infinite": {
                "type": "byte",
                "value": 1
              },
              "InventoryRes": {
                "type": "resref",
                "value": "nw_it_mpotion016"
              },
              "Repos_PosX": {
                "type": "word",
                "value": 0
              },
              "Repos_Posy": {
                "type": "word",
                "value": 0
              }
            },
            {
              "__struct_id": 1,
              "Infinite": {
                "type": "byte",
                "value": 1
              },
              "InventoryRes": {
                "type": "resref",
                "value": "nw_it_mpotion006"
              },
              "Repos_PosX": {
                "type": "word",
                "value": 1
              },
              "Repos_Posy": {
                "type": "word",
                "value": 0
              }
            },
            {
              "__struct_id": 2,
              "Infinite": {
                "type": "byte",
                "value": 1
              },
              "InventoryRes": {
                "type": "resref",
                "value": "nw_it_mpotion005"
              },
              "Repos_PosX": {
                "type": "word",
                "value": 2
              },
              "Repos_Posy": {
                "type": "word",
                "value": 0
              }
            },
            {
              "__struct_id": 3,
              "Infinite": {
                "type": "byte",
                "value": 1
              },
              "InventoryRes": {
                "type": "resref",
                "value": "nw_it_mpotion009"
              },
              "Repos_PosX": {
                "type": "word",
                "value": 3
              },
              "Repos_Posy": {
                "type": "word",
                "value": 0
              }
            },
            {
              "__struct_id": 4,
              "Infinite": {
                "type": "byte",
                "value": 1
              },
              "InventoryRes": {
                "type": "resref",
                "value": "nw_it_mpotion001"
              },
              "Repos_PosX": {
                "type": "word",
                "value": 4
              },
              "Repos_Posy": {
                "type": "word",
                "value": 0
              }
            },
            {
              "__struct_id": 5,
              "Infinite": {
                "type": "byte",
                "value": 1
              },
              "InventoryRes": {
                "type": "resref",
                "value": "nw_it_mpotion020"
              },
              "Repos_PosX": {
                "type": "word",
                "value": 5
              },
              "Repos_Posy": {
                "type": "word",
                "value": 0
              }
            },
            {
              "__struct_id": 6,
              "Infinite": {
                "type": "byte",
                "value": 1
              },
              "InventoryRes": {
                "type": "resref",
                "value": "nw_it_mpotion002"
              },
              "Repos_PosX": {
                "type": "word",
                "value": 6
              },
              "Repos_Posy": {
                "type": "word",
                "value": 0
              }
            },
            {
              "__struct_id": 7,
              "Infinite": {
                "type": "byte",
                "value": 1
              },
              "InventoryRes": {
                "type": "resref",
                "value": "nw_it_mpotion003"
              },
              "Repos_PosX": {
                "type": "word",
                "value": 7
              },
              "Repos_Posy": {
                "type": "word",
                "value": 0
              }
            },
            {
              "__struct_id": 8,
              "Infinite": {
                "type": "byte",
                "value": 1
              },
              "InventoryRes": {
                "type": "resref",
                "value": "nw_it_mpotion012"
              },
              "Repos_PosX": {
                "type": "word",
                "value": 8
              },
              "Repos_Posy": {
                "type": "word",
                "value": 0
              }
            }
          ]
        }
      },
      {
        "__struct_id": 3,
        "ItemList": {
          "type": "list",
          "value": [
            {
              "__struct_id": 0,
              "InventoryRes": {
                "type": "resref",
                "value": "nw_it_mring010"
              },
              "Repos_PosX": {
                "type": "word",
                "value": 0
              },
              "Repos_Posy": {
                "type": "word",
                "value": 0
              }
            },
            {
              "__struct_id": 1,
              "InventoryRes": {
                "type": "resref",
                "value": "nw_it_mring009"
              },
              "Repos_PosX": {
                "type": "word",
                "value": 1
              },
              "Repos_Posy": {
                "type": "word",
                "value": 0
              }
            },
            {
              "__struct_id": 2,
              "InventoryRes": {
                "type": "resref",
                "value": "nw_it_mring011"
              },
              "Repos_PosX": {
                "type": "word",
                "value": 2
              },
              "Repos_Posy": {
                "type": "word",
                "value": 0
              }
            },
            {
              "__struct_id": 3,
              "InventoryRes": {
                "type": "resref",
                "value": "nw_it_mring012"
              },
              "Repos_PosX": {
                "type": "word",
                "value": 3
              },
              "Repos_Posy": {
                "type": "word",
                "value": 0
              }
            },
            {
              "__struct_id": 4,
              "InventoryRes": {
                "type": "resref",
                "value": "nw_it_mring013"
              },
              "Repos_PosX": {
                "type": "word",
                "value": 4
              },
              "Repos_Posy": {
                "type": "word",
                "value": 0
              }
            },
            {
              "__struct_id": 5,
              "InventoryRes": {
                "type": "resref",
                "value": "nw_it_mneck012"
              },
              "Repos_PosX": {
                "type": "word",
                "value": 5
              },
              "Repos_Posy": {
                "type": "word",
                "value": 0
              }
            },
            {
              "__struct_id": 6,
              "InventoryRes": {
                "type": "resref",
                "value": "nw_it_mring008"
              },
              "Repos_PosX": {
                "type": "word",
                "value": 6
              },
              "Repos_Posy": {
                "type": "word",
                "value": 0
              }
            },
            {
              "__struct_id": 7,
              "InventoryRes": {
                "type": "resref",
                "value": "nw_it_mneck016"
              },
              "Repos_PosX": {
                "type": "word",
                "value": 7
              },
              "Repos_Posy": {
                "type": "word",
                "value": 0
              }
            },
            {
              "__struct_id": 8,
              "InventoryRes": {
                "type": "resref",
                "value": "nw_it_mring021"
              },
              "Repos_PosX": {
                "type": "word",
                "value": 8
              },
              "Repos_Posy": {
                "type": "word",
                "value": 0
              }
            },
            {
              "__struct_id": 9,
              "InventoryRes": {
                "type": "resref",
                "value": "nw_it_mring022"
              },
              "Repos_PosX": {
                "type": "word",
                "value": 9
              },
              "Repos_Posy": {
                "type": "word",
                "value": 0
              }
            },
            {
              "__struct_id": 10,
              "InventoryRes": {
                "type": "resref",
                "value": "nw_it_mring023"
              },
              "Repos_PosX": {
                "type": "word",
                "value": 0
              },
              "Repos_Posy": {
                "type": "word",
                "value": 1
              }
            },
            {
              "__struct_id": 11,
              "InventoryRes": {
                "type": "resref",
                "value": "nw_it_mneck020"
              },
              "Repos_PosX": {
                "type": "word",
                "value": 1
              },
              "Repos_Posy": {
                "type": "word",
                "value": 1
              }
            },
            {
              "__struct_id": 12,
              "InventoryRes": {
                "type": "resref",
                "value": "nw_it_mneck021"
              },
              "Repos_PosX": {
                "type": "word",
                "value": 2
              },
              "Repos_Posy": {
                "type": "word",
                "value": 1
              }
            },
            {
              "__struct_id": 13,
              "InventoryRes": {
                "type": "resref",
                "value": "nw_it_mneck022"
              },
              "Repos_PosX": {
                "type": "word",
                "value": 3
              },
              "Repos_Posy": {
                "type": "word",
                "value": 1
              }
            }
          ]
        }
      },
      {
        "__struct_id": 1,
        "ItemList": {
          "type": "list",
          "value": [
            {
              "__struct_id": 0,
              "InventoryRes": {
                "type": "resref",
                "value": "nw_it_torch001"
              },
              "Repos_PosX": {
                "type": "word",
                "value": 0
              },
              "Repos_Posy": {
                "type": "word",
                "value": 0
              }
            },
            {
              "__struct_id": 1,
              "Infinite": {
                "type": "byte",
                "value": 1
              },
              "InventoryRes": {
                "type": "resref",
                "value": "nw_it_medkit001"
              },
              "Repos_PosX": {
                "type": "word",
                "value": 1
              },
              "Repos_Posy": {
                "type": "word",
                "value": 0
              }
            },
            {
              "__struct_id": 2,
              "InventoryRes": {
                "type": "resref",
                "value": "nw_it_contain002"
              },
              "Repos_PosX": {
                "type": "word",
                "value": 3
              },
              "Repos_Posy": {
                "type": "word",
                "value": 0
              }
            },
            {
              "__struct_id": 3,
              "InventoryRes": {
                "type": "resref",
                "value": "nw_it_contain003"
              },
              "Repos_PosX": {
                "type": "word",
                "value": 5
              },
              "Repos_Posy": {
                "type": "word",
                "value": 0
              }
            },
            {
              "__struct_id": 4,
              "InventoryRes": {
                "type": "resref",
                "value": "nw_it_contain004"
              },
              "Repos_PosX": {
                "type": "word",
                "value": 7
              },
              "Repos_Posy": {
                "type": "word",
                "value": 0
              }
            },
            {
              "__struct_id": 5,
              "InventoryRes": {
                "type": "resref",
                "value": "nw_it_contain005"
              },
              "Repos_PosX": {
                "type": "word",
                "value": 1
              },
              "Repos_Posy": {
                "type": "word",
                "value": 1
              }
            },
            {
              "__struct_id": 6,
              "Infinite": {
                "type": "byte",
                "value": 1
              },
              "InventoryRes": {
                "type": "resref",
                "value": "nw_it_picks002"
              },
              "Repos_PosX": {
                "type": "word",
                "value": 9
              },
              "Repos_Posy": {
                "type": "word",
                "value": 0
              }
            },
            {
              "__struct_id": 7,
              "Infinite": {
                "type": "byte",
                "value": 1
              },
              "InventoryRes": {
                "type": "resref",
                "value": "nw_it_picks003"
              },
              "Repos_PosX": {
                "type": "word",
                "value": 3
              },
              "Repos_Posy": {
                "type": "word",
                "value": 2
              }
            }
          ]
        }
      }
    ]
  },
  "Tag": {
    "type": "cexostring",
    "value": "NW_STORGENRAL002"
  }
}
