{
  "__data_type": "UTC ",
  "Appearance_Head": {
    "type": "byte",
    "value": 9
  },
  "Appearance_Type": {
    "type": "word",
    "value": 1
  },
  "ArmorPart_RFoot": {
    "type": "byte",
    "value": 1
  },
  "BodyBag": {
    "type": "byte",
    "value": 0
  },
  "BodyPart_Belt": {
    "type": "byte",
    "value": 0
  },
  "BodyPart_LBicep": {
    "type": "byte",
    "value": 1
  },
  "BodyPart_LFArm": {
    "type": "byte",
    "value": 1
  },
  "BodyPart_LFoot": {
    "type": "byte",
    "value": 1
  },
  "BodyPart_LHand": {
    "type": "byte",
    "value": 1
  },
  "BodyPart_LShin": {
    "type": "byte",
    "value": 1
  },
  "BodyPart_LShoul": {
    "type": "byte",
    "value": 0
  },
  "BodyPart_LThigh": {
    "type": "byte",
    "value": 1
  },
  "BodyPart_Neck": {
    "type": "byte",
    "value": 1
  },
  "BodyPart_Pelvis": {
    "type": "byte",
    "value": 1
  },
  "BodyPart_RBicep": {
    "type": "byte",
    "value": 1
  },
  "BodyPart_RFArm": {
    "type": "byte",
    "value": 1
  },
  "BodyPart_RHand": {
    "type": "byte",
    "value": 1
  },
  "BodyPart_RShin": {
    "type": "byte",
    "value": 1
  },
  "BodyPart_RShoul": {
    "type": "byte",
    "value": 0
  },
  "BodyPart_RThigh": {
    "type": "byte",
    "value": 1
  },
  "BodyPart_Torso": {
    "type": "byte",
    "value": 1
  },
  "Cha": {
    "type": "byte",
    "value": 12
  },
  "ChallengeRating": {
    "type": "float",
    "value": 13.0
  },
  "ClassList": {
    "type": "list",
    "value": [
      {
        "__struct_id": 2,
        "Class": {
          "type": "int",
          "value": 2
        },
        "ClassLevel": {
          "type": "short",
          "value": 14
        },
        "MemorizedList0": {
          "type": "list",
          "value": [
            {
              "__struct_id": 3,
              "Spell": {
                "type": "word",
                "value": 33
              },
              "SpellFlags": {
                "type": "byte",
                "value": 1
              },
              "SpellMetaMagic": {
                "type": "byte",
                "value": 0
              }
            },
            {
              "__struct_id": 3,
              "Spell": {
                "type": "word",
                "value": 100
              },
              "SpellFlags": {
                "type": "byte",
                "value": 1
              },
              "SpellMetaMagic": {
                "type": "byte",
                "value": 0
              }
            },
            {
              "__struct_id": 3,
              "Spell": {
                "type": "word",
                "value": 100
              },
              "SpellFlags": {
                "type": "byte",
                "value": 1
              },
              "SpellMetaMagic": {
                "type": "byte",
                "value": 0
              }
            },
            {
              "__struct_id": 3,
              "Spell": {
                "type": "word",
                "value": 151
              },
              "SpellFlags": {
                "type": "byte",
                "value": 1
              },
              "SpellMetaMagic": {
                "type": "byte",
                "value": 0
              }
            },
            {
              "__struct_id": 3,
              "Spell": {
                "type": "word",
                "value": 189
              },
              "SpellFlags": {
                "type": "byte",
                "value": 1
              },
              "SpellMetaMagic": {
                "type": "byte",
                "value": 0
              }
            }
          ]
        },
        "MemorizedList1": {
          "type": "list",
          "value": [
            {
              "__struct_id": 3,
              "Spell": {
                "type": "word",
                "value": 6
              },
              "SpellFlags": {
                "type": "byte",
                "value": 1
              },
              "SpellMetaMagic": {
                "type": "byte",
                "value": 0
              }
            },
            {
              "__struct_id": 3,
              "Spell": {
                "type": "word",
                "value": 32
              },
              "SpellFlags": {
                "type": "byte",
                "value": 1
              },
              "SpellMetaMagic": {
                "type": "byte",
                "value": 0
              }
            },
            {
              "__struct_id": 3,
              "Spell": {
                "type": "word",
                "value": 32
              },
              "SpellFlags": {
                "type": "byte",
                "value": 1
              },
              "SpellMetaMagic": {
                "type": "byte",
                "value": 0
              }
            },
            {
              "__struct_id": 3,
              "Spell": {
                "type": "word",
                "value": 32
              },
              "SpellFlags": {
                "type": "byte",
                "value": 1
              },
              "SpellMetaMagic": {
                "type": "byte",
                "value": 0
              }
            },
            {
              "__struct_id": 3,
              "Spell": {
                "type": "word",
                "value": 32
              },
              "SpellFlags": {
                "type": "byte",
                "value": 1
              },
              "SpellMetaMagic": {
                "type": "byte",
                "value": 0
              }
            },
            {
              "__struct_id": 3,
              "Spell": {
                "type": "word",
                "value": 32
              },
              "SpellFlags": {
                "type": "byte",
                "value": 1
              },
              "SpellMetaMagic": {
                "type": "byte",
                "value": 0
              }
            },
            {
              "__struct_id": 3,
              "Spell": {
                "type": "word",
                "value": 148
              },
              "SpellFlags": {
                "type": "byte",
                "value": 1
              },
              "SpellMetaMagic": {
                "type": "byte",
                "value": 0
              }
            }
          ]
        },
        "MemorizedList2": {
          "type": "list",
          "value": [
            {
              "__struct_id": 3,
              "Spell": {
                "type": "word",
                "value": 9
              },
              "SpellFlags": {
                "type": "byte",
                "value": 1
              },
              "SpellMetaMagic": {
                "type": "byte",
                "value": 0
              }
            },
            {
              "__struct_id": 3,
              "Spell": {
                "type": "word",
                "value": 34
              },
              "SpellFlags": {
                "type": "byte",
                "value": 1
              },
              "SpellMetaMagic": {
                "type": "byte",
                "value": 0
              }
            },
            {
              "__struct_id": 3,
              "Spell": {
                "type": "word",
                "value": 49
              },
              "SpellFlags": {
                "type": "byte",
                "value": 1
              },
              "SpellMetaMagic": {
                "type": "byte",
                "value": 0
              }
            },
            {
              "__struct_id": 3,
              "Spell": {
                "type": "word",
                "value": 83
              },
              "SpellFlags": {
                "type": "byte",
                "value": 1
              },
              "SpellMetaMagic": {
                "type": "byte",
                "value": 0
              }
            },
            {
              "__struct_id": 3,
              "Spell": {
                "type": "word",
                "value": 83
              },
              "SpellFlags": {
                "type": "byte",
                "value": 1
              },
              "SpellMetaMagic": {
                "type": "byte",
                "value": 0
              }
            },
            {
              "__struct_id": 3,
              "Spell": {
                "type": "word",
                "value": 97
              },
              "SpellFlags": {
                "type": "byte",
                "value": 1
              },
              "SpellMetaMagic": {
                "type": "byte",
                "value": 0
              }
            }
          ]
        },
        "MemorizedList3": {
          "type": "list",
          "value": [
            {
              "__struct_id": 3,
              "Spell": {
                "type": "word",
                "value": 35
              },
              "SpellFlags": {
                "type": "byte",
                "value": 1
              },
              "SpellMetaMagic": {
                "type": "byte",
                "value": 0
              }
            },
            {
              "__struct_id": 3,
              "Spell": {
                "type": "word",
                "value": 35
              },
              "SpellFlags": {
                "type": "byte",
                "value": 1
              },
              "SpellMetaMagic": {
                "type": "byte",
                "value": 0
              }
            },
            {
              "__struct_id": 3,
              "Spell": {
                "type": "word",
                "value": 35
              },
              "SpellFlags": {
                "type": "byte",
                "value": 1
              },
              "SpellMetaMagic": {
                "type": "byte",
                "value": 0
              }
            },
            {
              "__struct_id": 3,
              "Spell": {
                "type": "word",
                "value": 41
              },
              "SpellFlags": {
                "type": "byte",
                "value": 1
              },
              "SpellMetaMagic": {
                "type": "byte",
                "value": 0
              }
            },
            {
              "__struct_id": 3,
              "Spell": {
                "type": "word",
                "value": 156
              },
              "SpellFlags": {
                "type": "byte",
                "value": 1
              },
              "SpellMetaMagic": {
                "type": "byte",
                "value": 0
              }
            }
          ]
        },
        "MemorizedList4": {
          "type": "list",
          "value": [
            {
              "__struct_id": 3,
              "Spell": {
                "type": "word",
                "value": 31
              },
              "SpellFlags": {
                "type": "byte",
                "value": 1
              },
              "SpellMetaMagic": {
                "type": "byte",
                "value": 0
              }
            },
            {
              "__struct_id": 3,
              "Spell": {
                "type": "word",
                "value": 42
              },
              "SpellFlags": {
                "type": "byte",
                "value": 1
              },
              "SpellMetaMagic": {
                "type": "byte",
                "value": 0
              }
            },
            {
              "__struct_id": 3,
              "Spell": {
                "type": "word",
                "value": 76
              },
              "SpellFlags": {
                "type": "byte",
                "value": 1
              },
              "SpellMetaMagic": {
                "type": "byte",
                "value": 0
              }
            },
            {
              "__struct_id": 3,
              "Spell": {
                "type": "word",
                "value": 126
              },
              "SpellFlags": {
                "type": "byte",
                "value": 1
              },
              "SpellMetaMagic": {
                "type": "byte",
                "value": 0
              }
            },
            {
              "__struct_id": 3,
              "Spell": {
                "type": "word",
                "value": 152
              },
              "SpellFlags": {
                "type": "byte",
                "value": 1
              },
              "SpellMetaMagic": {
                "type": "byte",
                "value": 0
              }
            }
          ]
        },
        "MemorizedList5": {
          "type": "list",
          "value": [
            {
              "__struct_id": 3,
              "Spell": {
                "type": "word",
                "value": 61
              },
              "SpellFlags": {
                "type": "byte",
                "value": 1
              },
              "SpellMetaMagic": {
                "type": "byte",
                "value": 0
              }
            },
            {
              "__struct_id": 3,
              "Spell": {
                "type": "word",
                "value": 61
              },
              "SpellFlags": {
                "type": "byte",
                "value": 1
              },
              "SpellMetaMagic": {
                "type": "byte",
                "value": 0
              }
            },
            {
              "__struct_id": 3,
              "Spell": {
                "type": "word",
                "value": 168
              },
              "SpellFlags": {
                "type": "byte",
                "value": 1
              },
              "SpellMetaMagic": {
                "type": "byte",
                "value": 0
              }
            },
            {
              "__struct_id": 3,
              "Spell": {
                "type": "word",
                "value": 186
              },
              "SpellFlags": {
                "type": "byte",
                "value": 1
              },
              "SpellMetaMagic": {
                "type": "byte",
                "value": 0
              }
            }
          ]
        },
        "MemorizedList6": {
          "type": "list",
          "value": [
            {
              "__struct_id": 3,
              "Spell": {
                "type": "word",
                "value": 77
              },
              "SpellFlags": {
                "type": "byte",
                "value": 1
              },
              "SpellMetaMagic": {
                "type": "byte",
                "value": 0
              }
            },
            {
              "__struct_id": 3,
              "Spell": {
                "type": "word",
                "value": 79
              },
              "SpellFlags": {
                "type": "byte",
                "value": 1
              },
              "SpellMetaMagic": {
                "type": "byte",
                "value": 0
              }
            },
            {
              "__struct_id": 3,
              "Spell": {
                "type": "word",
                "value": 79
              },
              "SpellFlags": {
                "type": "byte",
                "value": 1
              },
              "SpellMetaMagic": {
                "type": "byte",
                "value": 0
              }
            },
            {
              "__struct_id": 3,
              "Spell": {
                "type": "word",
                "value": 79
              },
              "SpellFlags": {
                "type": "byte",
                "value": 1
              },
              "SpellMetaMagic": {
                "type": "byte",
                "value": 0
              }
            }
          ]
        },
        "MemorizedList7": {
          "type": "list",
          "value": [
            {
              "__struct_id": 3,
              "Spell": {
                "type": "word",
                "value": 70
              },
              "SpellFlags": {
                "type": "byte",
                "value": 1
              },
              "SpellMetaMagic": {
                "type": "byte",
                "value": 0
              }
            },
            {
              "__struct_id": 3,
              "Spell": {
                "type": "word",
                "value": 194
              },
              "SpellFlags": {
                "type": "byte",
                "value": 1
              },
              "SpellMetaMagic": {
                "type": "byte",
                "value": 0
              }
            },
            {
              "__struct_id": 3,
              "Spell": {
                "type": "word",
                "value": 194
              },
              "SpellFlags": {
                "type": "byte",
                "value": 1
              },
              "SpellMetaMagic": {
                "type": "byte",
                "value": 0
              }
            }
          ]
        }
      }
    ]
  },
  "Color_Hair": {
    "type": "byte",
    "value": 3
  },
  "Color_Skin": {
    "type": "byte",
    "value": 1
  },
  "Color_Tattoo1": {
    "type": "byte",
    "value": 1
  },
  "Color_Tattoo2": {
    "type": "byte",
    "value": 1
  },
  "Comment": {
    "type": "cexostring",
    "value": "Linu Level 14"
  },
  "Con": {
    "type": "byte",
    "value": 14
  },
  "Conversation": {
    "type": "resref",
    "value": "nw_hen_lin"
  },
  "CRAdjust": {
    "type": "int",
    "value": 0
  },
  "CurrentHitPoints": {
    "type": "short",
    "value": 98
  },
  "Deity": {
    "type": "cexostring",
    "value": ""
  },
  "Description": {
    "type": "cexolocstring",
    "value": {
      "id": 57651
    }
  },
  "Dex": {
    "type": "byte",
    "value": 10
  },
  "Disarmable": {
    "type": "byte",
    "value": 0
  },
  "Equip_ItemList": {
    "type": "list",
    "value": [
      {
        "__struct_id": 2,
        "EquippedRes": {
          "type": "resref",
          "value": "nw_maarcl064"
        }
      },
      {
        "__struct_id": 4,
        "EquippedRes": {
          "type": "resref",
          "value": "nw_it_mboots009"
        }
      },
      {
        "__struct_id": 16,
        "EquippedRes": {
          "type": "resref",
          "value": "nw_wblmml012"
        }
      },
      {
        "__struct_id": 32,
        "EquippedRes": {
          "type": "resref",
          "value": "nw_ashmlw008"
        }
      },
      {
        "__struct_id": 64,
        "EquippedRes": {
          "type": "resref",
          "value": "nw_maarcl091"
        }
      },
      {
        "__struct_id": 512,
        "EquippedRes": {
          "type": "resref",
          "value": "nw_it_mneck009"
        }
      },
      {
        "__struct_id": 131072,
        "EquippedRes": {
          "type": "resref",
          "value": "nw_hen_hide"
        }
      }
    ]
  },
  "FactionID": {
    "type": "word",
    "value": 3
  },
  "FeatList": {
    "type": "list",
    "value": [
      {
        "__struct_id": 1,
        "Feat": {
          "type": "word",
          "value": 0
        }
      },
      {
        "__struct_id": 1,
        "Feat": {
          "type": "word",
          "value": 2
        }
      },
      {
        "__struct_id": 1,
        "Feat": {
          "type": "word",
          "value": 3
        }
      },
      {
        "__struct_id": 1,
        "Feat": {
          "type": "word",
          "value": 4
        }
      },
      {
        "__struct_id": 1,
        "Feat": {
          "type": "word",
          "value": 6
        }
      },
      {
        "__struct_id": 1,
        "Feat": {
          "type": "word",
          "value": 14
        }
      },
      {
        "__struct_id": 1,
        "Feat": {
          "type": "word",
          "value": 236
        }
      },
      {
        "__struct_id": 1,
        "Feat": {
          "type": "word",
          "value": 318
        }
      },
      {
        "__struct_id": 1,
        "Feat": {
          "type": "word",
          "value": 235
        }
      },
      {
        "__struct_id": 1,
        "Feat": {
          "type": "word",
          "value": 22
        }
      },
      {
        "__struct_id": 1,
        "Feat": {
          "type": "word",
          "value": 240
        }
      },
      {
        "__struct_id": 1,
        "Feat": {
          "type": "word",
          "value": 28
        }
      },
      {
        "__struct_id": 1,
        "Feat": {
          "type": "word",
          "value": 32
        }
      },
      {
        "__struct_id": 1,
        "Feat": {
          "type": "word",
          "value": 237
        }
      },
      {
        "__struct_id": 1,
        "Feat": {
          "type": "word",
          "value": 238
        }
      },
      {
        "__struct_id": 1,
        "Feat": {
          "type": "word",
          "value": 239
        }
      },
      {
        "__struct_id": 1,
        "Feat": {
          "type": "word",
          "value": 36
        }
      },
      {
        "__struct_id": 1,
        "Feat": {
          "type": "word",
          "value": 294
        }
      },
      {
        "__struct_id": 1,
        "Feat": {
          "type": "word",
          "value": 256
        }
      },
      {
        "__struct_id": 1,
        "Feat": {
          "type": "word",
          "value": 46
        }
      }
    ]
  },
  "FirstName": {
    "type": "cexolocstring",
    "value": {
      "id": 12611
    }
  },
  "fortbonus": {
    "type": "short",
    "value": 0
  },
  "Gender": {
    "type": "byte",
    "value": 1
  },
  "GoodEvil": {
    "type": "byte",
    "value": 100
  },
  "HitPoints": {
    "type": "short",
    "value": 98
  },
  "Int": {
    "type": "byte",
    "value": 10
  },
  "Interruptable": {
    "type": "byte",
    "value": 1
  },
  "IsPC": {
    "type": "byte",
    "value": 0
  },
  "ItemList": {
    "type": "list",
    "value": [
      {
        "__struct_id": 0,
        "InventoryRes": {
          "type": "resref",
          "value": "nw_hen_linxl4"
        },
        "Repos_PosX": {
          "type": "word",
          "value": 0
        },
        "Repos_Posy": {
          "type": "word",
          "value": 0
        }
      },
      {
        "__struct_id": 1,
        "InventoryRes": {
          "type": "resref",
          "value": "nw_it_mpotion003"
        },
        "Repos_PosX": {
          "type": "word",
          "value": 2
        },
        "Repos_Posy": {
          "type": "word",
          "value": 0
        }
      },
      {
        "__struct_id": 2,
        "InventoryRes": {
          "type": "resref",
          "value": "nw_it_mpotion003"
        },
        "Repos_PosX": {
          "type": "word",
          "value": 3
        },
        "Repos_Posy": {
          "type": "word",
          "value": 0
        }
      },
      {
        "__struct_id": 3,
        "InventoryRes": {
          "type": "resref",
          "value": "nw_it_mpotion003"
        },
        "Repos_PosX": {
          "type": "word",
          "value": 4
        },
        "Repos_Posy": {
          "type": "word",
          "value": 0
        }
      },
      {
        "__struct_id": 4,
        "InventoryRes": {
          "type": "resref",
          "value": "nw_it_mpotion003"
        },
        "Repos_PosX": {
          "type": "word",
          "value": 5
        },
        "Repos_Posy": {
          "type": "word",
          "value": 0
        }
      },
      {
        "__struct_id": 5,
        "InventoryRes": {
          "type": "resref",
          "value": "nw_it_mpotion003"
        },
        "Repos_PosX": {
          "type": "word",
          "value": 6
        },
        "Repos_Posy": {
          "type": "word",
          "value": 0
        }
      }
    ]
  },
  "LastName": {
    "type": "cexolocstring",
    "value": {
      "id": 12612
    }
  },
  "LawfulChaotic": {
    "type": "byte",
    "value": 50
  },
  "MaxHitPoints": {
    "type": "short",
    "value": 112
  },
  "NaturalAC": {
    "type": "byte",
    "value": 0
  },
  "NoPermDeath": {
    "type": "byte",
    "value": 1
  },
  "PaletteID": {
    "type": "byte",
    "value": 45
  },
  "PerceptionRange": {
    "type": "byte",
    "value": 11
  },
  "Phenotype": {
    "type": "int",
    "value": 0
  },
  "Plot": {
    "type": "byte",
    "value": 0
  },
  "PortraitId": {
    "type": "word",
    "value": 30
  },
  "Race": {
    "type": "byte",
    "value": 1
  },
  "refbonus": {
    "type": "short",
    "value": 0
  },
  "ScriptAttacked": {
    "type": "resref",
    "value": "nw_ch_ac5"
  },
  "ScriptDamaged": {
    "type": "resref",
    "value": "nw_ch_ac6"
  },
  "ScriptDeath": {
    "type": "resref",
    "value": "nw_ch_ac7"
  },
  "ScriptDialogue": {
    "type": "resref",
    "value": "nw_ch_ac4"
  },
  "ScriptDisturbed": {
    "type": "resref",
    "value": "nw_ch_ac8"
  },
  "ScriptEndRound": {
    "type": "resref",
    "value": "nw_ch_ac3"
  },
  "ScriptHeartbeat": {
    "type": "resref",
    "value": "nw_ch_ac1"
  },
  "ScriptOnBlocked": {
    "type": "resref",
    "value": "nw_ch_ace"
  },
  "ScriptOnNotice": {
    "type": "resref",
    "value": "nw_ch_ac2"
  },
  "ScriptRested": {
    "type": "resref",
    "value": "nw_ch_aca"
  },
  "ScriptSpawn": {
    "type": "resref",
    "value": "nw_ch_ac9"
  },
  "ScriptSpellAt": {
    "type": "resref",
    "value": "nw_ch_acb"
  },
  "ScriptUserDefine": {
    "type": "resref",
    "value": "nw_ch_acd"
  },
  "SkillList": {
    "type": "list",
    "value": [
      {
        "__struct_id": 0,
        "Rank": {
          "type": "byte",
          "value": 0
        }
      },
      {
        "__struct_id": 0,
        "Rank": {
          "type": "byte",
          "value": 16
        }
      },
      {
        "__struct_id": 0,
        "Rank": {
          "type": "byte",
          "value": 0
        }
      },
      {
        "__struct_id": 0,
        "Rank": {
          "type": "byte",
          "value": 8
        }
      },
      {
        "__struct_id": 0,
        "Rank": {
          "type": "byte",
          "value": 0
        }
      },
      {
        "__struct_id": 0,
        "Rank": {
          "type": "byte",
          "value": 0
        }
      },
      {
        "__struct_id": 0,
        "Rank": {
          "type": "byte",
          "value": 1
        }
      },
      {
        "__struct_id": 0,
        "Rank": {
          "type": "byte",
          "value": 0
        }
      },
      {
        "__struct_id": 0,
        "Rank": {
          "type": "byte",
          "value": 0
        }
      },
      {
        "__struct_id": 0,
        "Rank": {
          "type": "byte",
          "value": 0
        }
      },
      {
        "__struct_id": 0,
        "Rank": {
          "type": "byte",
          "value": 0
        }
      },
      {
        "__struct_id": 0,
        "Rank": {
          "type": "byte",
          "value": 0
        }
      },
      {
        "__struct_id": 0,
        "Rank": {
          "type": "byte",
          "value": 0
        }
      },
      {
        "__struct_id": 0,
        "Rank": {
          "type": "byte",
          "value": 0
        }
      },
      {
        "__struct_id": 0,
        "Rank": {
          "type": "byte",
          "value": 0
        }
      },
      {
        "__struct_id": 0,
        "Rank": {
          "type": "byte",
          "value": 0
        }
      },
      {
        "__struct_id": 0,
        "Rank": {
          "type": "byte",
          "value": 0
        }
      },
      {
        "__struct_id": 0,
        "Rank": {
          "type": "byte",
          "value": 1
        }
      },
      {
        "__struct_id": 0,
        "Rank": {
          "type": "byte",
          "value": 0
        }
      },
      {
        "__struct_id": 0,
        "Rank": {
          "type": "byte",
          "value": 0
        }
      }
    ]
  },
  "SoundSetFile": {
    "type": "word",
    "value": 210
  },
  "SpecAbilityList": {
    "type": "list",
    "value": []
  },
  "Str": {
    "type": "byte",
    "value": 16
  },
  "Subrace": {
    "type": "cexostring",
    "value": ""
  },
  "Tag": {
    "type": "cexostring",
    "value": "NW_HEN_LIN"
  },
  "Tail": {
    "type": "byte",
    "value": 0
  },
  "TemplateList": {
    "type": "list",
    "value": []
  },
  "TemplateResRef": {
    "type": "resref",
    "value": "nw_hen_lin_11"
  },
  "WalkRate": {
    "type": "int",
    "value": 4
  },
  "willbonus": {
    "type": "short",
    "value": 0
  },
  "Wings": {
    "type": "byte",
    "value": 0
  },
  "Wis": {
    "type": "byte",
    "value": 18
  }
}
