{
  "__data_type": "UTI ",
  "AddCost": {
    "type": "dword",
    "value": 0
  },
  "BaseItem": {
    "type": "int",
    "value": 9
  },
  "Charges": {
    "type": "byte",
    "value": 0
  },
  "Comment": {
    "type": "cexostring",
    "value": "1"
  },
  "Cost": {
    "type": "dword",
    "value": 7228
  },
  "DescIdentified": {
    "type": "cexolocstring",
    "value": {
      "id": 14019
    }
  },
  "Description": {
    "type": "cexolocstring",
    "value": {}
  },
  "Identified": {
    "type": "byte",
    "value": 0
  },
  "LocalizedName": {
    "type": "cexolocstring",
    "value": {
      "id": 14020
    }
  },
  "ModelPart1": {
    "type": "byte",
    "value": 11
  },
  "ModelPart2": {
    "type": "byte",
    "value": 11
  },
  "ModelPart3": {
    "type": "byte",
    "value": 11
  },
  "PaletteID": {
    "type": "byte",
    "value": 42
  },
  "Plot": {
    "type": "byte",
    "value": 0
  },
  "PropertiesList": {
    "type": "list",
    "value": [
      {
        "__struct_id": 0,
        "ChanceAppear": {
          "type": "byte",
          "value": 100
        },
        "CostTable": {
          "type": "byte",
          "value": 2
        },
        "CostValue": {
          "type": "word",
          "value": 1
        },
        "Param1": {
          "type": "byte",
          "value": 255
        },
        "Param1Value": {
          "type": "byte",
          "value": 255
        },
        "PropertyName": {
          "type": "word",
          "value": 6
        },
        "Subtype": {
          "type": "word",
          "value": 0
        }
      },
      {
        "__struct_id": 0,
        "ChanceAppear": {
          "type": "byte",
          "value": 100
        },
        "CostTable": {
          "type": "byte",
          "value": 0
        },
        "CostValue": {
          "type": "word",
          "value": 0
        },
        "Param1": {
          "type": "byte",
          "value": 1
        },
        "Param1Value": {
          "type": "byte",
          "value": 3
        },
        "PropertyName": {
          "type": "word",
          "value": 48
        },
        "Subtype": {
          "type": "word",
          "value": 1
        }
      }
    ]
  },
  "StackSize": {
    "type": "word",
    "value": 1
  },
  "Stolen": {
    "type": "byte",
    "value": 0
  },
  "Tag": {
    "type": "cexostring",
    "value": "NW_WBLMML006"
  },
  "TemplateResRef": {
    "type": "resref",
    "value": "nw_wblmml006"
  }
}
