{
  "__data_type": "UTI ",
  "AddCost": {
    "type": "dword",
    "value": 0
  },
  "BaseItem": {
    "type": "int",
    "value": 73
  },
  "Charges": {
    "type": "byte",
    "value": 0
  },
  "Comment": {
    "type": "cexostring",
    "value": "This item is used for Expansion Pack 3 (1.69) to store PC properties used by horse scripts.\r\n\r\n- Deva Winblood   12/30/2007"
  },
  "Cost": {
    "type": "dword",
    "value": 0
  },
  "Cursed": {
    "type": "byte",
    "value": 1
  },
  "DescIdentified": {
    "type": "cexolocstring",
    "value": {
      "0": "This item is used for Expansion Pack 3 (1.69) to store PC properties used by horse scripts."
    }
  },
  "Description": {
    "type": "cexolocstring",
    "value": {
      "0": ""
    }
  },
  "Identified": {
    "type": "byte",
    "value": 1
  },
  "LocalizedName": {
    "type": "cexolocstring",
    "value": {
      "0": "PC Properties"
    }
  },
  "ModelPart1": {
    "type": "byte",
    "value": 1
  },
  "PaletteID": {
    "type": "byte",
    "value": 14
  },
  "Plot": {
    "type": "byte",
    "value": 1
  },
  "PropertiesList": {
    "type": "list",
    "value": []
  },
  "StackSize": {
    "type": "word",
    "value": 1
  },
  "Stolen": {
    "type": "byte",
    "value": 0
  },
  "Tag": {
    "type": "cexostring",
    "value": "x3_it_pchide"
  },
  "TemplateResRef": {
    "type": "resref",
    "value": "x3_it_pchide"
  }
}
