<svg width="494" height="581" viewBox="0 0 494 581" fill="none" xmlns="http://www.w3.org/2000/svg">
<g style="mix-blend-mode:overlay" opacity="0.5">
<rect width="494" height="581" rx="50" fill="url(#paint0_linear)" fill-opacity="0.5"/>
</g>
<defs>
<linearGradient id="paint0_linear" x1="247" y1="0" x2="247" y2="581" gradientUnits="userSpaceOnUse">
<stop stop-color="#FCDFA6"/>
<stop offset="1" stop-color="#FCDFA6" stop-opacity="0"/>
</linearGradient>
</defs>
</svg>
