<svg width="272" height="245" viewBox="0 0 272 245" fill="none" xmlns="http://www.w3.org/2000/svg">
<path d="M172.892 141.801L135.353 97.1871L59.9999 97.8751L14.2896 142.353L15.2132 142.946H14.8835V235.461H172.791V142.946L172.892 141.801Z" fill="#3F3D56"/>
<path d="M135.392 97.2821L88.4946 152.209V235.461H172.791V141.76L135.392 97.2821Z" fill="#4180E2"/>
<path d="M139.547 189.421H122.332V204.622H139.547V189.421Z" fill="white"/>
<path d="M139.547 163.11H122.332V178.07H139.547V163.11Z" fill="white"/>
<path d="M63.0405 185.388H45.825V200.589H63.0405V185.388Z" fill="white"/>
<path d="M63.0405 159.076H45.825V174.036H63.0405V159.076Z" fill="white"/>
<path d="M272 235.172H0V235.818H272V235.172Z" fill="#3F3D56"/>
<path d="M231.037 224.956L232.331 231.422L225.859 232.715L226.83 224.633L231.037 224.956Z" fill="#A0616A"/>
<path d="M251.424 223.663L249.806 231.745H242.04L245.276 222.046L251.424 223.663Z" fill="#A0616A"/>
<path d="M258.544 167.41L259.838 176.139L258.22 195.213L256.926 202.326L251.424 225.603C251.424 225.603 245.275 225.603 244.305 223.016L245.923 209.761C245.923 209.761 247.217 199.093 246.894 197.8C246.57 196.506 241.716 175.816 241.716 175.816C241.716 175.816 234.596 208.468 233.625 211.378C232.654 214.287 231.36 226.896 231.36 226.896C231.36 226.896 225.858 227.866 225.535 226.896C225.211 225.926 224.888 202.972 224.888 199.416C224.888 195.86 225.535 193.92 225.535 193.273C225.535 192.627 222.985 161.762 222.985 161.762L258.544 167.41Z" fill="#2F2E41"/>
<path d="M245.275 230.129C245.275 230.129 246.894 230.452 247.864 230.129C248.835 229.805 247.864 227.866 247.864 227.866H251.424C251.424 227.866 255.308 236.594 256.926 237.241C258.544 237.888 263.722 245 257.573 245C253.779 244.951 250.076 243.83 246.894 241.767C246.894 241.767 246.246 238.857 243.334 238.534C240.421 238.211 238.48 234.655 238.48 234.655L242.687 226.896C242.687 226.896 243.657 230.452 245.275 230.129Z" fill="#2F2E41"/>
<path d="M230.065 229.805C230.065 229.805 229.418 231.098 228.771 230.452C228.124 229.805 227.477 228.189 227.477 228.189C227.477 228.189 225.535 227.219 225.211 228.189C224.888 229.159 223.593 234.331 222.946 234.978C222.299 235.625 215.503 242.414 222.299 243.707C229.095 245 230.389 242.09 230.389 242.09C230.389 242.09 229.418 240.474 231.36 239.827C233.302 239.181 233.625 236.918 233.625 236.918L232.331 227.219C232.331 227.219 231.036 230.452 230.065 229.805Z" fill="#2F2E41"/>
<path d="M265.987 144.78L266.958 161.591C266.958 161.591 271.488 172.26 265.34 171.936C259.191 171.613 263.074 161.268 263.074 161.268L257.054 146.264L265.987 144.78Z" fill="#A0616A"/>
<path d="M216.15 139.93L215.179 156.742C215.179 156.742 210.648 167.41 216.797 167.087C222.946 166.764 219.063 156.418 219.063 156.418L225.083 141.415L216.15 139.93Z" fill="#A0616A"/>
<path d="M242.039 103.399C246.686 103.399 250.453 99.6352 250.453 94.993C250.453 90.3507 246.686 86.5874 242.039 86.5874C237.392 86.5874 233.625 90.3507 233.625 94.993C233.625 99.6352 237.392 103.399 242.039 103.399Z" fill="#A0616A"/>
<path d="M248.673 98.3875C248.673 98.3875 246.408 107.44 250.939 109.703C255.469 111.966 236.7 115.199 235.405 109.703L236.052 107.116C236.052 107.116 238.641 103.883 237.994 100.974L248.673 98.3875Z" fill="#A0616A"/>
<path d="M243.657 109.864C243.657 109.864 238.073 110.385 236.335 106.73C236.335 106.73 223.27 107.601 220.357 119.563L225.211 150.599C225.211 150.599 220.033 159.651 220.681 160.621C220.681 160.621 217.444 169.673 247.217 169.996L260.162 169.35C260.337 167.512 260.228 165.659 259.838 163.854C259.191 160.944 255.631 140.577 255.631 140.577C255.631 140.577 265.34 125.382 264.369 123.119C263.398 120.856 261.843 111.933 249.352 108.312C249.352 108.312 249.159 110.188 243.657 109.864Z" fill="#EF564C"/>
<path d="M260.162 117.623L264.369 123.119C264.369 123.119 268.576 146.073 267.281 146.396C265.987 146.72 258.22 149.306 256.926 148.336C255.631 147.366 249.806 128.292 249.806 128.292L260.162 117.623Z" fill="#CE544C"/>
<path d="M225.858 116.007L220.357 119.563C220.357 119.563 212.267 142.193 214.532 143.163C216.797 144.133 229.418 143.487 229.418 143.487L225.858 116.007Z" fill="#CE544C"/>
<path d="M251.236 87.4706C251.236 87.4706 248.322 81.1625 242.736 82.6182C237.15 84.0739 233.993 86.2575 233.75 88.4411C233.507 90.6247 233.872 93.9001 233.872 93.9001C233.872 93.9001 234.479 89.4116 238.365 90.3821C240.431 90.8983 243.116 90.934 245.178 90.8543C245.582 90.8377 245.985 90.9035 246.362 91.0478C246.74 91.1921 247.084 91.4117 247.374 91.6934C247.664 91.975 247.893 92.3127 248.048 92.6859C248.203 93.059 248.28 93.4598 248.275 93.8637L248.173 100.812C248.173 100.812 256.263 95.6395 251.236 87.4706Z" fill="#2F2E41"/>
<path d="M211.551 89.917H97.2548C96.6936 89.9163 96.1556 89.6933 95.7588 89.2969C95.362 88.9005 95.1388 88.3631 95.1381 87.8025V35.3739C95.1388 34.8134 95.362 34.2759 95.7588 33.8795C96.1556 33.4831 96.6936 33.2601 97.2548 33.2595H211.551C212.113 33.2601 212.651 33.4831 213.047 33.8795C213.444 34.2759 213.667 34.8134 213.668 35.3739V87.8025C213.667 88.3631 213.444 88.9005 213.047 89.2969C212.651 89.6933 212.113 89.9163 211.551 89.917ZM97.2548 34.1053C96.918 34.1056 96.5952 34.2394 96.3572 34.4773C96.1191 34.7151 95.9852 35.0376 95.9848 35.3739V87.8025C95.9852 88.1389 96.1191 88.4613 96.3572 88.6992C96.5952 88.937 96.918 89.0708 97.2548 89.0712H211.551C211.888 89.0708 212.211 88.937 212.449 88.6992C212.687 88.4613 212.821 88.1389 212.821 87.8025V35.3739C212.821 35.0376 212.687 34.7151 212.449 34.4773C212.211 34.2394 211.888 34.1056 211.551 34.1053H97.2548Z" fill="#E6E6E6"/>
<path d="M114.167 60.4454C118.929 60.4454 122.789 56.5891 122.789 51.8321C122.789 47.0752 118.929 43.2189 114.167 43.2189C109.406 43.2189 105.546 47.0752 105.546 51.8321C105.546 56.5891 109.406 60.4454 114.167 60.4454Z" fill="#4180E2"/>
<path d="M134.08 46.09C133.891 46.0897 133.704 46.1266 133.529 46.1986C133.355 46.2706 133.196 46.3763 133.063 46.5096C132.929 46.643 132.823 46.8013 132.75 46.9756C132.678 47.1499 132.641 47.3368 132.641 47.5255C132.641 47.7142 132.678 47.901 132.75 48.0753C132.823 48.2497 132.929 48.408 133.063 48.5413C133.196 48.6747 133.355 48.7804 133.529 48.8524C133.704 48.9244 133.891 48.9613 134.08 48.961H201.824C202.205 48.961 202.57 48.8098 202.84 48.5406C203.109 48.2714 203.261 47.9062 203.261 47.5255C203.261 47.1448 203.109 46.7796 202.84 46.5104C202.57 46.2412 202.205 46.09 201.824 46.09H134.08Z" fill="#E6E6E6"/>
<path d="M134.08 54.7032C133.891 54.7029 133.704 54.7398 133.529 54.8118C133.355 54.8839 133.196 54.9896 133.063 55.1229C132.929 55.2562 132.823 55.4146 132.75 55.5889C132.678 55.7632 132.641 55.95 132.641 56.1387C132.641 56.3274 132.678 56.5143 132.75 56.6886C132.823 56.8629 132.929 57.0212 133.063 57.1546C133.196 57.2879 133.355 57.3936 133.529 57.4656C133.704 57.5376 133.891 57.5745 134.08 57.5743H163.23C163.419 57.5745 163.606 57.5376 163.781 57.4656C163.955 57.3936 164.114 57.2879 164.248 57.1546C164.381 57.0212 164.488 56.8629 164.56 56.6886C164.632 56.5143 164.669 56.3274 164.669 56.1387C164.669 55.95 164.632 55.7632 164.56 55.5889C164.488 55.4146 164.381 55.2562 164.248 55.1229C164.114 54.9896 163.955 54.8839 163.781 54.8118C163.606 54.7398 163.419 54.7029 163.23 54.7032H134.08Z" fill="#E6E6E6"/>
<path d="M107.554 68.4733C106.461 68.4733 105.572 69.1173 105.572 69.9088C105.572 70.7003 106.461 71.3443 107.554 71.3443H201.02C202.113 71.3443 203.002 70.7003 203.002 69.9088C203.002 69.1173 202.113 68.4733 201.02 68.4733H107.554Z" fill="#E6E6E6"/>
<path d="M107.554 77.0865C106.461 77.0865 105.572 77.7306 105.572 78.522C105.572 79.3135 106.461 79.9576 107.554 79.9576H201.02C202.113 79.9576 203.002 79.3135 203.002 78.522C203.002 77.7306 202.113 77.0865 201.02 77.0865H107.554Z" fill="#E6E6E6"/>
<path d="M190.966 30.6364C199.435 30.6364 206.3 23.7782 206.3 15.3182C206.3 6.8582 199.435 0 190.966 0C182.498 0 175.633 6.8582 175.633 15.3182C175.633 23.7782 182.498 30.6364 190.966 30.6364Z" fill="#4180E2"/>
<path d="M190.966 40.22L186.172 31.924L181.377 23.6281H190.966H200.555L195.761 31.924L190.966 40.22Z" fill="#4180E2"/>
<path d="M191.09 20.7185C194.128 20.7185 196.591 18.2579 196.591 15.2226C196.591 12.1873 194.128 9.72665 191.09 9.72665C188.051 9.72665 185.588 12.1873 185.588 15.2226C185.588 18.2579 188.051 20.7185 191.09 20.7185Z" fill="white"/>
<path d="M248.82 96.6094C249.535 96.6094 250.114 95.8857 250.114 94.993C250.114 94.1002 249.535 93.3765 248.82 93.3765C248.105 93.3765 247.526 94.1002 247.526 94.993C247.526 95.8857 248.105 96.6094 248.82 96.6094Z" fill="#A0616A"/>
</svg>
