<svg width="196" height="47" viewBox="0 0 196 47" fill="none" xmlns="http://www.w3.org/2000/svg">
<path d="M32.1746 23.8111H41.2714V46H33.7727V43.4185C30.7814 45.6312 26.9296 46.7376 22.2172 46.7376C18.2425 46.7376 14.5956 45.8771 11.2765 44.156C7.95734 42.435 5.31434 39.9354 3.34746 36.6573C1.38058 33.3382 0.397137 29.4044 0.397137 24.856C0.397137 20.4715 1.40107 16.5787 3.40893 13.1777C5.45776 9.73561 8.28515 7.05164 11.8911 5.12573C15.4971 3.19983 19.5537 2.23688 24.0612 2.23688C27.831 2.23688 31.2526 2.87201 34.3259 4.14229C37.3991 5.41257 39.9806 7.25652 42.0704 9.67415L35.6781 15.5748C32.6048 12.3376 28.8964 10.7191 24.5529 10.7191C21.8075 10.7191 19.3694 11.3132 17.2386 12.5015C15.1078 13.6489 13.4482 15.288 12.2599 17.4187C11.0716 19.5495 10.4774 22.0081 10.4774 24.7946C10.4774 27.7039 11.0511 30.183 12.1984 32.2318C13.3868 34.2807 14.9644 35.8378 16.9312 36.9032C18.8981 37.9276 21.0494 38.4398 23.3851 38.4398C26.8681 38.4398 29.7979 37.4564 32.1746 35.4895V23.8111ZM62.1993 46.4917C58.7163 46.4917 55.5816 45.7746 52.7951 44.3404C50.0497 42.8653 47.8984 40.8369 46.3413 38.2554C44.7842 35.6739 44.0056 32.744 44.0056 29.4659C44.0056 26.1878 44.7842 23.2579 46.3413 20.6764C47.8984 18.0949 50.0497 16.087 52.7951 14.6528C55.5816 13.1777 58.7163 12.4401 62.1993 12.4401C65.6823 12.4401 68.7965 13.1777 71.542 14.6528C74.2874 16.087 76.4387 18.0949 77.9958 20.6764C79.5529 23.2579 80.3315 26.1878 80.3315 29.4659C80.3315 32.744 79.5529 35.6739 77.9958 38.2554C76.4387 40.8369 74.2874 42.8653 71.542 44.3404C68.7965 45.7746 65.6823 46.4917 62.1993 46.4917ZM62.1993 38.6242C64.6579 38.6242 66.6658 37.8047 68.2229 36.1656C69.821 34.4855 70.62 32.2523 70.62 29.4659C70.62 26.6795 69.821 24.4667 68.2229 22.8277C66.6658 21.1476 64.6579 20.3076 62.1993 20.3076C59.7407 20.3076 57.7123 21.1476 56.1143 22.8277C54.5162 24.4667 53.7171 26.6795 53.7171 29.4659C53.7171 32.2523 54.5162 34.4855 56.1143 36.1656C57.7123 37.8047 59.7407 38.6242 62.1993 38.6242ZM104.627 46.7376C100.242 46.7376 96.2677 45.7951 92.7028 43.9102C89.1788 41.9843 86.3924 39.3413 84.3435 35.9812C82.3357 32.5801 81.3317 28.7488 81.3317 24.4872C81.3317 20.2256 82.3357 16.4148 84.3435 13.0547C86.3924 9.65366 89.1788 7.01066 92.7028 5.12573C96.2677 3.19983 100.263 2.23688 104.688 2.23688C108.417 2.23688 111.777 2.8925 114.769 4.20376C117.801 5.51501 120.342 7.39994 122.39 9.85854L115.998 15.7592C113.089 12.3991 109.483 10.7191 105.18 10.7191C102.517 10.7191 100.14 11.3132 98.0502 12.5015C95.9604 13.6489 94.3214 15.2675 93.133 17.3573C91.9857 19.4471 91.412 21.8237 91.412 24.4872C91.412 27.1507 91.9857 29.5274 93.133 31.6172C94.3214 33.707 95.9604 35.3461 98.0502 36.5344C100.14 37.6817 102.517 38.2554 105.18 38.2554C109.483 38.2554 113.089 36.5549 115.998 33.1538L122.39 39.0544C120.342 41.554 117.801 43.4594 114.769 44.7707C111.736 46.082 108.356 46.7376 104.627 46.7376ZM140.574 38.8086C142.295 38.8086 143.812 38.5627 145.123 38.071C146.475 37.5383 147.725 36.7188 148.872 35.6124L153.974 41.1443C150.86 44.7092 146.311 46.4917 140.329 46.4917C136.6 46.4917 133.301 45.7746 130.433 44.3404C127.564 42.8653 125.352 40.8369 123.794 38.2554C122.237 35.6739 121.459 32.744 121.459 29.4659C121.459 26.2287 122.217 23.3194 123.733 20.7379C125.29 18.1153 127.4 16.087 130.064 14.6528C132.768 13.1777 135.801 12.4401 139.161 12.4401C142.316 12.4401 145.184 13.1162 147.766 14.4684C150.347 15.7797 152.396 17.7056 153.912 20.2461C155.469 22.7457 156.248 25.7165 156.248 29.1586L131.785 33.8914C132.482 35.5305 133.567 36.7598 135.043 37.5793C136.559 38.3988 138.403 38.8086 140.574 38.8086ZM139.161 19.693C136.743 19.693 134.776 20.4715 133.26 22.0286C131.744 23.5857 130.945 25.737 130.863 28.4825L146.967 25.3477C146.516 23.6267 145.594 22.254 144.201 21.2296C142.808 20.2052 141.128 19.693 139.161 19.693ZM173.511 33.0309L168.901 37.5793V46H159.313V0.392922H168.901V26.2082L182.915 12.9318H194.348L180.58 26.9458L195.577 46H183.96L173.511 33.0309Z" fill="url(#paint0_linear)"/>
<defs>
<linearGradient id="paint0_linear" x1="100.5" y1="-13" x2="100.5" y2="63.875" gradientUnits="userSpaceOnUse">
<stop stop-color="#DF5242"/>
<stop offset="1" stop-color="#FE5955"/>
</linearGradient>
</defs>
</svg>
