<svg width="331" height="51" viewBox="0 0 331 51" fill="none" xmlns="http://www.w3.org/2000/svg">
<path d="M202.131 50.9661V27.0513H195.843V18.4408H202.131V11.0864C202.131 5.3072 205.846 0 214.405 0C217.871 0 220.433 0.334082 220.433 0.334082L220.231 8.37479C220.231 8.37479 217.618 8.34921 214.766 8.34921C211.679 8.34921 211.185 9.77957 211.185 12.1536V18.4408H220.477L220.072 27.0513H211.185V50.9661H202.131Z" fill="#4180E2"/>
<path d="M55.2133 11.3127C53.6757 13.6084 51.7894 15.5653 49.5544 17.1835C49.5764 17.6175 49.5874 18.108 49.5874 18.6551C49.5874 21.6946 49.146 24.7378 48.263 27.7847C47.3801 30.8316 46.0313 33.7481 44.2168 36.534C42.4023 39.32 40.2409 41.7881 37.7326 43.9384C35.2243 46.0887 32.2092 47.8032 28.6873 49.0819C25.1654 50.3607 21.3909 51 17.3637 51C11.0787 51 5.29077 49.2969 0 45.8906C0.939049 45.9955 1.83968 46.0479 2.70188 46.0479C7.95253 46.0479 12.6422 44.4246 16.7709 41.1778C14.3227 41.1327 12.1302 40.3763 10.1934 38.9084C8.25654 37.4405 6.92364 35.5649 6.1947 33.2814C6.91521 33.4192 7.62633 33.4881 8.32806 33.4881C9.33815 33.4881 10.3321 33.3558 11.3098 33.0913C8.69718 32.5661 6.52978 31.2599 4.80761 29.1728C3.0855 27.0857 2.22445 24.6768 2.22445 21.9461V21.8053C3.82809 22.6966 5.53863 23.1707 7.35606 23.2276C5.80836 22.1919 4.58127 20.8413 3.67478 19.1758C2.76823 17.5104 2.31496 15.708 2.31496 13.7688C2.31496 11.7236 2.82552 9.81918 3.84665 8.05545C6.68783 11.5552 10.1305 14.3523 14.1747 16.4468C18.219 18.5413 22.5577 19.7046 27.1909 19.9365C26.9933 19.1098 26.8943 18.2472 26.8939 17.3485C26.8939 14.2107 28.0001 11.5315 30.2126 9.31092C32.4251 7.09029 35.0943 5.97998 38.2202 5.97998C41.493 5.97998 44.2497 7.17618 46.4903 9.56857C49.0503 9.05958 51.4473 8.13893 53.6813 6.80664C52.8206 9.52555 51.1622 11.623 48.7059 13.099C50.9634 12.8297 53.1326 12.2343 55.2133 11.3127Z" fill="#4180E2"/>
<path d="M324.768 23.0577C324.747 21.1643 324.74 19.2569 324.733 17.3565H319.062C319.041 19.2499 319.027 21.1503 319.013 23.0577C317.104 23.0648 315.209 23.0788 313.313 23.0998V28.773C315.209 28.7941 317.118 28.8081 319.013 28.8291C319.034 30.7225 319.034 32.6229 319.048 34.5163H324.726C324.733 32.6229 324.747 30.7225 324.761 28.8151C326.67 28.7941 328.565 28.787 330.461 28.766V23.0928C328.572 23.0788 326.663 23.0788 324.768 23.0577ZM287.568 23.0858C287.561 25.3509 287.568 27.6229 287.575 29.888C291.38 30.0142 295.191 29.9581 298.995 30.0142C297.317 38.4504 285.842 41.1853 279.77 35.6734C273.524 30.8417 273.818 20.2457 280.311 15.7576C284.852 12.1391 291.302 13.0297 295.844 16.1644C297.626 14.5164 299.297 12.7492 300.904 10.9259C297.128 7.91753 292.496 5.77167 287.568 5.99608C277.279 5.65246 267.824 14.6566 267.656 24.9441C266.996 33.3522 272.527 41.592 280.332 44.5654C288.109 47.5598 298.083 45.5191 303.052 38.5346C306.33 34.1236 307.039 28.4434 306.653 23.1068C300.286 23.0577 293.927 23.0648 287.568 23.0858Z" fill="#4180E2"/>
<path d="M125.437 18.8427C121.069 18.8427 117.505 22.4068 117.505 26.7742C117.505 31.1415 121.069 34.7056 125.437 34.7056C129.804 34.7056 133.368 31.1415 133.368 26.7742C133.368 22.4068 129.804 18.8427 125.437 18.8427ZM149.225 26.7742C149.225 23.4897 149.254 20.235 149.07 16.9566C148.885 13.1485 148.017 9.76888 145.232 6.98425C142.442 4.19367 139.068 3.33091 135.26 3.14646C131.976 2.96201 128.721 2.99176 125.443 2.99176C122.158 2.99176 118.904 2.96201 115.625 3.14646C111.817 3.33091 108.438 4.19962 105.653 6.98425C102.863 9.77483 102 13.1485 101.815 16.9566C101.631 20.241 101.661 23.4957 101.661 26.7742C101.661 30.0526 101.631 33.3133 101.815 36.5918C102 40.3998 102.869 43.7794 105.653 46.5641C108.444 49.3546 111.817 50.2174 115.625 50.4018C118.91 50.5863 122.164 50.5565 125.443 50.5565C128.727 50.5565 131.982 50.5863 135.26 50.4018C139.068 50.2174 142.448 49.3487 145.232 46.5641C148.023 43.7735 148.885 40.3998 149.07 36.5918C149.26 33.3133 149.225 30.0586 149.225 26.7742ZM125.437 38.9777C118.684 38.9777 113.233 33.5275 113.233 26.7742C113.233 20.0208 118.684 14.5706 125.437 14.5706C132.19 14.5706 137.64 20.0208 137.64 26.7742C137.64 33.5275 132.19 38.9777 125.437 38.9777ZM138.14 16.9209C136.563 16.9209 135.29 15.6475 135.29 14.0708C135.29 12.494 136.563 11.2207 138.14 11.2207C139.717 11.2207 140.99 12.494 140.99 14.0708C140.99 14.4452 140.917 14.816 140.774 15.162C140.631 15.508 140.421 15.8224 140.156 16.0871C139.891 16.3519 139.577 16.5618 139.231 16.7049C138.885 16.8479 138.514 16.9213 138.14 16.9209Z" fill="#4180E2"/>
</svg>
