%YAML 1.1
%TAG !u! tag:unity3d.com,2011:
--- !u!1045 &1
EditorBuildSettings:
  m_ObjectHideFlags: 0
  serializedVersion: 2
  m_Scenes:
  - enabled: 1
    path: Assets/Scenes/Home.unity
    guid: 1067024df25765a4d9c63e95606e6406
  - enabled: 1
    path: Assets/Scenes/Map1.unity
    guid: 641a747c0a85438439de9e59e291afed
  - enabled: 1
    path: Assets/Scenes/lose.unity
    guid: 1ec4a45d55632dd4aac9dd8a7721626a
  - enabled: 1
    path: Assets/Scenes/Win.unity
    guid: 3d1e0361b3aeacf46a6ddccce522fa3d
