{
  "project_info": {
    "project_number": "836910618277",
    "project_id": "native--login",
    "storage_bucket": "native--login.appspot.com"
  },
  "client": [
    {
      "client_info": {
        "mobilesdk_app_id": "1:836910618277:android:a4a350cdfd5243363adf4c",
        "android_client_info": {
          "package_name": "com.nativegooglelogin"
        }
      },
      "oauth_client": [
        {
          "client_id": "836910618277-ufn7f4mac8ir6a5aqbu0a5rbfj27vndr.apps.googleusercontent.com",
          "client_type": 1,
          "android_info": {
            "package_name": "com.nativegooglelogin",
            "certificate_hash": "5e8f16062ea3cd2c4a0d547876baa6f38cabf625"
          }
        },
        {
          "client_id": "836910618277-kfumtm1b0t9hrnv3nf2oq7d1qa1s01c5.apps.googleusercontent.com",
          "client_type": 3
        }
      ],
      "api_key": [
        {
          "current_key": "AIzaSyD8MRvkpb2uFYhmYh-g_t_kVb61civ1Ye4"
        }
      ],
      "services": {
        "appinvite_service": {
          "other_platform_oauth_client": [
            {
              "client_id": "836910618277-kfumtm1b0t9hrnv3nf2oq7d1qa1s01c5.apps.googleusercontent.com",
              "client_type": 3
            }
          ]
        }
      }
    }
  ],
  "configuration_version": "1"
}