ISO-10303-21;
HEADER;
FILE_DESCRIPTION(('STEP AP242'),'1');
FILE_NAME('p13-0123.stp','2022-11-04T21:31:27',('TraceParts'),('TraceParts S.A.'),'Spatial InterOp 3D',' ',' ');
FILE_SCHEMA(('AP242_MANAGED_MODEL_BASED_3D_ENGINEERING_MIM_LF  {1 0 10303 442 1 1 4}'));
ENDSEC;
DATA;
#1=MECHANICAL_DESIGN_GEOMETRIC_PRESENTATION_REPRESENTATION(' ',(#10,#11,#12,#13,#14,#15,#16,#17,#18,#19,#20,#21,#22,#23,#24,#25,#26,#27,#28,#29,#30,#31,#32,#33,#34,#35,#36,#37,#38,#39,#40,#41,#42,#43,#44),#6);
#2=PRODUCT_DEFINITION_CONTEXT('',#45,'design');
#3=APPLICATION_PROTOCOL_DEFINITION('INTERNATIONAL STANDARD','ap242_managed_model_based_3d_engineering',2014,#45);
#4=PRODUCT_CATEGORY_RELATIONSHIP('NONE','NONE',#46,#47);
#5=SHAPE_DEFINITION_REPRESENTATION(#48,#49);
#6= (GEOMETRIC_REPRESENTATION_CONTEXT(3)GLOBAL_UNCERTAINTY_ASSIGNED_CONTEXT((#52))GLOBAL_UNIT_ASSIGNED_CONTEXT((#54,#55,#56))REPRESENTATION_CONTEXT('NONE','WORKSPACE'));
#10=STYLED_ITEM('',(#58),#59);
#11=STYLED_ITEM('',(#60),#61);
#12=STYLED_ITEM('',(#62),#63);
#13=STYLED_ITEM('',(#64),#65);
#14=STYLED_ITEM('',(#66),#67);
#15=STYLED_ITEM('',(#68),#69);
#16=STYLED_ITEM('',(#70),#71);
#17=STYLED_ITEM('',(#72),#73);
#18=STYLED_ITEM('',(#74),#75);
#19=STYLED_ITEM('',(#76),#77);
#20=STYLED_ITEM('',(#78),#79);
#21=STYLED_ITEM('',(#80),#81);
#22=STYLED_ITEM('',(#82),#83);
#23=STYLED_ITEM('',(#84),#85);
#24=STYLED_ITEM('',(#86),#87);
#25=STYLED_ITEM('',(#88),#89);
#26=STYLED_ITEM('',(#90),#91);
#27=STYLED_ITEM('',(#92),#93);
#28=STYLED_ITEM('',(#94),#95);
#29=STYLED_ITEM('',(#96),#97);
#30=STYLED_ITEM('',(#98),#99);
#31=STYLED_ITEM('',(#100),#101);
#32=STYLED_ITEM('',(#102),#103);
#33=STYLED_ITEM('',(#104),#105);
#34=STYLED_ITEM('',(#106),#107);
#35=STYLED_ITEM('',(#108),#109);
#36=STYLED_ITEM('',(#110),#111);
#37=STYLED_ITEM('',(#112),#113);
#38=STYLED_ITEM('',(#114),#115);
#39=STYLED_ITEM('',(#116),#117);
#40=STYLED_ITEM('',(#118),#119);
#41=STYLED_ITEM('',(#120),#121);
#42=STYLED_ITEM('',(#122),#123);
#43=STYLED_ITEM('',(#124),#125);
#44=STYLED_ITEM('',(#126),#127);
#45=APPLICATION_CONTEXT('managed model based 3d engineering');
#46=PRODUCT_CATEGORY('part','NONE');
#47=PRODUCT_RELATED_PRODUCT_CATEGORY('detail',' ',(#128));
#48=PRODUCT_DEFINITION_SHAPE('NONE','NONE',#129);
#49=ADVANCED_BREP_SHAPE_REPRESENTATION('p13-0123',(#127,#130),#6);
#52=UNCERTAINTY_MEASURE_WITH_UNIT(LENGTH_MEASURE(1.0E-06),#54,'','');
#54= (CONVERSION_BASED_UNIT('MILLIMETRE',#133)LENGTH_UNIT()NAMED_UNIT(#136));
#55= (NAMED_UNIT(#138)PLANE_ANGLE_UNIT()SI_UNIT($,.RADIAN.));
#56= (NAMED_UNIT(#138)SOLID_ANGLE_UNIT()SI_UNIT($,.STERADIAN.));
#58=PRESENTATION_STYLE_ASSIGNMENT((#144));
#59=EDGE_CURVE('',#145,#146,#147,.T.);
#60=PRESENTATION_STYLE_ASSIGNMENT((#148));
#61=EDGE_CURVE('',#149,#146,#150,.T.);
#62=PRESENTATION_STYLE_ASSIGNMENT((#151));
#63=EDGE_CURVE('',#152,#149,#153,.T.);
#64=PRESENTATION_STYLE_ASSIGNMENT((#154));
#65=EDGE_CURVE('',#155,#156,#157,.T.);
#66=PRESENTATION_STYLE_ASSIGNMENT((#158));
#67=EDGE_CURVE('',#159,#156,#160,.T.);
#68=PRESENTATION_STYLE_ASSIGNMENT((#161));
#69=EDGE_CURVE('',#162,#159,#163,.T.);
#70=PRESENTATION_STYLE_ASSIGNMENT((#164));
#71=EDGE_CURVE('',#159,#152,#165,.T.);
#72=PRESENTATION_STYLE_ASSIGNMENT((#166));
#73=EDGE_CURVE('',#149,#162,#167,.T.);
#74=PRESENTATION_STYLE_ASSIGNMENT((#168));
#75=EDGE_CURVE('',#146,#155,#169,.T.);
#76=PRESENTATION_STYLE_ASSIGNMENT((#170));
#77=EDGE_CURVE('',#156,#145,#171,.T.);
#78=PRESENTATION_STYLE_ASSIGNMENT((#172));
#79=EDGE_CURVE('',#173,#174,#175,.T.);
#80=PRESENTATION_STYLE_ASSIGNMENT((#176));
#81=EDGE_CURVE('',#177,#174,#178,.T.);
#82=PRESENTATION_STYLE_ASSIGNMENT((#179));
#83=EDGE_CURVE('',#180,#177,#181,.T.);
#84=PRESENTATION_STYLE_ASSIGNMENT((#182));
#85=EDGE_CURVE('',#180,#173,#183,.T.);
#86=PRESENTATION_STYLE_ASSIGNMENT((#184));
#87=EDGE_CURVE('',#156,#185,#186,.T.);
#88=PRESENTATION_STYLE_ASSIGNMENT((#187));
#89=EDGE_CURVE('',#188,#185,#189,.T.);
#90=PRESENTATION_STYLE_ASSIGNMENT((#190));
#91=EDGE_CURVE('',#146,#188,#191,.T.);
#92=PRESENTATION_STYLE_ASSIGNMENT((#192));
#93=EDGE_CURVE('',#173,#180,#193,.T.);
#94=PRESENTATION_STYLE_ASSIGNMENT((#194));
#95=EDGE_CURVE('',#195,#196,#197,.T.);
#96=PRESENTATION_STYLE_ASSIGNMENT((#198));
#97=EDGE_CURVE('',#195,#196,#199,.T.);
#98=PRESENTATION_STYLE_ASSIGNMENT((#200));
#99=EDGE_CURVE('',#196,#201,#202,.T.);
#100=PRESENTATION_STYLE_ASSIGNMENT((#203));
#101=EDGE_CURVE('',#204,#201,#205,.T.);
#102=PRESENTATION_STYLE_ASSIGNMENT((#206));
#103=EDGE_CURVE('',#195,#204,#207,.T.);
#104=PRESENTATION_STYLE_ASSIGNMENT((#208));
#105=EDGE_CURVE('',#204,#201,#209,.T.);
#106=PRESENTATION_STYLE_ASSIGNMENT((#210));
#107=EDGE_CURVE('',#185,#188,#211,.T.);
#108=PRESENTATION_STYLE_ASSIGNMENT((#212));
#109=EDGE_CURVE('',#174,#177,#213,.T.);
#110=PRESENTATION_STYLE_ASSIGNMENT((#214));
#111=EDGE_CURVE('',#215,#216,#217,.T.);
#112=PRESENTATION_STYLE_ASSIGNMENT((#218));
#113=EDGE_CURVE('',#215,#216,#219,.T.);
#114=PRESENTATION_STYLE_ASSIGNMENT((#220));
#115=EDGE_CURVE('',#221,#216,#222,.T.);
#116=PRESENTATION_STYLE_ASSIGNMENT((#223));
#117=EDGE_CURVE('',#224,#221,#225,.T.);
#118=PRESENTATION_STYLE_ASSIGNMENT((#226));
#119=EDGE_CURVE('',#224,#215,#227,.T.);
#120=PRESENTATION_STYLE_ASSIGNMENT((#228));
#121=EDGE_CURVE('',#224,#221,#229,.T.);
#122=PRESENTATION_STYLE_ASSIGNMENT((#230));
#123=EDGE_CURVE('',#231,#221,#232,.T.);
#124=PRESENTATION_STYLE_ASSIGNMENT((#233));
#125=EDGE_CURVE('',#231,#224,#234,.T.);
#126=PRESENTATION_STYLE_ASSIGNMENT((#235));
#127=MANIFOLD_SOLID_BREP('p13-0123',#236);
#128=PRODUCT('p13-0123','','PART--DESC',(#237));
#129=PRODUCT_DEFINITION('','NONE',#238,#2);
#130=AXIS2_PLACEMENT_3D('',#239,#240,#241);
#133=LENGTH_MEASURE_WITH_UNIT(LENGTH_MEASURE(1.0),#242);
#136=DIMENSIONAL_EXPONENTS(1.0,0.0,0.0,0.0,0.0,0.0,0.0);
#138=DIMENSIONAL_EXPONENTS(0.0,0.0,0.0,0.0,0.0,0.0,0.0);
#144=CURVE_STYLE('',#243,POSITIVE_LENGTH_MEASURE(0.02),#244);
#145=VERTEX_POINT('',#245);
#146=VERTEX_POINT('',#246);
#147=CIRCLE('',#247,0.34);
#148=CURVE_STYLE('',#248,POSITIVE_LENGTH_MEASURE(0.02),#249);
#149=VERTEX_POINT('',#250);
#150=CIRCLE('',#251,0.1);
#151=CURVE_STYLE('',#252,POSITIVE_LENGTH_MEASURE(0.02),#253);
#152=VERTEX_POINT('',#254);
#153=CIRCLE('',#255,0.24);
#154=CURVE_STYLE('',#256,POSITIVE_LENGTH_MEASURE(0.02),#257);
#155=VERTEX_POINT('',#258);
#156=VERTEX_POINT('',#259);
#157=CIRCLE('',#260,0.34);
#158=CURVE_STYLE('',#261,POSITIVE_LENGTH_MEASURE(0.02),#262);
#159=VERTEX_POINT('',#263);
#160=CIRCLE('',#264,0.1);
#161=CURVE_STYLE('',#265,POSITIVE_LENGTH_MEASURE(0.02),#266);
#162=VERTEX_POINT('',#267);
#163=CIRCLE('',#268,0.24);
#164=CURVE_STYLE('',#269,POSITIVE_LENGTH_MEASURE(0.02),#270);
#165=CIRCLE('',#271,0.24);
#166=CURVE_STYLE('',#272,POSITIVE_LENGTH_MEASURE(0.02),#273);
#167=CIRCLE('',#274,0.24);
#168=CURVE_STYLE('',#275,POSITIVE_LENGTH_MEASURE(0.02),#276);
#169=CIRCLE('',#277,0.34);
#170=CURVE_STYLE('',#278,POSITIVE_LENGTH_MEASURE(0.02),#279);
#171=CIRCLE('',#280,0.34);
#172=CURVE_STYLE('',#281,POSITIVE_LENGTH_MEASURE(0.02),#282);
#173=VERTEX_POINT('',#283);
#174=VERTEX_POINT('',#284);
#175=LINE('',#285,#286);
#176=CURVE_STYLE('',#287,POSITIVE_LENGTH_MEASURE(0.02),#288);
#177=VERTEX_POINT('',#289);
#178=CIRCLE('',#290,0.34);
#179=CURVE_STYLE('',#291,POSITIVE_LENGTH_MEASURE(0.02),#292);
#180=VERTEX_POINT('',#293);
#181=LINE('',#294,#295);
#182=CURVE_STYLE('',#296,POSITIVE_LENGTH_MEASURE(0.02),#297);
#183=CIRCLE('',#298,0.34);
#184=CURVE_STYLE('',#299,POSITIVE_LENGTH_MEASURE(0.02),#300);
#185=VERTEX_POINT('',#301);
#186=LINE('',#302,#303);
#187=CURVE_STYLE('',#304,POSITIVE_LENGTH_MEASURE(0.02),#305);
#188=VERTEX_POINT('',#306);
#189=CIRCLE('',#307,0.34);
#190=CURVE_STYLE('',#308,POSITIVE_LENGTH_MEASURE(0.02),#309);
#191=LINE('',#310,#311);
#192=CURVE_STYLE('',#312,POSITIVE_LENGTH_MEASURE(0.02),#313);
#193=CIRCLE('',#314,0.34);
#194=CURVE_STYLE('',#315,POSITIVE_LENGTH_MEASURE(0.02),#316);
#195=VERTEX_POINT('',#317);
#196=VERTEX_POINT('',#318);
#197=CIRCLE('',#319,0.3);
#198=CURVE_STYLE('',#320,POSITIVE_LENGTH_MEASURE(0.02),#321);
#199=CIRCLE('',#322,0.3);
#200=CURVE_STYLE('',#323,POSITIVE_LENGTH_MEASURE(0.02),#324);
#201=VERTEX_POINT('',#325);
#202=LINE('',#326,#327);
#203=CURVE_STYLE('',#328,POSITIVE_LENGTH_MEASURE(0.02),#329);
#204=VERTEX_POINT('',#330);
#205=CIRCLE('',#331,0.3);
#206=CURVE_STYLE('',#332,POSITIVE_LENGTH_MEASURE(0.02),#333);
#207=LINE('',#334,#335);
#208=CURVE_STYLE('',#336,POSITIVE_LENGTH_MEASURE(0.02),#337);
#209=CIRCLE('',#338,0.3);
#210=CURVE_STYLE('',#339,POSITIVE_LENGTH_MEASURE(0.02),#340);
#211=CIRCLE('',#341,0.34);
#212=CURVE_STYLE('',#342,POSITIVE_LENGTH_MEASURE(0.02),#343);
#213=CIRCLE('',#344,0.34);
#214=CURVE_STYLE('',#345,POSITIVE_LENGTH_MEASURE(0.02),#346);
#215=VERTEX_POINT('',#347);
#216=VERTEX_POINT('',#348);
#217=CIRCLE('',#349,0.25);
#218=CURVE_STYLE('',#350,POSITIVE_LENGTH_MEASURE(0.02),#351);
#219=CIRCLE('',#352,0.25);
#220=CURVE_STYLE('',#353,POSITIVE_LENGTH_MEASURE(0.02),#354);
#221=VERTEX_POINT('',#355);
#222=LINE('',#356,#357);
#223=CURVE_STYLE('',#358,POSITIVE_LENGTH_MEASURE(0.02),#359);
#224=VERTEX_POINT('',#360);
#225=CIRCLE('',#361,0.25);
#226=CURVE_STYLE('',#362,POSITIVE_LENGTH_MEASURE(0.02),#363);
#227=LINE('',#364,#365);
#228=CURVE_STYLE('',#366,POSITIVE_LENGTH_MEASURE(0.02),#367);
#229=CIRCLE('',#368,0.25);
#230=CURVE_STYLE('',#369,POSITIVE_LENGTH_MEASURE(0.02),#370);
#231=VERTEX_POINT('',#371);
#232=LINE('',#372,#373);
#233=CURVE_STYLE('',#374,POSITIVE_LENGTH_MEASURE(0.02),#375);
#234=LINE('',#376,#377);
#235=SURFACE_STYLE_USAGE(.BOTH.,#378);
#236=CLOSED_SHELL('',(#379,#380,#381,#382,#383,#384,#385,#386,#387,#388,#389,#390,#391,#392,#393,#394,#395,#396));
#237=PRODUCT_CONTEXT('',#45,'mechanical');
#238=PRODUCT_DEFINITION_FORMATION_WITH_SPECIFIED_SOURCE(' ','NONE',#128,.NOT_KNOWN.);
#239=CARTESIAN_POINT('',(0.0,0.0,0.0));
#240=DIRECTION('',(0.0,0.0,1.0));
#241=DIRECTION('',(1.0,0.0,0.0));
#242= (NAMED_UNIT(#136)LENGTH_UNIT()SI_UNIT(.MILLI.,.METRE.));
#243=DRAUGHTING_PRE_DEFINED_CURVE_FONT('continuous');
#244=COLOUR_RGB('',1.0,0.807843029499054,0.458824008703232);
#245=CARTESIAN_POINT('',(0.338119646863716,0.1,-0.0357086040717765));
#246=CARTESIAN_POINT('',(0.34,0.1,1.232974397382E-14));
#247=AXIS2_PLACEMENT_3D('',#398,#399,#400);
#248=DRAUGHTING_PRE_DEFINED_CURVE_FONT('continuous');
#249=COLOUR_RGB('',1.0,0.807843029499054,0.458824008703232);
#250=CARTESIAN_POINT('',(0.24,0.0,1.224728341726E-14));
#251=AXIS2_PLACEMENT_3D('',#401,#402,#403);
#252=DRAUGHTING_PRE_DEFINED_CURVE_FONT('continuous');
#253=COLOUR_RGB('',1.0,0.807843029499054,0.458824008703232);
#254=CARTESIAN_POINT('',(0.2386726919038,0.0,-0.0252060734624269));
#255=AXIS2_PLACEMENT_3D('',#404,#405,#406);
#256=DRAUGHTING_PRE_DEFINED_CURVE_FONT('continuous');
#257=COLOUR_RGB('',1.0,0.807843029499054,0.458824008703232);
#258=CARTESIAN_POINT('',(-0.338119646863716,0.1,0.035708604071801));
#259=CARTESIAN_POINT('',(-0.34,0.1,1.22048300003E-14));
#260=AXIS2_PLACEMENT_3D('',#407,#408,#409);
#261=DRAUGHTING_PRE_DEFINED_CURVE_FONT('continuous');
#262=COLOUR_RGB('',1.0,0.807843029499054,0.458824008703232);
#263=CARTESIAN_POINT('',(-0.24,0.0,1.227504408886E-14));
#264=AXIS2_PLACEMENT_3D('',#410,#411,#412);
#265=DRAUGHTING_PRE_DEFINED_CURVE_FONT('continuous');
#266=COLOUR_RGB('',1.0,0.807843029499054,0.458824008703232);
#267=CARTESIAN_POINT('',(-0.2386726919038,0.0,0.0252060734624514));
#268=AXIS2_PLACEMENT_3D('',#413,#414,#415);
#269=DRAUGHTING_PRE_DEFINED_CURVE_FONT('continuous');
#270=COLOUR_RGB('',1.0,0.807843029499054,0.458824008703232);
#271=AXIS2_PLACEMENT_3D('',#416,#417,#418);
#272=DRAUGHTING_PRE_DEFINED_CURVE_FONT('continuous');
#273=COLOUR_RGB('',1.0,0.807843029499054,0.458824008703232);
#274=AXIS2_PLACEMENT_3D('',#419,#420,#421);
#275=DRAUGHTING_PRE_DEFINED_CURVE_FONT('continuous');
#276=COLOUR_RGB('',1.0,0.807843029499054,0.458824008703232);
#277=AXIS2_PLACEMENT_3D('',#422,#423,#424);
#278=DRAUGHTING_PRE_DEFINED_CURVE_FONT('continuous');
#279=COLOUR_RGB('',1.0,0.807843029499054,0.458824008703232);
#280=AXIS2_PLACEMENT_3D('',#425,#426,#427);
#281=DRAUGHTING_PRE_DEFINED_CURVE_FONT('continuous');
#282=COLOUR_RGB('',1.0,0.807843029499054,0.458824008703232);
#283=CARTESIAN_POINT('',(-0.34,10.3,1.208688155829E-14));
#284=CARTESIAN_POINT('',(-0.34,13.0,1.201220167778E-14));
#285=CARTESIAN_POINT('',(-0.34,10.3,1.22048300003E-14));
#286=VECTOR('',#428,2.7);
#287=DRAUGHTING_PRE_DEFINED_CURVE_FONT('continuous');
#288=COLOUR_RGB('',1.0,0.807843029499054,0.458824008703232);
#289=CARTESIAN_POINT('',(0.34,13.0,1.243909631399E-14));
#290=AXIS2_PLACEMENT_3D('',#429,#430,#431);
#291=DRAUGHTING_PRE_DEFINED_CURVE_FONT('continuous');
#292=COLOUR_RGB('',1.0,0.807843029499054,0.458824008703232);
#293=CARTESIAN_POINT('',(0.34,10.3,1.236441643349E-14));
#294=CARTESIAN_POINT('',(0.34,10.3,1.235285894693E-14));
#295=VECTOR('',#432,2.7);
#296=DRAUGHTING_PRE_DEFINED_CURVE_FONT('continuous');
#297=COLOUR_RGB('',1.0,0.807843029499054,0.458824008703232);
#298=AXIS2_PLACEMENT_3D('',#433,#434,#435);
#299=DRAUGHTING_PRE_DEFINED_CURVE_FONT('continuous');
#300=COLOUR_RGB('',1.0,0.807843029499054,0.458824008703232);
#301=CARTESIAN_POINT('',(-0.34,10.05,1.20887337537E-14));
#302=CARTESIAN_POINT('',(-0.34,0.1,1.275666275056E-09));
#303=VECTOR('',#436,9.95);
#304=DRAUGHTING_PRE_DEFINED_CURVE_FONT('continuous');
#305=COLOUR_RGB('',1.0,0.807843029499054,0.458824008703232);
#306=CARTESIAN_POINT('',(0.34,10.05,1.236256423808E-14));
#307=AXIS2_PLACEMENT_3D('',#437,#438,#439);
#308=DRAUGHTING_PRE_DEFINED_CURVE_FONT('continuous');
#309=COLOUR_RGB('',1.0,0.807843029499054,0.458824008703232);
#310=CARTESIAN_POINT('',(0.34,0.1,-1.275641846159E-09));
#311=VECTOR('',#440,9.95);
#312=DRAUGHTING_PRE_DEFINED_CURVE_FONT('continuous');
#313=COLOUR_RGB('',1.0,0.807843029499054,0.458824008703232);
#314=AXIS2_PLACEMENT_3D('',#441,#442,#443);
#315=DRAUGHTING_PRE_DEFINED_CURVE_FONT('continuous');
#316=COLOUR_RGB('',1.0,0.807843029499054,0.458824008703232);
#317=CARTESIAN_POINT('',(0.0,10.3,-0.3));
#318=CARTESIAN_POINT('',(0.0,10.3,0.3));
#319=AXIS2_PLACEMENT_3D('',#444,#445,#446);
#320=DRAUGHTING_PRE_DEFINED_CURVE_FONT('continuous');
#321=COLOUR_RGB('',1.0,0.807843029499054,0.458824008703232);
#322=AXIS2_PLACEMENT_3D('',#447,#448,#449);
#323=DRAUGHTING_PRE_DEFINED_CURVE_FONT('continuous');
#324=COLOUR_RGB('',1.0,0.807843029499054,0.458824008703232);
#325=CARTESIAN_POINT('',(0.0,10.05,0.3));
#326=CARTESIAN_POINT('',(0.0,10.3,0.3));
#327=VECTOR('',#450,0.25);
#328=DRAUGHTING_PRE_DEFINED_CURVE_FONT('continuous');
#329=COLOUR_RGB('',1.0,0.807843029499054,0.458824008703232);
#330=CARTESIAN_POINT('',(0.0,10.05,-0.3));
#331=AXIS2_PLACEMENT_3D('',#451,#452,#453);
#332=DRAUGHTING_PRE_DEFINED_CURVE_FONT('continuous');
#333=COLOUR_RGB('',1.0,0.807843029499054,0.458824008703232);
#334=CARTESIAN_POINT('',(0.0,10.3,-0.3));
#335=VECTOR('',#454,0.25);
#336=DRAUGHTING_PRE_DEFINED_CURVE_FONT('continuous');
#337=COLOUR_RGB('',1.0,0.807843029499054,0.458824008703232);
#338=AXIS2_PLACEMENT_3D('',#455,#456,#457);
#339=DRAUGHTING_PRE_DEFINED_CURVE_FONT('continuous');
#340=COLOUR_RGB('',1.0,0.807843029499054,0.458824008703232);
#341=AXIS2_PLACEMENT_3D('',#458,#459,#460);
#342=DRAUGHTING_PRE_DEFINED_CURVE_FONT('continuous');
#343=COLOUR_RGB('',1.0,0.807843029499054,0.458824008703232);
#344=AXIS2_PLACEMENT_3D('',#461,#462,#463);
#345=DRAUGHTING_PRE_DEFINED_CURVE_FONT('continuous');
#346=COLOUR_RGB('',1.0,0.807843029499054,0.458824008703232);
#347=CARTESIAN_POINT('',(0.0,13.0,-0.25));
#348=CARTESIAN_POINT('',(0.0,13.0,0.25));
#349=AXIS2_PLACEMENT_3D('',#464,#465,#466);
#350=DRAUGHTING_PRE_DEFINED_CURVE_FONT('continuous');
#351=COLOUR_RGB('',1.0,0.807843029499054,0.458824008703232);
#352=AXIS2_PLACEMENT_3D('',#467,#468,#469);
#353=DRAUGHTING_PRE_DEFINED_CURVE_FONT('continuous');
#354=COLOUR_RGB('',1.0,0.807843029499054,0.458824008703232);
#355=CARTESIAN_POINT('',(0.0,15.74644660941,0.25));
#356=CARTESIAN_POINT('',(0.0,15.74644660941,0.25));
#357=VECTOR('',#470,2.746446609407);
#358=DRAUGHTING_PRE_DEFINED_CURVE_FONT('continuous');
#359=COLOUR_RGB('',1.0,0.807843029499054,0.458824008703232);
#360=CARTESIAN_POINT('',(0.0,15.74644660941,-0.25));
#361=AXIS2_PLACEMENT_3D('',#471,#472,#473);
#362=DRAUGHTING_PRE_DEFINED_CURVE_FONT('continuous');
#363=COLOUR_RGB('',1.0,0.807843029499054,0.458824008703232);
#364=CARTESIAN_POINT('',(0.0,15.74644660941,-0.25));
#365=VECTOR('',#474,2.746446609407);
#366=DRAUGHTING_PRE_DEFINED_CURVE_FONT('continuous');
#367=COLOUR_RGB('',1.0,0.807843029499054,0.458824008703232);
#368=AXIS2_PLACEMENT_3D('',#475,#476,#477);
#369=DRAUGHTING_PRE_DEFINED_CURVE_FONT('continuous');
#370=COLOUR_RGB('',1.0,0.807843029499054,0.458824008703232);
#371=CARTESIAN_POINT('',(0.0,16.35,1.222564899589E-14));
#372=CARTESIAN_POINT('',(0.0,16.35,1.222564899589E-14));
#373=VECTOR('',#478,0.6532814824382);
#374=DRAUGHTING_PRE_DEFINED_CURVE_FONT('continuous');
#375=COLOUR_RGB('',1.0,0.807843029499054,0.458824008703232);
#376=CARTESIAN_POINT('',(0.0,16.35,1.222564899589E-14));
#377=VECTOR('',#479,0.6532814824382);
#378=SURFACE_SIDE_STYLE('',(#480));
#379=ADVANCED_FACE('',(#481),#482,.T.);
#380=ADVANCED_FACE('',(#483),#484,.T.);
#381=ADVANCED_FACE('',(#485),#486,.F.);
#382=ADVANCED_FACE('',(#487),#488,.T.);
#383=ADVANCED_FACE('',(#489),#490,.T.);
#384=ADVANCED_FACE('',(#491),#492,.T.);
#385=ADVANCED_FACE('',(#493),#494,.T.);
#386=ADVANCED_FACE('',(#495,#496),#497,.F.);
#387=ADVANCED_FACE('',(#498),#499,.T.);
#388=ADVANCED_FACE('',(#500),#501,.T.);
#389=ADVANCED_FACE('',(#502,#503),#504,.T.);
#390=ADVANCED_FACE('',(#505),#506,.T.);
#391=ADVANCED_FACE('',(#507),#508,.T.);
#392=ADVANCED_FACE('',(#509,#510),#511,.T.);
#393=ADVANCED_FACE('',(#512),#513,.T.);
#394=ADVANCED_FACE('',(#514),#515,.T.);
#395=ADVANCED_FACE('',(#516),#517,.T.);
#396=ADVANCED_FACE('',(#518),#519,.T.);
#398=CARTESIAN_POINT('',(0.0,0.1,1.224646799147E-14));
#399=DIRECTION('',(0.0,-1.0,0.0));
#400=DIRECTION('',(-1.0,0.0,0.0));
#401=CARTESIAN_POINT('',(0.24,0.1,1.230544858966E-14));
#402=DIRECTION('',(0.0,0.0,1.0));
#403=DIRECTION('',(-2.192690473635E-13,-1.0,0.0));
#404=CARTESIAN_POINT('',(0.0,0.0,1.224646799147E-14));
#405=DIRECTION('',(0.0,-1.0,0.0));
#406=DIRECTION('',(-1.0,0.0,0.0));
#407=CARTESIAN_POINT('',(0.0,0.1,1.224646799147E-14));
#408=DIRECTION('',(0.0,-1.0,0.0));
#409=DIRECTION('',(1.0,0.0,0.0));
#410=CARTESIAN_POINT('',(-0.24,0.1,1.221524296891E-14));
#411=DIRECTION('',(0.0,0.0,-1.0));
#412=DIRECTION('',(2.201017146319E-13,-1.0,0.0));
#413=CARTESIAN_POINT('',(0.0,0.0,1.224646799147E-14));
#414=DIRECTION('',(0.0,-1.0,0.0));
#415=DIRECTION('',(1.0,0.0,0.0));
#416=CARTESIAN_POINT('',(0.0,0.0,1.224646799147E-14));
#417=DIRECTION('',(0.0,-1.0,0.0));
#418=DIRECTION('',(-1.0,0.0,0.0));
#419=CARTESIAN_POINT('',(0.0,0.0,1.224646799147E-14));
#420=DIRECTION('',(0.0,-1.0,0.0));
#421=DIRECTION('',(1.0,0.0,0.0));
#422=CARTESIAN_POINT('',(0.0,0.1,1.224646799147E-14));
#423=DIRECTION('',(0.0,-1.0,0.0));
#424=DIRECTION('',(1.0,0.0,0.0));
#425=CARTESIAN_POINT('',(0.0,0.1,1.224646799147E-14));
#426=DIRECTION('',(0.0,-1.0,0.0));
#427=DIRECTION('',(-1.0,0.0,0.0));
#428=DIRECTION('',(0.0,1.0,0.0));
#429=CARTESIAN_POINT('',(0.0,13.0,1.224646799147E-14));
#430=DIRECTION('',(-0.0,1.0,0.0));
#431=DIRECTION('',(1.0,0.0,0.0));
#432=DIRECTION('',(0.0,1.0,0.0));
#433=CARTESIAN_POINT('',(0.0,10.3,1.224646799147E-14));
#434=DIRECTION('',(-0.0,1.0,0.0));
#435=DIRECTION('',(1.0,0.0,0.0));
#436=DIRECTION('',(0.0,1.0,-1.282064543936E-10));
#437=CARTESIAN_POINT('',(0.0,10.05,1.224646799147E-14));
#438=DIRECTION('',(-0.0,1.0,0.0));
#439=DIRECTION('',(1.0,0.0,0.0));
#440=DIRECTION('',(0.0,1.0,1.282064520385E-10));
#441=CARTESIAN_POINT('',(0.0,10.3,1.224646799147E-14));
#442=DIRECTION('',(0.0,1.0,0.0));
#443=DIRECTION('',(-1.0,0.0,0.0));
#444=CARTESIAN_POINT('',(0.0,10.3,0.0));
#445=DIRECTION('',(0.0,1.0,0.0));
#446=DIRECTION('',(0.0,0.0,-1.0));
#447=CARTESIAN_POINT('',(0.0,10.3,0.0));
#448=DIRECTION('',(0.0,-1.0,0.0));
#449=DIRECTION('',(0.0,0.0,-1.0));
#450=DIRECTION('',(0.0,-1.0,0.0));
#451=CARTESIAN_POINT('',(0.0,10.05,0.0));
#452=DIRECTION('',(0.0,-1.0,0.0));
#453=DIRECTION('',(0.0,0.0,-1.0));
#454=DIRECTION('',(0.0,-1.0,0.0));
#455=CARTESIAN_POINT('',(0.0,10.05,0.0));
#456=DIRECTION('',(0.0,1.0,0.0));
#457=DIRECTION('',(0.0,0.0,-1.0));
#458=CARTESIAN_POINT('',(0.0,10.05,1.224646799147E-14));
#459=DIRECTION('',(0.0,1.0,0.0));
#460=DIRECTION('',(-1.0,0.0,0.0));
#461=CARTESIAN_POINT('',(0.0,13.0,1.224646799147E-14));
#462=DIRECTION('',(0.0,1.0,0.0));
#463=DIRECTION('',(-1.0,0.0,0.0));
#464=CARTESIAN_POINT('',(0.0,13.0,1.222564899589E-14));
#465=DIRECTION('',(0.0,-1.0,0.0));
#466=DIRECTION('',(0.0,0.0,-1.0));
#467=CARTESIAN_POINT('',(0.0,13.0,1.222564899589E-14));
#468=DIRECTION('',(0.0,1.0,0.0));
#469=DIRECTION('',(0.0,0.0,-1.0));
#470=DIRECTION('',(0.0,-1.0,0.0));
#471=CARTESIAN_POINT('',(0.0,15.74644660941,1.222564899589E-14));
#472=DIRECTION('',(0.0,1.0,0.0));
#473=DIRECTION('',(0.0,0.0,-1.0));
#474=DIRECTION('',(0.0,-1.0,0.0));
#475=CARTESIAN_POINT('',(0.0,15.74644660941,1.222564899589E-14));
#476=DIRECTION('',(0.0,-1.0,0.0));
#477=DIRECTION('',(0.0,0.0,-1.0));
#478=DIRECTION('',(0.0,-0.923879532511285,0.382683432365094));
#479=DIRECTION('',(0.0,-0.923879532511285,-0.382683432365094));
#480=SURFACE_STYLE_FILL_AREA(#520);
#481=FACE_OUTER_BOUND('',#521,.T.);
#482=TOROIDAL_SURFACE('',#522,0.24,0.1);
#483=FACE_OUTER_BOUND('',#523,.T.);
#484=TOROIDAL_SURFACE('',#524,0.24,0.1);
#485=FACE_OUTER_BOUND('',#525,.T.);
#486=PLANE('',#526);
#487=FACE_OUTER_BOUND('',#527,.T.);
#488=TOROIDAL_SURFACE('',#528,0.24,0.1);
#489=FACE_OUTER_BOUND('',#529,.T.);
#490=TOROIDAL_SURFACE('',#530,0.24,0.1);
#491=FACE_OUTER_BOUND('',#531,.T.);
#492=CYLINDRICAL_SURFACE('',#532,0.34);
#493=FACE_OUTER_BOUND('',#533,.T.);
#494=CYLINDRICAL_SURFACE('',#534,0.34);
#495=FACE_OUTER_BOUND('',#535,.T.);
#496=FACE_BOUND('',#536,.T.);
#497=PLANE('',#537);
#498=FACE_OUTER_BOUND('',#538,.T.);
#499=CYLINDRICAL_SURFACE('',#539,0.3);
#500=FACE_OUTER_BOUND('',#540,.T.);
#501=CYLINDRICAL_SURFACE('',#541,0.3);
#502=FACE_OUTER_BOUND('',#542,.T.);
#503=FACE_BOUND('',#543,.T.);
#504=PLANE('',#544);
#505=FACE_OUTER_BOUND('',#545,.T.);
#506=CYLINDRICAL_SURFACE('',#546,0.34);
#507=FACE_OUTER_BOUND('',#547,.T.);
#508=CYLINDRICAL_SURFACE('',#548,0.34);
#509=FACE_OUTER_BOUND('',#549,.T.);
#510=FACE_BOUND('',#550,.T.);
#511=PLANE('',#551);
#512=FACE_OUTER_BOUND('',#552,.T.);
#513=CYLINDRICAL_SURFACE('',#553,0.25);
#514=FACE_OUTER_BOUND('',#554,.T.);
#515=CYLINDRICAL_SURFACE('',#555,0.25);
#516=FACE_OUTER_BOUND('',#556,.T.);
#517=CONICAL_SURFACE('',#557,0.1287606125464,0.39269908169865);
#518=FACE_OUTER_BOUND('',#558,.T.);
#519=CONICAL_SURFACE('',#559,0.1287606125464,0.39269908169865);
#520=FILL_AREA_STYLE('',(#560));
#521=EDGE_LOOP('',(#561,#562,#563,#564));
#522=AXIS2_PLACEMENT_3D('',#565,#566,#567);
#523=EDGE_LOOP('',(#568,#569,#570,#571));
#524=AXIS2_PLACEMENT_3D('',#572,#573,#574);
#525=EDGE_LOOP('',(#575,#576,#577,#578));
#526=AXIS2_PLACEMENT_3D('',#579,#580,#581);
#527=EDGE_LOOP('',(#582,#583,#584,#585));
#528=AXIS2_PLACEMENT_3D('',#586,#587,#588);
#529=EDGE_LOOP('',(#589,#590,#591,#592));
#530=AXIS2_PLACEMENT_3D('',#593,#594,#595);
#531=EDGE_LOOP('',(#596,#597,#598,#599));
#532=AXIS2_PLACEMENT_3D('',#600,#601,#602);
#533=EDGE_LOOP('',(#603,#604,#605,#606,#607));
#534=AXIS2_PLACEMENT_3D('',#608,#609,#610);
#535=EDGE_LOOP('',(#611,#612));
#536=EDGE_LOOP('',(#613,#614));
#537=AXIS2_PLACEMENT_3D('',#615,#616,#617);
#538=EDGE_LOOP('',(#618,#619,#620,#621));
#539=AXIS2_PLACEMENT_3D('',#622,#623,#624);
#540=EDGE_LOOP('',(#625,#626,#627,#628));
#541=AXIS2_PLACEMENT_3D('',#629,#630,#631);
#542=EDGE_LOOP('',(#632,#633));
#543=EDGE_LOOP('',(#634,#635));
#544=AXIS2_PLACEMENT_3D('',#636,#637,#638);
#545=EDGE_LOOP('',(#639,#640,#641,#642));
#546=AXIS2_PLACEMENT_3D('',#643,#644,#645);
#547=EDGE_LOOP('',(#646,#647,#648,#649,#650));
#548=AXIS2_PLACEMENT_3D('',#651,#652,#653);
#549=EDGE_LOOP('',(#654,#655));
#550=EDGE_LOOP('',(#656,#657));
#551=AXIS2_PLACEMENT_3D('',#658,#659,#660);
#552=EDGE_LOOP('',(#661,#662,#663,#664));
#553=AXIS2_PLACEMENT_3D('',#665,#666,#667);
#554=EDGE_LOOP('',(#668,#669,#670,#671));
#555=AXIS2_PLACEMENT_3D('',#672,#673,#674);
#556=EDGE_LOOP('',(#675,#676,#677));
#557=AXIS2_PLACEMENT_3D('',#678,#679,#680);
#558=EDGE_LOOP('',(#681,#682,#683));
#559=AXIS2_PLACEMENT_3D('',#684,#685,#686);
#560=FILL_AREA_STYLE_COLOUR('',#687);
#561=ORIENTED_EDGE('',*,*,#688,.F.);
#562=ORIENTED_EDGE('',*,*,#59,.T.);
#563=ORIENTED_EDGE('',*,*,#61,.F.);
#564=ORIENTED_EDGE('',*,*,#63,.F.);
#565=CARTESIAN_POINT('',(0.0,0.1,1.224646799147E-14));
#566=DIRECTION('',(0.0,1.0,0.0));
#567=DIRECTION('',(-0.994469549599166,0.0,0.105025306093496));
#568=ORIENTED_EDGE('',*,*,#689,.F.);
#569=ORIENTED_EDGE('',*,*,#65,.T.);
#570=ORIENTED_EDGE('',*,*,#67,.F.);
#571=ORIENTED_EDGE('',*,*,#69,.F.);
#572=CARTESIAN_POINT('',(0.0,0.1,1.224646799147E-14));
#573=DIRECTION('',(0.0,1.0,0.0));
#574=DIRECTION('',(0.994469549599166,0.0,-0.105025306093496));
#575=ORIENTED_EDGE('',*,*,#71,.T.);
#576=ORIENTED_EDGE('',*,*,#63,.T.);
#577=ORIENTED_EDGE('',*,*,#73,.T.);
#578=ORIENTED_EDGE('',*,*,#69,.T.);
#579=CARTESIAN_POINT('',(0.0,0.0,0.0));
#580=DIRECTION('',(-0.0,1.0,0.0));
#581=DIRECTION('',(1.0,0.0,0.0));
#582=ORIENTED_EDGE('',*,*,#689,.T.);
#583=ORIENTED_EDGE('',*,*,#73,.F.);
#584=ORIENTED_EDGE('',*,*,#61,.T.);
#585=ORIENTED_EDGE('',*,*,#75,.T.);
#586=CARTESIAN_POINT('',(0.0,0.1,1.224646799147E-14));
#587=DIRECTION('',(0.0,1.0,0.0));
#588=DIRECTION('',(0.994469549599166,0.0,-0.105025306093496));
#589=ORIENTED_EDGE('',*,*,#688,.T.);
#590=ORIENTED_EDGE('',*,*,#71,.F.);
#591=ORIENTED_EDGE('',*,*,#67,.T.);
#592=ORIENTED_EDGE('',*,*,#77,.T.);
#593=CARTESIAN_POINT('',(0.0,0.1,1.224646799147E-14));
#594=DIRECTION('',(0.0,1.0,0.0));
#595=DIRECTION('',(-0.994469549599166,0.0,0.105025306093496));
#596=ORIENTED_EDGE('',*,*,#79,.T.);
#597=ORIENTED_EDGE('',*,*,#81,.F.);
#598=ORIENTED_EDGE('',*,*,#83,.F.);
#599=ORIENTED_EDGE('',*,*,#85,.T.);
#600=CARTESIAN_POINT('',(0.0,0.0,1.224646799147E-14));
#601=DIRECTION('',(0.0,-1.0,0.0));
#602=DIRECTION('',(1.0,0.0,0.0));
#603=ORIENTED_EDGE('',*,*,#87,.T.);
#604=ORIENTED_EDGE('',*,*,#89,.F.);
#605=ORIENTED_EDGE('',*,*,#91,.F.);
#606=ORIENTED_EDGE('',*,*,#59,.F.);
#607=ORIENTED_EDGE('',*,*,#77,.F.);
#608=CARTESIAN_POINT('',(0.0,0.0,1.224646799147E-14));
#609=DIRECTION('',(0.0,-1.0,0.0));
#610=DIRECTION('',(1.0,0.0,0.0));
#611=ORIENTED_EDGE('',*,*,#93,.F.);
#612=ORIENTED_EDGE('',*,*,#85,.F.);
#613=ORIENTED_EDGE('',*,*,#95,.T.);
#614=ORIENTED_EDGE('',*,*,#97,.F.);
#615=CARTESIAN_POINT('',(0.0,10.3,0.0));
#616=DIRECTION('',(-0.0,1.0,0.0));
#617=DIRECTION('',(1.0,0.0,0.0));
#618=ORIENTED_EDGE('',*,*,#97,.T.);
#619=ORIENTED_EDGE('',*,*,#99,.T.);
#620=ORIENTED_EDGE('',*,*,#101,.F.);
#621=ORIENTED_EDGE('',*,*,#103,.F.);
#622=CARTESIAN_POINT('',(0.0,10.0375,0.0));
#623=DIRECTION('',(0.0,-1.0,-0.0));
#624=DIRECTION('',(0.0,0.0,-1.0));
#625=ORIENTED_EDGE('',*,*,#105,.T.);
#626=ORIENTED_EDGE('',*,*,#99,.F.);
#627=ORIENTED_EDGE('',*,*,#95,.F.);
#628=ORIENTED_EDGE('',*,*,#103,.T.);
#629=CARTESIAN_POINT('',(0.0,10.0375,0.0));
#630=DIRECTION('',(0.0,-1.0,-0.0));
#631=DIRECTION('',(0.0,0.0,-1.0));
#632=ORIENTED_EDGE('',*,*,#107,.T.);
#633=ORIENTED_EDGE('',*,*,#89,.T.);
#634=ORIENTED_EDGE('',*,*,#101,.T.);
#635=ORIENTED_EDGE('',*,*,#105,.F.);
#636=CARTESIAN_POINT('',(0.0,10.05,0.0));
#637=DIRECTION('',(-0.0,1.0,0.0));
#638=DIRECTION('',(1.0,0.0,0.0));
#639=ORIENTED_EDGE('',*,*,#83,.T.);
#640=ORIENTED_EDGE('',*,*,#109,.F.);
#641=ORIENTED_EDGE('',*,*,#79,.F.);
#642=ORIENTED_EDGE('',*,*,#93,.T.);
#643=CARTESIAN_POINT('',(0.0,0.0,1.224646799147E-14));
#644=DIRECTION('',(0.0,-1.0,0.0));
#645=DIRECTION('',(1.0,0.0,0.0));
#646=ORIENTED_EDGE('',*,*,#91,.T.);
#647=ORIENTED_EDGE('',*,*,#107,.F.);
#648=ORIENTED_EDGE('',*,*,#87,.F.);
#649=ORIENTED_EDGE('',*,*,#65,.F.);
#650=ORIENTED_EDGE('',*,*,#75,.F.);
#651=CARTESIAN_POINT('',(0.0,0.0,1.224646799147E-14));
#652=DIRECTION('',(0.0,-1.0,0.0));
#653=DIRECTION('',(1.0,0.0,0.0));
#654=ORIENTED_EDGE('',*,*,#109,.T.);
#655=ORIENTED_EDGE('',*,*,#81,.T.);
#656=ORIENTED_EDGE('',*,*,#111,.T.);
#657=ORIENTED_EDGE('',*,*,#113,.F.);
#658=CARTESIAN_POINT('',(0.0,13.0,1.222564899589E-14));
#659=DIRECTION('',(-0.0,1.0,0.0));
#660=DIRECTION('',(1.0,0.0,0.0));
#661=ORIENTED_EDGE('',*,*,#113,.T.);
#662=ORIENTED_EDGE('',*,*,#115,.F.);
#663=ORIENTED_EDGE('',*,*,#117,.F.);
#664=ORIENTED_EDGE('',*,*,#119,.T.);
#665=CARTESIAN_POINT('',(0.0,-16.37825692801,1.222564899589E-14));
#666=DIRECTION('',(0.0,-1.0,-0.0));
#667=DIRECTION('',(0.0,0.0,-1.0));
#668=ORIENTED_EDGE('',*,*,#121,.T.);
#669=ORIENTED_EDGE('',*,*,#115,.T.);
#670=ORIENTED_EDGE('',*,*,#111,.F.);
#671=ORIENTED_EDGE('',*,*,#119,.F.);
#672=CARTESIAN_POINT('',(0.0,-16.37825692801,1.222564899589E-14));
#673=DIRECTION('',(0.0,-1.0,-0.0));
#674=DIRECTION('',(0.0,0.0,-1.0));
#675=ORIENTED_EDGE('',*,*,#123,.T.);
#676=ORIENTED_EDGE('',*,*,#121,.F.);
#677=ORIENTED_EDGE('',*,*,#125,.F.);
#678=CARTESIAN_POINT('',(0.0,16.03914438289,1.222564899589E-14));
#679=DIRECTION('',(-0.0,-1.0,0.0));
#680=DIRECTION('',(0.0,0.0,1.0));
#681=ORIENTED_EDGE('',*,*,#117,.T.);
#682=ORIENTED_EDGE('',*,*,#123,.F.);
#683=ORIENTED_EDGE('',*,*,#125,.T.);
#684=CARTESIAN_POINT('',(0.0,16.03914438289,1.222564899589E-14));
#685=DIRECTION('',(-0.0,-1.0,0.0));
#686=DIRECTION('',(0.0,0.0,1.0));
#687=COLOUR_RGB('',1.0,0.807843029499054,0.458824008703232);
#688=EDGE_CURVE('',#145,#152,#690,.T.);
#689=EDGE_CURVE('',#155,#162,#691,.T.);
#690=CIRCLE('',#692,0.1);
#691=CIRCLE('',#693,0.1);
#692=AXIS2_PLACEMENT_3D('',#694,#695,#696);
#693=AXIS2_PLACEMENT_3D('',#697,#698,#699);
#694=CARTESIAN_POINT('',(0.2386726919038,0.1,-0.0252060734624268));
#695=DIRECTION('',(-0.105025306093496,0.0,-0.994469549599166));
#696=DIRECTION('',(0.994469549599166,0.0,-0.105025306093496));
#697=CARTESIAN_POINT('',(-0.2386726919038,0.1,0.0252060734624513));
#698=DIRECTION('',(0.105025306093496,0.0,0.994469549599166));
#699=DIRECTION('',(-0.994469549599166,0.0,0.105025306093496));
ENDSEC;
END-ISO-10303-21;
