{
  "items": {
    "about": "Acerca de",
    "menu": "Menú",
    "contact": "Contáctanos",
    "restaurants": "Restaurantes"
  },
  "hero": {
    "title": "Un nuevo sabor esta en la ciudad",
    "description": "Estamos a punto de descubrir un mundo lleno de sabores y de emociones inigualables.",
    "button": "Encuentranos"
  },
  "about": {
    "title": "¿Quién es Foodies?",
    "description": "Elit irure ad nulla id elit laborum nostrud mollit irure. Velit reprehenderit sunt nulla enim aliquip duis tempor est culpa fugiat consequat culpa consectetur Lorem. Reprehenderit dolore culpa irure eiusmod minim occaecat et id minim ullamco.",
    "button": "Contáctanos",
    "image": {
      "title_1": "LA COMIDA ES",
      "title_2": "NUESTRO ARTE"
    }
  },
  "locations": {
    "title": "Estamos para ti",
    "delivery_title": "Domicilio",
    "pick_title": "Para llevar",
    "search_placeholder": "Buscar nombre o dirección",
    "error": "¡No hemos encontrado lo que buscas!"
  },
  "testimonials": [
    {
      "title": "“El mejor lugar para degustar en familia y amigos!”",
      "description": "Es el mejor lugar al que he venido con mi familia, la comida es rica, sirven rápido y te atienden de la mejor manera."
    },
    {
      "title": "“El2 mejor lugar para degustar en familia y amigos!”",
      "description": "Es el mejor lugar al que he venido con mi familia, la comida es rica, sirven rápido y te atienden de la mejor manera."
    }
  ],
  "contact": {
    "title": "Cuentanos tu experiencia",
    "title_success": "Gracias por tus comentarios",
    "description": "Don't miss out on our great offers & Receive deals from all our top restaurants via e-mail.",
    "form": {
      "name": {
        "label": "Nombre y Apellido",
        "required": "Nombre y Apellido son requeridos",
        "max": "The name must be less than 255 characters",
        "placeholder": "John Doe"
      },
      "email": {
        "label": "Correo electrónico",
        "required": "Correo Electronico es requerido",
        "invalid": "Correo Electronico es invalido",
        "max": "The name must be less than 255 characters",
        "placeholder": "j.doe@correo.com"
      },
      "message": {
        "label": "Mensaje",
        "required": "Mensaje es requerido",
        "max": "The name must be less than 255 characters",
        "placeholder": "El día de ahora mi experiencia fue..."
      }
    },
    "button_send": "Enviar comentarios",
    "button_success": "Conoce nuestro menu"
  },
  "app": {
    "title": "Obten más beneficios Descarga nuestra App",
    "items": {
      "one": {
        "title": "Solicita rápido",
        "description": "Curabitur in eleifend turpis, id vehicula odio. Donec pulvinar tellus eget magna aliquet ultricies."
      },
      "two": {
        "title": "Fácil de Usar",
        "description": "Orci varius natoque penatibus et magnis dis parturient montes, nascetur ridiculus mus."
      },
      "three": {
        "title": "Promociones especiales",
        "description": "Curabitur in eleifend turpis, id vehicula odio. Donec pulvinar tellus eget magna aliquet ultricies."
      }
    }
  },
  "footer": {
    "links": {
      "locations": "Conoce nuestras sucursales",
      "about": "Acerca de",
      "testimonials": "¿Qué hablan de nosotros?",
      "contact": "Contáctanos"
    }
  }
}
