Nombre Entidad,Suma Valores
empresa pública de hidrocarburos del ecuador ep petroecuador,188502177.9
 celec ep.,128212086.46
ministerio de educacion,110788122.77
empresa eléctrica pública estratégica corporación nacional de electricidad cnel ep,61518674.78
digmat,51740244.94
GAD  del distrito metropolitano de quito,46912472.47
