@relation 'multi-label: -c 5'

@attribute A {0,1}
@attribute D {0,1}
@attribute E {0,1}
@attribute I {0,1}
@attribute O {0,1}
@attribute abaixo numeric
@attribute abc numeric
@attribute aberto numeric
@attribute abordados numeric
@attribute abordando numeric
@attribute abordar numeric
@attribute abordassem numeric
@attribute abraco numeric
@attribute abracos numeric
@attribute abril numeric
@attribute abrir numeric
@attribute acessar numeric
@attribute acontecer numeric
@attribute acontecimentos numeric
@attribute acordo numeric
@attribute acredito numeric
@attribute afeto numeric
@attribute agride numeric
@attribute aguardo numeric
@attribute ajuda numeric
@attribute alem numeric
@attribute algo numeric
@attribute almeida numeric
@attribute alteracoes numeric
@attribute alunos numeric
@attribute amanha numeric
@attribute amor numeric
@attribute ana numeric
@attribute analise numeric
@attribute analitico numeric
@attribute analytica numeric
@attribute andrade numeric
@attribute anexa numeric
@attribute anexo numeric
@attribute anos numeric
@attribute anterior numeric
@attribute antropologia numeric
@attribute aparecida numeric
@attribute apenas numeric
@attribute aponta numeric
@attribute apontados numeric
@attribute aprendeu numeric
@attribute aprendizagem numeric
@attribute apresentada numeric
@attribute aproveitem numeric
@attribute artigo numeric
@attribute aspectos numeric
@attribute assim numeric
@attribute assistir numeric
@attribute assunto numeric
@attribute atencao numeric
@attribute atentamente numeric
@attribute atentamento numeric
@attribute atividade numeric
@attribute atividades numeric
@attribute atual numeric
@attribute autora numeric
@attribute autoridade numeric
@attribute ava numeric
@attribute avaliacao numeric
@attribute avaliativo numeric
@attribute base numeric
@attribute bastante numeric
@attribute berba numeric
@attribute bibliografia numeric
@attribute boa numeric
@attribute boas numeric
@attribute bons numeric
@attribute brasil numeric
@attribute brincar numeric
@attribute cabecalho numeric
@attribute cafe numeric
@attribute cantinho numeric
@attribute capitulo numeric
@attribute cara numeric
@attribute caro numeric
@attribute caros numeric
@attribute caso numeric
@attribute celia numeric
@attribute certeza numeric
@attribute certo numeric
@attribute ceu numeric
@attribute citacao numeric
@attribute cliquem numeric
@attribute colaborativo numeric
@attribute colcha numeric
@attribute colega numeric
@attribute colegas numeric
@attribute coletiva numeric
@attribute colocadas numeric
@attribute colocar numeric
@attribute coloco numeric
@attribute coloquem numeric
@attribute comecando numeric
@attribute comentarios numeric
@attribute comigo numeric
@attribute comparacao numeric
@attribute compartilhar numeric
@attribute componentes numeric
@attribute compreendida numeric
@attribute conceito numeric
@attribute conceitos numeric
@attribute concepcoes numeric
@attribute conclusao numeric
@attribute concorda numeric
@attribute condicoes numeric
@attribute conexao numeric
@attribute configura numeric
@attribute conforme numeric
@attribute conhecimento numeric
@attribute conhecimentos numeric
@attribute conservacao numeric
@attribute considera numeric
@attribute consideracoes numeric
@attribute consideradas numeric
@attribute considerados numeric
@attribute considerando numeric
@attribute constam numeric
@attribute constantina numeric
@attribute constituem numeric
@attribute constituicao numeric
@attribute constituir numeric
@attribute constroi numeric
@attribute construcao numeric
@attribute conta numeric
@attribute contar numeric
@attribute contato numeric
@attribute contem numeric
@attribute contexto numeric
@attribute continuar numeric
@attribute continuidade numeric
@attribute contribuicao numeric
@attribute contribuicoes numeric
@attribute contribuir numeric
@attribute conversa numeric
@attribute conversamos numeric
@attribute conversando numeric
@attribute conversar numeric
@attribute conversas numeric
@attribute converse numeric
@attribute copernicana numeric
@attribute cor numeric
@attribute correa numeric
@attribute correcao numeric
@attribute crescer numeric
@attribute crianca numeric
@attribute criativo numeric
@attribute critica numeric
@attribute cuiaba numeric
@attribute cuidado numeric
@attribute cujo numeric
@attribute cultura numeric
@attribute cultural numeric
@attribute cursista numeric
@attribute cursistas numeric
@attribute curso numeric
@attribute dar numeric
@attribute data numeric
@attribute debate numeric
@attribute dedicacao numeric
@attribute deem numeric
@attribute definicoes numeric
@attribute deixem numeric
@attribute demais numeric
@attribute desejo numeric
@attribute desmundo numeric
@attribute destinado numeric
@attribute detalhado numeric
@attribute devemos numeric
@attribute dia numeric
@attribute dialogo numeric
@attribute dias numeric
@attribute didatica numeric
@attribute diferentes numeric
@attribute dirigido numeric
@attribute disciplina numeric
@attribute discurso numeric
@attribute discussao numeric
@attribute discussoes numeric
@attribute discuta numeric
@attribute discutam numeric
@attribute discutidos numeric
@attribute discutir numeric
@attribute dispomos numeric
@attribute disponibilizadas numeric
@attribute disponibilizado numeric
@attribute disposicao numeric
@attribute disputa numeric
@attribute distancia numeric
@attribute distincao numeric
@attribute documento numeric
@attribute doutrina numeric
@attribute duas numeric
@attribute durante numeric
@attribute duvida numeric
@attribute duvidas numeric
@attribute edineia numeric
@attribute edineia  numeric
@attribute educacao numeric
@attribute educacional numeric
@attribute educadores numeric
@attribute elaboracao numeric
@attribute elaborar numeric
@attribute elabore numeric
@attribute emanuele numeric
@attribute encerrado numeric
@attribute encerrar numeric
@attribute encontrarao numeric
@attribute encontro numeric
@attribute ensino numeric
@attribute entanto numeric
@attribute entender numeric
@attribute entendido numeric
@attribute entrega numeric
@attribute entrei numeric
@attribute enunciado numeric
@attribute enviar numeric
@attribute equipe numeric
@attribute esclarecer numeric
@attribute esclarecimento numeric
@attribute escola numeric
@attribute escolha numeric
@attribute escolham numeric
@attribute escolher numeric
@attribute escolhido numeric
@attribute escrever numeric
@attribute escreverem numeric
@attribute escrita numeric
@attribute escritas numeric
@attribute espaco numeric
@attribute espera numeric
@attribute esperava numeric
@attribute espero numeric
@attribute esquecam numeric
@attribute estarei numeric
@attribute estrelado numeric
@attribute estudante numeric
@attribute estudo numeric
@attribute estudos numeric
@attribute etapa numeric
@attribute execucao numeric
@attribute exemplo numeric
@attribute experiencia numeric
@attribute experiencias numeric
@attribute e jordana numeric
@attribute faca numeric
@attribute facam numeric
@attribute facebook numeric
@attribute facil numeric
@attribute facilitar numeric
@attribute facto numeric
@attribute faggion numeric
@attribute familia numeric
@attribute familiares numeric
@attribute familias numeric
@attribute fasciculo numeric
@attribute favor numeric
@attribute fazem numeric
@attribute fazemos numeric
@attribute feminino numeric
@attribute fenomeno numeric
@attribute ferramenta numeric
@attribute fica numeric
@attribute ficar numeric
@attribute ficara numeric
@attribute filha numeric
@attribute filhos numeric
@attribute filme numeric
@attribute filosofia numeric
@attribute final numeric
@attribute finalidade numeric
@attribute fique numeric
@attribute fizer numeric
@attribute fizeram numeric
@attribute fontes numeric
@attribute forem numeric
@attribute forma numeric
@attribute formacao numeric
@attribute formada numeric
@attribute formas numeric
@attribute formatacao numeric
@attribute formato numeric
@attribute formem numeric
@attribute forte numeric
@attribute forum numeric
@attribute frederico numeric
@attribute fundamentais numeric
@attribute genero numeric
@attribute generos numeric
@attribute geral numeric
@attribute gisele numeric
@attribute glossario numeric
@attribute gostaria numeric
@attribute grupo numeric
@attribute grupos numeric
@attribute guia numeric
@attribute guyer numeric
@attribute haja numeric
@attribute heidegger numeric
@attribute historia numeric
@attribute historico numeric
@attribute hoje numeric
@attribute hora numeric
@attribute http numeric
@attribute humana numeric
@attribute humano numeric
@attribute ideal numeric
@attribute ideia numeric
@attribute ideias numeric
@attribute identidades numeric
@attribute iii numeric
@attribute imagem numeric
@attribute imagens numeric
@attribute imaginacao numeric
@attribute importancia numeric
@attribute importante numeric
@attribute importantes numeric
@attribute imprescindivel numeric
@attribute impressoes numeric
@attribute indicacao numeric
@attribute indicada numeric
@attribute indicadas numeric
@attribute indicado numeric
@attribute individual numeric
@attribute infancia numeric
@attribute infantil numeric
@attribute infelizmente numeric
@attribute informar numeric
@attribute inicia numeric
@attribute inicial numeric
@attribute insercoes numeric
@attribute inseridas numeric
@attribute inserir numeric
@attribute instituicao numeric
@attribute instituicoes numeric
@attribute instrucoes numeric
@attribute interessante numeric
@attribute internet numeric
@attribute introducao numeric
@attribute introduzir numeric
@attribute irao numeric
@attribute jbbii numeric
@attribute joima numeric
@attribute juizos numeric
@attribute kant numeric
@attribute kantiana numeric
@attribute kantiano numeric
@attribute karinne numeric
@attribute las numeric
@attribute lei numeric
@attribute leiam numeric
@attribute leitura numeric
@attribute leituras numeric
@attribute lembrando numeric
@attribute lembrar numeric
@attribute lembre numeric
@attribute lembrem numeric
@attribute ler numeric
@attribute letras numeric
@attribute liberdade numeric
@attribute link numeric
@attribute livia numeric
@attribute local numeric
@attribute los numeric
@attribute lucia numeric
@attribute lucimara numeric
@attribute mail numeric
@attribute mal numeric
@attribute marcantes numeric
@attribute marcelo numeric
@attribute marcia numeric
@attribute marlyson numeric
@attribute martins numeric
@attribute masculino numeric
@attribute material numeric
@attribute matrimonio numeric
@attribute memoria numeric
@attribute memorial numeric
@attribute meninas numeric
@attribute menos numeric
@attribute mensagem numeric
@attribute modelo numeric
@attribute moderna numeric
@attribute moderno numeric
@attribute momento numeric
@attribute momentos numeric
@attribute moral numeric
@attribute moralidade numeric
@attribute mulher numeric
@attribute multiplicidade numeric
@attribute narracao numeric
@attribute narrativa numeric
@attribute necessarias numeric
@attribute necessario numeric
@attribute negligencia numeric
@attribute neiva numeric
@attribute nesse numeric
@attribute neste numeric
@attribute noite numeric
@attribute normal numeric
@attribute normas numeric
@attribute norte numeric
@attribute nota numeric
@attribute nova numeric
@attribute novos numeric
@attribute nuclear numeric
@attribute objetivos numeric
@attribute objeto numeric
@attribute obra numeric
@attribute obrigada numeric
@attribute obrigatoria numeric
@attribute observem numeric
@attribute ola numeric
@attribute olhares numeric
@attribute oportunidade numeric
@attribute organizacao numeric
@attribute organizacoes numeric
@attribute organizar numeric
@attribute orientacao numeric
@attribute orientacoes numeric
@attribute otimo numeric
@attribute oxqe numeric
@attribute padrao numeric
@attribute pagina numeric
@attribute palavras numeric
@attribute palestra numeric
@attribute papel numeric
@attribute partes numeric
@attribute participacao numeric
@attribute participacoes numeric
@attribute participante numeric
@attribute participar numeric
@attribute participarem numeric
@attribute participem numeric
@attribute partir numeric
@attribute paulo numeric
@attribute pdf numeric
@attribute pedagogia numeric
@attribute pedagogicas numeric
@attribute pede numeric
@attribute penalidades numeric
@attribute pensamento numeric
@attribute pensando numeric
@attribute pensar numeric
@attribute penso numeric
@attribute percebo numeric
@attribute percurso numeric
@attribute periodo numeric
@attribute pertinentes numeric
@attribute pessoa numeric
@attribute pessoal numeric
@attribute php numeric
@attribute podem numeric
@attribute podemos numeric
@attribute poderao numeric
@attribute poderiamos numeric
@attribute ponto numeric
@attribute pontos numeric
@attribute portanto numeric
@attribute possa numeric
@attribute possam numeric
@attribute possamos numeric
@attribute possibilidade numeric
@attribute possiveis numeric
@attribute possivel numeric
@attribute posta numeric
@attribute postadas numeric
@attribute postagens numeric
@attribute postando numeric
@attribute postar numeric
@attribute postem numeric
@attribute pra numeric
@attribute pratica numeric
@attribute praticas numeric
@attribute prazo numeric
@attribute precisarem numeric
@attribute preciso numeric
@attribute prezados numeric
@attribute primeira numeric
@attribute principais numeric
@attribute principios numeric
@attribute priori numeric
@attribute processo numeric
@attribute producao numeric
@attribute produtiva numeric
@attribute produzirem numeric
@attribute professor numeric
@attribute professora numeric
@attribute profissional numeric
@attribute pronto numeric
@attribute proposicoes numeric
@attribute proposta numeric
@attribute proposto numeric
@attribute pura numeric
@attribute quadro numeric
@attribute quero numeric
@attribute questao numeric
@attribute questoes numeric
@attribute rapido numeric
@attribute razao numeric
@attribute realizacao numeric
@attribute realizada numeric
@attribute realizar numeric
@attribute realizem numeric
@attribute realmente numeric
@attribute recordacao numeric
@attribute recurso numeric
@attribute rede numeric
@attribute referencia numeric
@attribute referencias numeric
@attribute referentes numeric
@attribute reflexoes numeric
@attribute relacao numeric
@attribute relacoes numeric
@attribute relatando numeric
@attribute relator numeric
@attribute relevancia numeric
@attribute repetir numeric
@attribute representacao numeric
@attribute representacoes numeric
@attribute respeito numeric
@attribute respondendo numeric
@attribute responder numeric
@attribute resposta numeric
@attribute respostas numeric
@attribute retomar numeric
@attribute retornar numeric
@attribute retorno numeric
@attribute revolucao numeric
@attribute roberto numeric
@attribute rut numeric
@attribute saberes numeric
@attribute sala numeric
@attribute salva numeric
@attribute sanar numeric
@attribute segue numeric
@attribute seguindo numeric
@attribute seguinte numeric
@attribute seguintes numeric
@attribute seguir numeric
@attribute segundo numeric
@attribute selecionadas numeric
@attribute semana numeric
@attribute semanas numeric
@attribute sensibilidade numeric
@attribute sentido numeric
@attribute sentimento numeric
@attribute sequencia numeric
@attribute serem numeric
@attribute serve numeric
@attribute sigam numeric
@attribute significa numeric
@attribute silvana numeric
@attribute sim numeric
@attribute sintam numeric
@attribute sinteticos numeric
@attribute situacao numeric
@attribute social numeric
@attribute socializar numeric
@attribute sociedade numeric
@attribute solicitacao numeric
@attribute solicito numeric
@attribute solidariedade numeric
@attribute sou numeric
@attribute studia numeric
@attribute sucesso numeric
@attribute suficiente numeric
@attribute sugeridos numeric
@attribute sugestao numeric
@attribute tanto numeric
@attribute tao numeric
@attribute tarde numeric
@attribute tarefa numeric
@attribute tbem numeric
@attribute tema numeric
@attribute temas numeric
@attribute temos numeric
@attribute tenham numeric
@attribute teoria numeric
@attribute teorica numeric
@attribute tera numeric
@attribute teremos numeric
@attribute termos numeric
@attribute texto numeric
@attribute textos numeric
@attribute tipos numeric
@attribute tiverem numeric
@attribute topico numeric
@attribute topicos numeric
@attribute trabalhados numeric
@attribute tracos numeric
@attribute tradicional numeric
@attribute traducao numeric
@attribute transcendental numeric
@attribute tres numeric
@attribute trocas numeric
@attribute turma numeric
@attribute tutor numeric
@attribute tutora numeric
@attribute tutoria numeric
@attribute ufla numeric
@attribute ufrj numeric
@attribute unicamp numeric
@attribute universais numeric
@attribute usem numeric
@attribute utilizando numeric
@attribute utilizar numeric
@attribute utilizem numeric
@attribute vai numeric
@attribute vale numeric
@attribute vamos numeric
@attribute varios numeric
@attribute venho numeric
@attribute verbetes numeric
@attribute versao numeric
@attribute vezes numeric
@attribute via numeric
@attribute vida numeric
@attribute video numeric
@attribute vindos numeric
@attribute violencia numeric
@attribute vista numeric
@attribute vivenciado numeric
@attribute voces numeric
@attribute volta numeric
@attribute vontade numeric
@attribute wenderson numeric
@attribute wiki numeric
@attribute wildes numeric
@attribute www numeric
@attribute xavier numeric
@attribute  para numeric
@attribute  por numeric
@attribute  qual numeric
@attribute             numeric
@attribute abre numeric
@attribute abs numeric
@attribute acesso numeric
@attribute acham numeric
@attribute achei numeric
@attribute agradeco numeric
@attribute agua numeric
@attribute ajudar numeric
@attribute ajude numeric
@attribute aluna numeric
@attribute aluno numeric
@attribute andrea numeric
@attribute ano numeric
@attribute anteriores numeric
@attribute anteriormente numeric
@attribute aparece numeric
@attribute aparecem numeric
@attribute aplicacao numeric
@attribute aplicado numeric
@attribute aplicar numeric
@attribute arquiteto numeric
@attribute arquivos numeric
@attribute att numeric
@attribute atuais numeric
@attribute aula numeric
@attribute autor numeric
@attribute autorizacao numeric
@attribute barbosa numeric
@attribute bia numeric
@attribute brahe numeric
@attribute carla numeric
@attribute casa numeric
@attribute celeste numeric
@attribute centro numeric
@attribute cepe numeric
@attribute certa numeric
@attribute certamente numeric
@attribute chagas numeric
@attribute chance numeric
@attribute cidade numeric
@attribute ciencia numeric
@attribute cientifica numeric
@attribute clara numeric
@attribute clarice numeric
@attribute claro numeric
@attribute colocacao numeric
@attribute coluna numeric
@attribute comecar numeric
@attribute computador numeric
@attribute comum numeric
@attribute confusa numeric
@attribute consegui numeric
@attribute conseguimos numeric
@attribute conseguir numeric
@attribute conseguiu numeric
@attribute consequentemente numeric
@attribute considerado numeric
@attribute consigo numeric
@attribute construida numeric
@attribute construir numeric
@attribute conteudo numeric
@attribute contradicao numeric
@attribute corpo numeric
@attribute correto numeric
@attribute costume numeric
@attribute criador numeric
@attribute curriculo numeric
@attribute dado numeric
@attribute deducao numeric
@attribute deixar numeric
@attribute descoberta numeric
@attribute desvelar numeric
@attribute desvio numeric
@attribute deu numeric
@attribute deus numeric
@attribute devido numeric
@attribute devo numeric
@attribute diante numeric
@attribute diferente numeric
@attribute dificil numeric
@attribute edilaine numeric
@attribute eliane numeric
@attribute empirica numeric
@attribute encontrei numeric
@attribute ente numeric
@attribute entendi numeric
@attribute entendimento numeric
@attribute entendo numeric
@attribute entrar numeric
@attribute entrelacam numeric
@attribute envia numeric
@attribute enviei numeric
@attribute enviou numeric
@attribute epoca numeric
@attribute equacao numeric
@attribute equacoes numeric
@attribute erro numeric
@attribute escolas numeric
@attribute escrito numeric
@attribute esqueci numeric
@attribute estagio numeric
@attribute estar numeric
@attribute estaria numeric
@attribute estudar numeric
@attribute etica numeric
@attribute evolucao numeric
@attribute exatamente numeric
@attribute excerto numeric
@attribute exemplos numeric
@attribute existe numeric
@attribute existencia numeric
@attribute existente numeric
@attribute explicasse numeric
@attribute exposicao numeric
@attribute fala numeric
@attribute falando numeric
@attribute falar numeric
@attribute falta numeric
@attribute fato numeric
@attribute fatos numeric
@attribute fazermos numeric
@attribute feira numeric
@attribute felicidade numeric
@attribute ferias numeric
@attribute filosofo numeric
@attribute filosofos numeric
@attribute fiquei numeric
@attribute floresta numeric
@attribute fotos numeric
@attribute fundadores numeric
@attribute geneiza numeric
@attribute gentileza numeric
@attribute giliard numeric
@attribute grafica numeric
@attribute grata numeric
@attribute grato numeric
@attribute hamilton numeric
@attribute haver numeric
@attribute havia numeric
@attribute helena numeric
@attribute homem numeric
@attribute hume numeric
@attribute iara numeric
@attribute impossivel numeric
@attribute impressao numeric
@attribute inducao numeric
@attribute informatica numeric
@attribute interior numeric
@attribute intuicoes numeric
@attribute itamonte numeric
@attribute jose numeric
@attribute katia numeric
@attribute kepler numeric
@attribute legal numeric
@attribute lido numeric
@attribute limite numeric
@attribute literatura numeric
@attribute livro numeric
@attribute locke numeric
@attribute logica numeric
@attribute login numeric
@attribute logo numeric
@attribute luz numeric
@attribute maio numeric
@attribute manda numeric
@attribute manter numeric
@attribute mao numeric
@attribute marco numeric
@attribute maria numeric
@attribute maricilia numeric
@attribute materia numeric
@attribute medicoes numeric
@attribute meio numeric
@attribute melhor numeric
@attribute mente numeric
@attribute mim numeric
@attribute mudanca numeric
@attribute mundo numeric
@attribute natureza numeric
@attribute netuno numeric
@attribute newton numeric
@attribute notas numeric
@attribute objetos numeric
@attribute obrigado numeric
@attribute observacao numeric
@attribute observacoes numeric
@attribute oculta numeric
@attribute ocultismo numeric
@attribute oculto numeric
@attribute ordem numeric
@attribute orientar numeric
@attribute pais numeric
@attribute paradigma numeric
@attribute paralelo numeric
@attribute parece numeric
@attribute parecido numeric
@attribute partida numeric
@attribute passou numeric
@attribute paula numeric
@attribute peco numeric
@attribute penalidade numeric
@attribute pensador numeric
@attribute pensadores numeric
@attribute pensei numeric
@attribute pergunta numeric
@attribute pergunto numeric
@attribute permite numeric
@attribute pesquisa numeric
@attribute planejamento numeric
@attribute planeta numeric
@attribute planetas numeric
@attribute platao numeric
@attribute polo numeric
@attribute pontuacao numeric
@attribute popper numeric
@attribute posicao numeric
@attribute postagem numeric
@attribute postei numeric
@attribute poster numeric
@attribute posteriori numeric
@attribute posteriormente numeric
@attribute postou numeric
@attribute potencialidade numeric
@attribute pratico numeric
@attribute presenca numeric
@attribute presencial numeric
@attribute prevista numeric
@attribute primeiramente numeric
@attribute problema numeric
@attribute problemas numeric
@attribute proceder numeric
@attribute procedimento numeric
@attribute professores numeric
@attribute projeto numeric
@attribute prova numeric
@attribute provas numeric
@attribute provindo numeric
@attribute proximas numeric
@attribute proximo numeric
@attribute pude numeric
@attribute puder numeric
@attribute qualidade numeric
@attribute quantidade numeric
@attribute queria numeric
@attribute questionamento numeric
@attribute questionamentos numeric
@attribute questionario numeric
@attribute quis numeric
@attribute ramalho numeric
@attribute real numeric
@attribute recebeu numeric
@attribute recebi numeric
@attribute receio numeric
@attribute recomendacao numeric
@attribute referente numeric
@attribute reflexao numeric
@attribute regente numeric
@attribute regras numeric
@attribute representativa numeric
@attribute resolucao numeric
@attribute responsavel numeric
@attribute resultado numeric
@attribute resumida numeric
@attribute rosana numeric
@attribute rsrs numeric
@attribute rubens numeric
@attribute sabado numeric
@attribute sabemos numeric
@attribute sampaio numeric
@attribute santana numeric
@attribute secretaria numeric
@attribute segunda numeric
@attribute sei numeric
@attribute senha numeric
@attribute senhor numeric
@attribute seria numeric
@attribute sete numeric
@attribute simoes numeric
@attribute simone numeric
@attribute sinal numeric
@attribute sintese numeric
@attribute sintetico numeric
@attribute solicitar numeric
@attribute sousa numeric
@attribute sugere numeric
@attribute sujeito numeric
@attribute tarefas numeric
@attribute tela numeric
@attribute telescopios numeric
@attribute tendencias numeric
@attribute tentando numeric
@attribute tentativa numeric
@attribute terei numeric
@attribute teria numeric
@attribute trabalha numeric
@attribute trabalhos numeric
@attribute tracada numeric
@attribute trajetoria numeric
@attribute trata numeric
@attribute traz numeric
@attribute tycho numeric
@attribute unidade numeric
@attribute urano numeric
@attribute varia numeric
@attribute vem numeric
@attribute vemos numeric
@attribute verificar numeric
@attribute veronica numeric
@attribute visual numeric
@attribute visualizacao numeric
@attribute visualizar numeric
@attribute vou numeric
@attribute xicara numeric
@attribute yoga numeric

@data
{0 1, 70 1,72 1,200 1,239 1,243 1,358 1,376 1,417 1,455 1,475 1,480 1,547 1,591 1}
{0 1, 7 1,27 1,35 1,40 1,42 1,51 1,58 1,69 1,78 1,80 1,85 1,86 1,101 1,114 1,121 1,133 1,152 1,155 1,158 1,176 1,178 1,182 1,187 1,196 1,198 1,206 1,240 1,242 1,250 1,255 1,256 1,273 1,279 1,291 1,300 1,301 1,313 1,322 1,325 1,335 1,343 1,349 1,350 1,351 1,354 1,363 1,364 1,377 1,384 1,388 1,391 1,392 1,408 1,411 1,432 1,439 1,440 1,446 1,462 1,477 1,485 1,486 1,489 1,495 1,498 1,504 1,545 1,546 1,547 1,550 1,554 1,569 1,584 1,594 1,599 1,608 1,614 1,621 1}
{0 1, 7 1,27 1,35 1,40 1,42 1,51 1,58 1,69 1,70 1,72 1,78 1,80 1,85 1,86 1,101 1,114 1,121 1,133 1,152 1,155 1,158 1,176 1,178 1,182 1,187 1,196 1,198 1,206 1,240 1,242 1,243 1,250 1,255 1,256 1,273 1,279 1,291 1,300 1,301 1,313 1,322 1,325 1,335 1,343 1,349 1,350 1,351 1,354 1,363 1,364 1,376 1,377 1,384 1,388 1,391 1,392 1,408 1,411 1,432 1,439 1,440 1,446 1,462 1,477 1,485 1,486 1,489 1,495 1,498 1,504 1,545 1,546 1,547 1,550 1,554 1,569 1,584 1,594 1,599 1,608 1,614 1,621 1}
{4 1, 371 1}
{0 1, 13 1,52 1,70 1,71 1,131 1,183 1,209 1,219 1,376 1,491 1,528 1,531 1,534 1,573 1,576 1,628 1}
{0 1, 2 1, 13 1,52 1,70 1,92 1,99 1,131 1,149 1,182 1,197 1,209 1,215 1,219 1,220 1,289 1,320 1,376 1,403 1,457 1,472 1,474 1,491 1,534 1,550 1,573 1,628 1,805 1}
{2 1, 4 1, 13 1,43 1,70 1,98 1,163 1,183 1,210 1,237 1,289 1,364 1,376 1,391 1,486 1,550 1,925 1}
{0 1, 4 1, 33 1,55 1,58 1,70 1,80 1,82 1,105 1,152 1,158 1,186 1,200 1,243 1,265 1,303 1,310 1,312 1,365 1,387 1,413 1,448 1,462 1,464 1,492 1,496 1,513 1,543 1,583 1,593 1,596 1,597 1,602 1,607 1,614 1,629 1,694 1,710 1,817 1}
{0 1, 58 1,72 1,159 1,200 1,243 1,289 1,358 1,515 1,547 1}
{0 1, 14 1,33 1,51 1,58 1,80 1,110 1,114 1,145 1,152 1,157 1,158 1,186 1,194 1,196 1,234 1,273 1,284 1,343 1,348 1,349 1,402 1,412 1,431 1,462 1,467 1,468 1,483 1,486 1,498 1,501 1,504 1,513 1,533 1,543 1,549 1,560 1,598 1,614 1,726 1,842 1,911 1}
{0 1, 34 1,38 1,70 1,71 1,106 1,114 1,145 1,194 1,234 1,243 1,265 1,284 1,357 1,486 1,533 1,549 1,553 1,576 1,583 1,598 1,921 1}
{0 1, 3 1, 6 1,30 1,85 1,111 1,114 1,139 1,142 1,160 1,174 1,188 1,213 1,239 1,253 1,303 1,307 1,311 1,342 1,372 1,403 1,458 1,460 1,476 1,501 1,511 1,537 1,547 1,578 1,579 1,611 1,623 1,629 1,689 1,692 1,846 1}
{0 1, 38 1,71 1,174 1,294 1,303 1,357 1,413 1,423 1,554 1,578 1,579 1,606 1,634 1,797 1}
{0 1, 6 1,54 1,70 1,72 1,221 1,243 1,286 1,303 1,316 1,371 1,375 1,441 1,576 1,588 1,597 1,619 1,813 1}
{0 1, 13 1,29 1,56 1,81 1,179 1,208 1,221 1,238 1,242 1,362 1,386 1,401 1,422 1,424 1,427 1,588 1}
{0 1, 13 1,29 1,58 1,81 1,134 1,211 1,401 1,459 1,547 1,592 1,615 1,628 1,632 1}
{4 1, 13 1,29 1,134 1,296 1,417 1,475 1,547 1,615 1,618 1}
{4 1, 13 1,26 1,29 1,81 1,237 1,262 1,346 1,385 1,390 1,417 1,429 1,461 1,615 1,624 1,628 1,630 1,714 1,836 1}
{0 1, 13 1,140 1,180 1,234 1,417 1,559 1,630 1}
{3 1, 43 1,58 1,84 1,164 1,174 1,183 1,197 1,274 1,276 1,289 1,298 1,320 1,438 1,455 1,570 1,615 1}
{2 1, 12 1,58 1,221 1,226 1,286 1,289 1,298 1,358 1,425 1,427 1,494 1,520 1,588 1,601 1,609 1,628 1,700 1,900 1}
{0 1, 1 1, 12 1,43 1,70 1,183 1,289 1,341 1,359 1,376 1,403 1,497 1,579 1,883 1}
{0 1, 4 1, 12 1,99 1,120 1,135 1,161 1,174 1,199 1,217 1,239 1,296 1,358 1,417 1,439 1,455 1,547 1,615 1,618 1,812 1}
{1 1, 5 1,33 1,40 1,55 1,58 1,70 1,74 1,108 1,109 1,110 1,150 1,173 1,179 1,180 1,195 1,200 1,203 1,205 1,206 1,208 1,220 1,242 1,260 1,281 1,289 1,292 1,294 1,327 1,356 1,386 1,403 1,428 1,442 1,443 1,444 1,476 1,478 1,481 1,492 1,499 1,501 1,502 1,507 1,517 1,525 1,527 1,529 1,541 1,542 1,543 1,544 1,585 1,588 1,605 1,633 1}
{2 1, 13 1,48 1,106 1,108 1,179 1,207 1,242 1,313 1,398 1,444 1,499 1,501 1,525 1,526 1,633 1,665 1}
{2 1, 5 1,13 1,14 1,30 1,44 1,58 1,59 1,63 1,75 1,81 1,159 1,160 1,162 1,174 1,179 1,195 1,200 1,218 1,242 1,281 1,289 1,404 1,407 1,408 1,423 1,424 1,445 1,459 1,463 1,467 1,479 1,499 1,542 1,547 1,585 1,632 1,633 1,655 1,674 1,840 1}
{0 1, 13 1,58 1,89 1,141 1,143 1,166 1,200 1,206 1,289 1,299 1,475 1,588 1,632 1,633 1}
{4 1, 210 1,289 1,376 1}
{0 1, 38 1,41 1,46 1,52 1,58 1,79 1,128 1,151 1,158 1,204 1,206 1,207 1,216 1,250 1,267 1,281 1,289 1,294 1,298 1,315 1,317 1,319 1,364 1,402 1,448 1,454 1,470 1,484 1,487 1,488 1,496 1,499 1,575 1,595 1,623 1,920 1,938 1}
{0 1, 3 1, 8 1,13 1,23 1,41 1,70 1,93 1,106 1,114 1,128 1,137 1,143 1,151 1,183 1,198 1,224 1,226 1,234 1,282 1,286 1,298 1,304 1,307 1,309 1,315 1,318 1,402 1,417 1,439 1,452 1,453 1,462 1,484 1,487 1,488 1,516 1,530 1,562 1,574 1,579 1,609 1,612 1,615 1,628 1,947 1}
{4 1, 191 1,414 1,494 1,623 1}
{3 1, 4 1, 13 1,52 1,72 1,95 1,102 1,114 1,130 1,247 1,268 1,298 1,312 1,317 1,374 1,417 1,447 1,458 1,516 1,591 1,613 1,622 1,623 1,628 1,643 1,688 1,793 1}
{0 1, 2 1, 13 1,55 1,56 1,58 1,91 1,99 1,105 1,174 1,176 1,180 1,199 1,200 1,217 1,220 1,223 1,226 1,229 1,239 1,296 1,355 1,361 1,417 1,425 1,439 1,455 1,461 1,465 1,517 1,522 1,547 1}
{1 1, 3 1, 12 1,20 1,52 1,58 1,70 1,82 1,106 1,180 1,198 1,199 1,246 1,253 1,254 1,267 1,296 1,375 1,403 1,449 1,469 1,470 1,474 1,517 1,547 1,558 1,573 1,620 1,863 1,915 1}
{0 1, 58 1,228 1,234 1,261 1,299 1,601 1,615 1,628 1}
{0 1, 13 1,52 1,58 1,84 1,176 1,183 1,198 1,200 1,289 1,320 1,358 1,362 1,379 1,384 1,433 1,436 1,455 1,472 1,497 1,547 1,599 1,613 1,615 1,628 1}
{0 1, 12 1,58 1,137 1,141 1,159 1,161 1,200 1,238 1,289 1,294 1,362 1,384 1,417 1,424 1,434 1,497 1,547 1,557 1,579 1,599 1,615 1,628 1}
{0 1, 4 1, 40 1,58 1,85 1,92 1,103 1,159 1,178 1,180 1,227 1,299 1,320 1,409 1,417 1,419 1,557 1,582 1,615 1,628 1}
{0 1, 40 1,56 1,58 1,75 1,92 1,100 1,106 1,132 1,180 1,238 1,278 1,296 1,344 1,345 1,355 1,409 1,417 1,455 1,480 1,522 1,547 1,557 1,587 1}
{0 1, 4 1, 17 1,58 1,143 1,146 1,185 1,187 1,200 1,206 1,234 1,269 1,289 1,298 1,313 1,383 1,402 1,417 1,505 1,520 1,557 1,580 1,588 1,592 1,600 1,628 1,632 1}
{0 1, 3 1, 40 1,58 1,92 1,105 1,106 1,166 1,199 1,200 1,224 1,229 1,278 1,289 1,296 1,337 1,345 1,360 1,368 1,383 1,401 1,417 1,457 1,547 1,565 1,587 1,611 1,628 1}
{0 1, 36 1,58 1,92 1,97 1,106 1,141 1,163 1,198 1,200 1,260 1,289 1,298 1,313 1,325 1,353 1,356 1,383 1,417 1,436 1,472 1,481 1,487 1,502 1,527 1,547 1,557 1,615 1,628 1}
{0 1, 36 1,40 1,74 1,89 1,90 1,136 1,141 1,158 1,180 1,200 1,204 1,206 1,247 1,260 1,266 1,276 1,299 1,316 1,356 1,417 1,455 1,496 1,525 1,557 1,588 1,615 1,622 1,628 1}
{0 1, 4 1, 12 1,47 1,70 1,100 1,132 1,164 1,244 1,346 1,417 1,455 1,480 1,547 1,557 1,624 1}
{4 1, 12 1,52 1,149 1,268 1,414 1,500 1,567 1}
{4 1, 77 1,417 1,458 1,615 1}
{0 1, 3 1, 36 1,53 1,55 1,74 1,92 1,106 1,150 1,158 1,163 1,175 1,183 1,184 1,198 1,214 1,248 1,260 1,289 1,327 1,356 1,364 1,384 1,436 1,439 1,467 1,472 1,477 1,501 1,507 1,511 1,542 1,547 1,561 1,562 1,588 1,599 1,749 1}
{0 1, 2 1, 4 1, 53 1,63 1,73 1,79 1,92 1,106 1,121 1,126 1,128 1,158 1,170 1,184 1,190 1,257 1,259 1,270 1,272 1,311 1,320 1,327 1,329 1,342 1,356 1,386 1,410 1,525 1,542 1,551 1,635 1}
{0 1, 2 1, 12 1,25 1,44 1,61 1,72 1,106 1,118 1,125 1,135 1,137 1,163 1,168 1,170 1,182 1,183 1,186 1,193 1,243 1,257 1,270 1,272 1,298 1,320 1,321 1,324 1,329 1,356 1,370 1,387 1,388 1,417 1,418 1,439 1,502 1,518 1,547 1,551 1,553 1,579 1,581 1,588 1,603 1,635 1}
{0 1, 2 1, 4 1, 12 1,50 1,56 1,58 1,75 1,81 1,82 1,100 1,122 1,132 1,147 1,159 1,193 1,200 1,234 1,257 1,289 1,327 1,336 1,355 1,370 1,386 1,402 1,417 1,424 1,442 1,505 1,525 1,547 1,555 1,577 1,579 1,588 1,603 1}
{3 1, 13 1,50 1,252 1,308 1,365 1,441 1,455 1,456 1,588 1,613 1,634 1}
{4 1, 25 1,49 1,61 1,147 1,252 1,308 1,365 1,455 1,456 1,468 1,607 1,616 1,631 1,634 1,661 1}
{0 1, 2 1, 12 1,15 1,16 1,81 1,82 1,88 1,159 1,191 1,193 1,199 1,261 1,365 1,370 1,417 1,428 1,441 1,464 1,517 1,538 1,577 1,582 1,588 1,603 1,628 1,642 1,691 1,868 1}
{0 1, 12 1,56 1,58 1,75 1,81 1,82 1,100 1,113 1,122 1,132 1,159 1,170 1,193 1,200 1,234 1,272 1,289 1,324 1,326 1,336 1,355 1,356 1,370 1,402 1,417 1,424 1,505 1,508 1,525 1,547 1,577 1,579 1,588 1,603 1}
{4 1, 68 1,170 1,272 1,308 1,365 1,426 1}
{4 1, 12 1,102 1,193 1,365 1,370 1,414 1,417 1,603 1,631 1}
{0 1, 1 1, 2 1, 4 1, 24 1,61 1,66 1,79 1,92 1,104 1,105 1,106 1,107 1,139 1,158 1,181 1,183 1,184 1,257 1,260 1,270 1,311 1,356 1,360 1,386 1,398 1,439 1,502 1,516 1,517 1,523 1,525 1,527 1,543 1,588 1,601 1,635 1,699 1,830 1,886 1}
{0 1, 4 1, 12 1,23 1,61 1,70 1,105 1,106 1,119 1,125 1,169 1,180 1,182 1,193 1,204 1,257 1,258 1,259 1,270 1,298 1,313 1,321 1,338 1,370 1,394 1,417 1,418 1,421 1,433 1,468 1,496 1,502 1,524 1,547 1,553 1,603 1,635 1,695 1}
{3 1, 4 1, 19 1,83 1,123 1,150 1,153 1,203 1,257 1,270 1,304 1,330 1,338 1,412 1,420 1,460 1,463 1,513 1,524 1,558 1,562 1,635 1,675 1}
{0 1, 19 1,21 1,48 1,70 1,112 1,180 1,192 1,213 1,234 1,257 1,264 1,292 1,293 1,298 1,314 1,334 1,367 1,378 1,399 1,518 1,576 1,625 1,865 1}
{3 1, 4 1, 113 1,131 1,156 1,257 1,282 1,298 1,310 1,320 1,338 1,366 1,386 1,449 1,483 1,558 1}
{0 1, 3 1, 20 1,25 1,31 1,39 1,129 1,178 1,180 1,203 1,215 1,225 1,248 1,253 1,257 1,258 1,259 1,283 1,302 1,306 1,307 1,320 1,333 1,334 1,338 1,341 1,380 1,386 1,394 1,410 1,417 1,447 1,450 1,455 1,463 1,481 1,483 1,501 1,524 1,527 1,529 1,581 1,588 1,622 1,637 1,884 1,944 1}
{0 1, 12 1,55 1,58 1,67 1,171 1,200 1,212 1,220 1,245 1,289 1,295 1,355 1,397 1,417 1,424 1,455 1,539 1,547 1}
{3 1, 4 1, 12 1,174 1,347 1,417 1,493 1,521 1,561 1,622 1,718 1,756 1,758 1}
{0 1, 12 1,58 1,67 1,84 1,128 1,176 1,282 1,382 1,417 1,455 1,547 1,615 1,628 1,912 1}
{0 1, 4 1, 12 1,67 1,70 1,72 1,159 1,164 1,180 1,243 1,417 1,547 1}
{4 1, 12 1}
{4 1, 13 1,414 1,615 1}
{0 1, 12 1,59 1,98 1,128 1,180 1,282 1,382 1,417 1,419 1,439 1,455 1,547 1,622 1}
{0 1, 12 1,55 1,58 1,67 1,171 1,200 1,212 1,220 1,245 1,289 1,295 1,355 1,397 1,417 1,424 1,455 1,539 1}
{1 1, 92 1,106 1,144 1,222 1,223 1,261 1,282 1,381 1,382 1,414 1,572 1,589 1,626 1}
{2 1, 95 1,247 1,295 1,352 1,402 1,417 1,481 1,513 1,519 1,577 1,588 1}
{2 1, 3 1, 12 1,87 1,95 1,277 1,295 1,352 1,398 1,417 1,514 1,558 1,588 1}
{0 1, 4 1, 12 1,55 1,58 1,67 1,171 1,200 1,212 1,220 1,245 1,282 1,289 1,295 1,355 1,382 1,397 1,417 1,424 1,455 1,539 1,547 1,628 1,684 1}
{1 1, 58 1,532 1,586 1,760 1,823 1}
{1 1, 4 1, 28 1,40 1,58 1,414 1,483 1,547 1}
{1 1, 3 1, 13 1,19 1,130 1,230 1,295 1,373 1,481 1,493 1,535 1,622 1}
{4 1, 12 1,117 1,230 1,373 1,417 1,493 1,521 1,535 1,622 1,759 1}
{4 1, 58 1,297 1,525 1}
{0 1, 2 1, 4 1, 43 1,51 1,92 1,106 1,139 1,144 1,158 1,175 1,182 1,216 1,222 1,248 1,282 1,304 1,357 1,381 1,382 1,417 1,429 1,433 1,463 1,464 1,487 1,507 1,547 1,571 1,572 1,589 1,614 1,626 1,687 1,814 1}
{3 1, 18 1,26 1,51 1,54 1,127 1,135 1,161 1,169 1,181 1,304 1,341 1,347 1,382 1,396 1,432 1,439 1,458 1,467 1,552 1,634 1,802 1}
{0 1, 58 1,198 1,199 1,206 1,266 1,274 1,281 1,405 1,416 1,424 1,473 1,577 1,588 1,589 1,601 1,628 1}
{0 1, 4 1, 58 1,75 1,82 1,159 1,183 1,200 1,289 1,298 1,340 1,355 1,436 1,628 1}
{0 1, 2 1, 58 1,82 1,200 1,228 1,298 1,340 1,416 1,482 1,628 1,885 1}
{0 1, 2 1, 4 1, 113 1,159 1,162 1,199 1,200 1,221 1,289 1,326 1,356 1,382 1,385 1,407 1,445 1,455 1,479 1,531 1,547 1,577 1,588 1,615 1,771 1}
{0 1, 4 1, 56 1,180 1,189 1,289 1,340 1,355 1,357 1,413 1,417 1,471 1,492 1,601 1,806 1}
{2 1, 18 1,34 1,52 1,115 1,232 1,275 1,282 1,292 1,313 1,318 1,323 1,381 1,382 1,452 1,487 1,510 1,519 1,556 1,590 1,654 1,738 1}
{2 1, 115 1,116 1,263 1,313 1,323 1,381 1,390 1,398 1,510 1,763 1}
{0 1, 2 1, 4 1, 12 1,57 1,58 1,64 1,81 1,89 1,94 1,128 1,159 1,165 1,167 1,180 1,187 1,189 1,193 1,197 1,198 1,200 1,215 1,234 1,269 1,277 1,289 1,298 1,307 1,320 1,328 1,355 1,359 1,370 1,398 1,402 1,417 1,424 1,433 1,459 1,471 1,505 1,515 1,525 1,548 1,563 1,571 1,577 1,579 1,582 1,588 1,603 1,628 1,632 1}
{0 1, 4 1, 12 1,57 1,58 1,81 1,94 1,100 1,132 1,159 1,165 1,193 1,200 1,203 1,225 1,234 1,257 1,289 1,355 1,370 1,402 1,417 1,424 1,471 1,525 1,577 1,579 1,603 1}
{0 1, 4 1, 12 1,57 1,58 1,81 1,94 1,141 1,159 1,165 1,193 1,200 1,234 1,289 1,355 1,370 1,402 1,417 1,424 1,471 1,525 1,577 1,579 1,603 1,632 1}
{0 1, 4 1, 12 1,56 1,58 1,75 1,81 1,94 1,100 1,105 1,132 1,159 1,165 1,183 1,193 1,199 1,200 1,234 1,257 1,289 1,327 1,355 1,356 1,370 1,402 1,417 1,424 1,471 1,508 1,525 1,577 1,579 1,588 1,603 1}
{0 1, 2 1, 4 1, 12 1,23 1,43 1,58 1,81 1,113 1,159 1,183 1,193 1,226 1,251 1,287 1,289 1,297 1,298 1,299 1,361 1,370 1,398 1,417 1,424 1,433 1,436 1,437 1,459 1,465 1,469 1,503 1,507 1,530 1,565 1,566 1,603 1,628 1,867 1}
{0 1, 4 1, 12 1,56 1,58 1,81 1,82 1,94 1,100 1,132 1,159 1,181 1,193 1,200 1,234 1,289 1,327 1,329 1,355 1,356 1,361 1,370 1,402 1,417 1,424 1,488 1,505 1,525 1,577 1,579 1,588 1,603 1}
{0 1, 2 1, 4 1, 12 1,29 1,43 1,55 1,58 1,59 1,81 1,94 1,100 1,129 1,132 1,159 1,193 1,200 1,226 1,234 1,282 1,287 1,289 1,299 1,355 1,361 1,370 1,402 1,417 1,420 1,424 1,452 1,505 1,525 1,566 1,579 1,601 1,603 1}
{0 1, 2 1, 4 1, 17 1,25 1,37 1,43 1,55 1,58 1,64 1,65 1,79 1,80 1,92 1,137 1,143 1,172 1,185 1,195 1,200 1,206 1,234 1,241 1,274 1,289 1,298 1,313 1,402 1,415 1,433 1,439 1,454 1,465 1,491 1,497 1,532 1,538 1,588 1,600 1,602 1,604 1,632 1}
{0 1, 4 1, 12 1,23 1,128 1,193 1,298 1,370 1,417 1,433 1,437 1,469 1,570 1,577 1,588 1,603 1}
{0 1, 13 1,19 1,54 1,58 1,138 1,356 1,366 1,417 1,429 1,439 1,455 1,497 1,517 1,579 1,588 1}
{0 1, 13 1,148 1,274 1,298 1,370 1,417 1}
{0 1, 3 1, 21 1,31 1,32 1,105 1,112 1,113 1,123 1,128 1,153 1,154 1,192 1,203 1,234 1,243 1,257 1,260 1,264 1,270 1,290 1,292 1,293 1,298 1,300 1,314 1,331 1,367 1,369 1,375 1,378 1,386 1,399 1,410 1,417 1,509 1,513 1,518 1,575 1,579 1,596 1,625 1,635 1,924 1}
{0 1, 2 1, 12 1,76 1,81 1,102 1,142 1,159 1,193 1,234 1,289 1,307 1,313 1,370 1,402 1,417 1,457 1,559 1,563 1,603 1,628 1,630 1}
{0 1, 4 1, 12 1,81 1,96 1,100 1,130 1,150 1,159 1,180 1,191 1,193 1,198 1,203 1,239 1,257 1,330 1,338 1,368 1,370 1,417 1,457 1,469 1,487 1,568 1,603 1,624 1,628 1}
{0 1, 3 1, 39 1,53 1,58 1,76 1,156 1,158 1,187 1,203 1,225 1,235 1,236 1,257 1,271 1,304 1,306 1,430 1,492 1,502 1,543 1}
{2 1, 3 1, 10 1,13 1,24 1,55 1,58 1,81 1,82 1,147 1,148 1,154 1,159 1,167 1,228 1,239 1,286 1,327 1,356 1,365 1,406 1,439 1,496 1,538 1,588 1,593 1,628 1,693 1}
{0 1, 53 1,55 1,68 1,131 1,167 1,199 1,272 1,356 1,426 1,455 1,457 1,465 1,507 1,540 1,628 1,634 1}
{4 1, 12 1,24 1,130 1,280 1,288 1,374 1,411 1,417 1,457 1,602 1}
{0 1, 4 1, 49 1,77 1,159 1,234 1,248 1,374 1,417 1,602 1}
{0 1, 4 1, 22 1,51 1,79 1,105 1,158 1,184 1,257 1,259 1,260 1,270 1,271 1,292 1,356 1,393 1,439 1,512 1,518 1,525 1,543 1,562 1,635 1,780 1}
{0 1, 4 1, 70 1,167 1,182 1,356 1,406 1,417 1,424 1,455 1,496 1,555 1,782 1}
{3 1, 225 1,259 1,404 1,427 1,581 1,590 1,616 1}
{0 1, 4 1, 92 1,120 1,173 1,183 1,184 1,211 1,274 1,289 1,298 1,321 1,443 1,454 1,478 1,518 1,599 1,737 1}
{0 1, 13 1,140 1,199 1,289 1,400 1}
{0 1, 4 1, 13 1,140 1,200 1,400 1,577 1}
{0 1, 13 1,58 1,84 1,140 1,199 1,400 1,455 1,547 1,628 1}
{0 1, 2 1, 4 1, 59 1,158 1,198 1,243 1,273 1,298 1,315 1,451 1,457 1,487 1,505 1,517 1,518 1,580 1,627 1,628 1,748 1}
{0 1, 2 1, 17 1,25 1,37 1,43 1,55 1,58 1,64 1,65 1,79 1,80 1,92 1,137 1,143 1,172 1,185 1,195 1,200 1,206 1,234 1,241 1,274 1,289 1,298 1,313 1,402 1,415 1,433 1,439 1,454 1,465 1,491 1,497 1,499 1,532 1,538 1,588 1,600 1,602 1,604 1,632 1}
{2 1, 4 1, 166 1,261 1,281 1,457 1,476 1,499 1,628 1,632 1}
{0 1, 4 1, 13 1,38 1,55 1,154 1,183 1,231 1,237 1,254 1,285 1,320 1,355 1,389 1,400 1,405 1,455 1,500 1,514 1,517 1,537 1,588 1,628 1,910 1}
{0 1, 140 1,167 1,200 1}
{0 1, 4 1, 140 1,400 1,632 1}
{0 1, 4 1, 8 1,12 1,21 1,45 1,51 1,58 1,61 1,66 1,106 1,118 1,124 1,126 1,135 1,178 1,183 1,185 1,193 1,203 1,234 1,243 1,257 1,258 1,270 1,289 1,292 1,298 1,300 1,306 1,309 1,330 1,338 1,353 1,355 1,356 1,370 1,402 1,409 1,417 1,418 1,457 1,488 1,516 1,518 1,536 1,545 1,567 1,574 1,603 1,635 1}
{0 1, 2 1, 12 1,28 1,43 1,58 1,146 1,193 1,197 1,215 1,226 1,246 1,297 1,298 1,302 1,313 1,321 1,362 1,370 1,386 1,397 1,398 1,417 1,422 1,431 1,435 1,442 1,472 1,481 1,502 1,505 1,520 1,530 1,548 1,577 1,588 1,603 1,610 1,628 1,632 1}
{0 1, 9 1,12 1,45 1,51 1,56 1,58 1,75 1,81 1,94 1,100 1,132 1,159 1,185 1,193 1,199 1,200 1,234 1,257 1,289 1,293 1,325 1,355 1,356 1,370 1,402 1,417 1,424 1,505 1,508 1,518 1,525 1,577 1,579 1,603 1}
{0 1, 2 1, 7 1,12 1,19 1,25 1,58 1,64 1,81 1,89 1,93 1,100 1,113 1,128 1,129 1,132 1,134 1,135 1,136 1,137 1,141 1,159 1,162 1,174 1,190 1,193 1,197 1,199 1,200 1,215 1,227 1,234 1,274 1,289 1,327 1,328 1,361 1,362 1,370 1,386 1,402 1,417 1,433 1,442 1,465 1,473 1,497 1,520 1,525 1,544 1,547 1,548 1,579 1,588 1,603 1,619 1,628 1,632 1,946 1}
{0 1, 4 1, 10 1,12 1,23 1,60 1,133 1,138 1,160 1,161 1,182 1,183 1,186 1,193 1,203 1,225 1,257 1,289 1,298 1,305 1,320 1,321 1,329 1,339 1,370 1,402 1,417 1,433 1,435 1,439 1,451 1,466 1,502 1,515 1,536 1,547 1,553 1,580 1,603 1,615 1}
{0 1, 1 1, 9 1,11 1,12 1,23 1,128 1,133 1,137 1,176 1,182 1,193 1,203 1,205 1,225 1,257 1,262 1,281 1,297 1,298 1,306 1,321 1,338 1,339 1,370 1,402 1,417 1,431 1,433 1,453 1,502 1,517 1,603 1,628 1,945 1}
{1 1, 4 1, 11 1,13 1,23 1,32 1,54 1,62 1,83 1,137 1,168 1,182 1,297 1,369 1,370 1,417 1,458 1,501 1,628 1}
{0 1, 11 1,13 1,23 1,60 1,70 1,137 1,187 1,193 1,225 1,235 1,257 1,263 1,282 1,297 1,298 1,306 1,320 1,339 1,370 1,389 1,417 1,431 1,433 1,501 1,574 1,579 1,581 1,603 1,628 1}
{0 1, 3 1, 12 1,23 1,93 1,107 1,114 1,124 1,125 1,127 1,133 1,137 1,157 1,182 1,183 1,193 1,257 1,259 1,281 1,283 1,289 1,298 1,304 1,305 1,306 1,320 1,328 1,370 1,417 1,418 1,421 1,433 1,434 1,439 1,466 1,525 1,564 1,603 1}
{0 1, 3 1, 182 1,203 1,271 1,333 1,430 1,439 1,455 1,615 1,816 1}
{0 1, 70 1,180 1,210 1,274 1,289 1,361 1,374 1,433 1,439 1,483 1,506 1,547 1,602 1}
{0 1, 2 1, 12 1,46 1,180 1,203 1,210 1,225 1,244 1,257 1,288 1,289 1,374 1,383 1,417 1,433 1,439 1,469 1,509 1,547 1,602 1,628 1}
{0 1, 13 1,92 1,199 1,229 1,238 1,374 1,384 1,417 1,455 1,475 1,591 1,599 1,602 1}
{0 1, 4 1, 24 1,47 1,72 1,138 1,159 1,177 1,180 1,191 1,193 1,200 1,201 1,214 1,243 1,368 1,401 1,480 1,482 1,487 1,568 1,570 1,601 1,603 1,624 1,628 1,852 1}
{0 1, 4 1, 13 1,38 1,56 1,58 1,71 1,75 1,96 1,159 1,169 1,191 1,200 1,202 1,232 1,233 1,285 1,355 1,386 1,395 1,424 1,442 1,475 1,482 1,490 1,540 1,588 1,628 1}
{0 1, 4 1, 13 1,58 1,59 1,70 1,87 1,97 1,159 1,177 1,191 1,199 1,202 1,203 1,246 1,249 1,280 1,332 1,356 1,442 1,501 1,502 1,505 1,513 1,526 1,528 1,547 1,554 1,556 1,576 1,599 1,617 1,628 1,636 1,638 1}
{2 1, 4 1, 13 1,148 1,202 1,331 1,417 1,424 1,479 1,541 1,604 1,926 1}
{0 1, 13 1,58 1,59 1,91 1,103 1,159 1,177 1,180 1,191 1,198 1,199 1,201 1,227 1,251 1,297 1,298 1,299 1,337 1,385 1,402 1,437 1,469 1,482 1,503 1,581 1,586 1,592 1,601 1,620 1,628 1}
{0 1, 13 1,56 1,58 1,71 1,75 1,96 1,159 1,169 1,191 1,200 1,202 1,232 1,233 1,285 1,289 1,355 1,386 1,395 1,424 1,442 1,475 1,482 1,490 1,588 1,592 1,628 1}
{0 1, 4 1, 13 1,47 1,58 1,59 1,70 1,87 1,97 1,117 1,159 1,177 1,191 1,199 1,202 1,214 1,246 1,249 1,275 1,280 1,282 1,332 1,356 1,431 1,491 1,493 1,501 1,502 1,505 1,513 1,528 1,547 1,562 1,576 1,588 1,599 1,617 1,628 1,637 1,638 1,639 1}
{0 1, 13 1,56 1,58 1,75 1,96 1,159 1,191 1,200 1,202 1,266 1,355 1,424 1,475 1,482 1,577 1,610 1,628 1}
{0 1, 4 1, 13 1,56 1,58 1,75 1,96 1,159 1,169 1,191 1,200 1,201 1,251 1,289 1,326 1,355 1,357 1,424 1,438 1,482 1,570 1,628 1}
{0 1, 2 1, 13 1,33 1,58 1,66 1,159 1,200 1,234 1,506 1,577 1,589 1,612 1,664 1}
{2 1, 4 1, 20 1,58 1,162 1,218 1,703 1,736 1}
{1 1, 58 1,63 1,70 1,160 1,162 1,174 1,218 1,428 1,474 1,547 1,576 1,586 1,874 1}
{1 1, 4 1, 13 1,19 1,26 1,92 1,216 1,313 1,341 1,349 1,602 1,714 1,743 1,762 1,764 1,817 1,835 1,843 1,851 1,863 1}
{1 1, 80 1,121 1,472 1,479 1,547 1,602 1,613 1,626 1,774 1,874 1,878 1,926 1}
{0 1, 1 1, 454 1,476 1,504 1,513 1,797 1}
{4 1, 12 1,80 1,273 1,354 1,457 1,680 1}
{3 1, 4 1, 114 1,115 1,131 1,234 1,247 1,281 1,316 1,349 1,376 1,412 1,446 1,457 1,461 1,469 1,486 1,523 1,524 1,550 1,688 1,692 1,695 1,708 1,727 1,749 1,750 1,781 1,783 1,787 1,788 1,798 1,814 1,822 1,824 1,836 1,859 1,867 1,898 1,936 1,948 1}
{1 1, 4 1, 70 1,316 1,576 1,688 1,814 1,817 1,851 1,889 1,933 1}
{0 1, 4 1, 26 1,43 1,114 1,312 1,316 1,317 1,376 1,454 1,486 1,654 1,660 1,671 1,685 1,689 1,698 1,699 1,717 1,776 1,814 1,859 1,936 1,949 1,950 1}
{2 1, 4 1, 25 1,26 1,66 1,114 1,246 1,247 1,248 1,349 1,376 1,458 1,486 1,487 1,515 1,541 1,543 1,622 1,669 1,672 1,702 1,708 1,710 1,712 1,722 1,734 1,735 1,745 1,751 1,758 1,759 1,765 1,778 1,783 1,785 1,792 1,811 1,818 1,819 1,820 1,825 1,837 1,849 1,850 1,855 1,860 1,866 1,889 1,890 1,915 1,928 1,937 1,940 1,942 1,944 1}
{0 1, 55 1,297 1,412 1,491 1,517 1,710 1,711 1,752 1,775 1,813 1,817 1,925 1}
{3 1, 26 1,52 1,114 1,174 1,197 1,246 1,265 1,281 1,297 1,303 1,349 1,374 1,389 1,401 1,412 1,432 1,446 1,469 1,491 1,507 1,517 1,525 1,528 1,545 1,568 1,642 1,653 1,696 1,703 1,705 1,711 1,713 1,714 1,718 1,724 1,726 1,742 1,754 1,802 1,817 1,818 1,826 1,827 1,828 1,831 1,841 1,842 1,847 1,876 1,889 1,901 1,912 1,915 1,925 1,933 1,939 1}
{3 1, 131 1,217 1,246 1,247 1,303 1,483 1,574 1,615 1,684 1,718 1,722 1,815 1,822 1,824 1,844 1,904 1,914 1,925 1,952 1}
{1 1, 3 1, 5 1,80 1,174 1,194 1,200 1,265 1,273 1,281 1,303 1,414 1,527 1,602 1,645 1,654 1,682 1,724 1,726 1,729 1,754 1,764 1,771 1,817 1,864 1,885 1,887 1,941 1}
{1 1, 58 1,80 1,81 1,92 1,114 1,128 1,159 1,194 1,200 1,261 1,265 1,281 1,303 1,309 1,312 1,412 1,432 1,461 1,496 1,574 1,602 1,615 1,675 1,682 1,684 1,687 1,724 1,729 1,754 1,764 1,817 1,836 1,864 1,873 1,887 1,926 1,941 1}
{1 1, 4 1, 725 1,901 1}
{1 1, 34 1,114 1,128 1,152 1,163 1,247 1,281 1,289 1,348 1,350 1,412 1,438 1,486 1,502 1,504 1,507 1,513 1,550 1,558 1,593 1,673 1,700 1,801 1,829 1,834 1,845 1,846 1,862 1,900 1,914 1,921 1,924 1,938 1}
{1 1, 3 1, 33 1,48 1,58 1,114 1,121 1,133 1,174 1,273 1,289 1,303 1,356 1,398 1,412 1,448 1,491 1,501 1,502 1,513 1,517 1,665 1,697 1,739 1,741 1,746 1,747 1,751 1,802 1,805 1,815 1,817 1,823 1,904 1,931 1}
{3 1, 114 1,117 1,203 1,282 1,303 1,484 1,558 1,562 1,568 1,583 1,611 1,622 1,629 1,649 1,653 1,671 1,702 1,709 1,741 1,764 1,767 1,777 1,780 1,784 1,814 1,816 1,833 1,879 1,884 1,939 1,953 1}
{1 1, 5 1,59 1,75 1,85 1,174 1,213 1,220 1,245 1,297 1,479 1,547 1,586 1,738 1,823 1,865 1}
{0 1, 1 1, 12 1,59 1,162 1,174 1,297 1,479 1,547 1,602 1,675 1,837 1,856 1}
{3 1, 12 1,19 1,52 1,92 1,105 1,273 1,305 1,309 1,364 1,389 1,391 1,447 1,461 1,501 1,626 1,643 1,670 1,680 1,698 1,701 1,733 1,744 1,766 1,816 1,834 1,912 1,915 1,943 1}
{3 1, 92 1,267 1,364 1,391 1,501 1,517 1,544 1,615 1,643 1,670 1,701 1,705 1,707 1,728 1,744 1,780 1,845 1,855 1,897 1,933 1}
{2 1, 4 1, 32 1,63 1,71 1,82 1,95 1,113 1,274 1,276 1,306 1,317 1,342 1,371 1,385 1,414 1,439 1,481 1,513 1,527 1,542 1,623 1,628 1,643 1,720 1,843 1,891 1,893 1,915 1,930 1,947 1,951 1}
{4 1, 5 1,14 1,78 1,152 1,157 1,349 1,423 1,428 1,440 1,498 1,504 1,513 1,650 1,842 1}
{1 1, 3 1, 13 1,28 1,95 1,417 1,514 1,558 1,581 1,692 1,793 1,902 1,920 1}
{3 1, 4 1, 228 1,267 1,289 1,317 1,371 1,379 1,458 1,469 1,615 1,628 1,643 1,644 1,688 1,793 1,804 1,900 1}
{1 1, 59 1,190 1,356 1,365 1,379 1,441 1,547 1,611 1,681 1,799 1,847 1,854 1}
{1 1, 58 1,261 1,295 1,297 1,414 1,727 1,752 1,813 1,885 1,895 1}
{0 1, 12 1,58 1,84 1,114 1,128 1,220 1,281 1,289 1,295 1,298 1,356 1,417 1,455 1,589 1,615 1,687 1}
{3 1, 50 1,248 1,341 1,347 1,396 1,458 1,496 1,535 1,550 1,628 1,643 1,644 1,709 1,777 1,834 1,877 1}
{1 1, 23 1,50 1,173 1,263 1,365 1,417 1,439 1,528 1,603 1,632 1,794 1}
{4 1, 92 1,281 1,285 1,366 1,417 1,455 1,472 1,697 1,868 1,950 1}
{3 1, 109 1,176 1,524 1,663 1}
{4 1, 25 1,109 1,176 1,257 1,613 1,663 1,907 1}
{3 1, 29 1,99 1,178 1,225 1,257 1,259 1,374 1,386 1,537 1,590 1,596 1,616 1,664 1,684 1,944 1,945 1}
{1 1, 23 1,70 1,92 1,121 1,364 1,417 1,576 1,599 1,641 1,756 1,765 1,951 1}
{1 1, 3 1, 13 1,137 1,297 1,383 1,417 1,502 1,527 1,760 1,801 1,833 1}
{4 1, 235 1,306 1,831 1}
{1 1, 2 1, 12 1,23 1,43 1,58 1,174 1,199 1,201 1,375 1,502 1,517 1,526 1,527 1,532 1,577 1,588 1,699 1}
{1 1, 12 1,201 1,221 1,281 1,386 1,529 1,588 1,605 1,886 1,951 1}
{1 1, 3 1, 58 1,366 1,417 1,886 1}
{1 1, 12 1,82 1,201 1,401 1,417 1,476 1,499 1,716 1,756 1,929 1}
{1 1, 13 1,95 1,173 1,199 1,443 1,499 1,686 1,700 1,746 1,920 1,929 1}
{2 1, 13 1,25 1,66 1,85 1,148 1,154 1,401 1,457 1,588 1,628 1,630 1,668 1,741 1}
{1 1, 58 1,70 1,197 1,213 1,326 1,403 1,414 1,442 1,499 1,620 1,668 1,690 1,723 1,769 1,894 1}
{1 1, 70 1,174 1,403 1,414 1,613 1,659 1,671 1,673 1,679 1,721 1,725 1,768 1,773 1,779 1,808 1,838 1,858 1,873 1,909 1,951 1}
{1 1, 2 1, 25 1,29 1,52 1,58 1,225 1,277 1,491 1,547 1,568 1,571 1,586 1,666 1,697 1,699 1,715 1,730 1,761 1,821 1,858 1,873 1,875 1,880 1,896 1,932 1,944 1,951 1}
{1 1, 3 1, 23 1,29 1,70 1,225 1,267 1,278 1,284 1,403 1,414 1,458 1,528 1,547 1,601 1,646 1,652 1,658 1,719 1,721 1,737 1,753 1,755 1,761 1,763 1,779 1,783 1,807 1,808 1,812 1,838 1,849 1,873 1,883 1,909 1,926 1}
{1 1, 178 1,225 1,298 1,403 1,613 1,615 1,679 1,721 1,725 1,838 1,909 1}
{1 1, 3 1, 29 1,52 1,174 1,214 1,297 1,417 1,492 1,537 1,562 1,568 1,581 1,652 1,657 1,658 1,664 1,737 1,779 1,808 1,815 1,844 1,872 1,873 1,878 1}
{4 1, 12 1,20 1,59 1,174 1,261 1,414 1,507 1,575 1,581 1,719 1,740 1,756 1,760 1,779 1,808 1,810 1,873 1,878 1,934 1}
{3 1, 13 1,15 1,70 1,82 1,91 1,174 1,206 1,225 1,457 1,492 1,537 1,547 1,575 1,576 1,657 1,659 1,666 1,675 1,685 1,715 1,723 1,763 1,779 1,806 1,808 1,846 1,848 1,868 1,872 1,873 1,896 1,912 1,934 1,938 1}
{1 1, 3 1, 59 1,162 1,180 1,207 1,218 1,353 1,414 1,417 1,466 1,488 1,581 1,641 1,779 1,808 1,858 1,873 1,881 1,882 1,883 1,907 1,935 1}
{1 1, 297 1,298 1,414 1,417 1,492 1,687 1,873 1}
{1 1, 4 1, 52 1,85 1,261 1,274 1,284 1,289 1,316 1,353 1,417 1,547 1,568 1,588 1,648 1,679 1,697 1,730 1,768 1,779 1,786 1,808 1}
{1 1, 4 1, 13 1,23 1,58 1,70 1,158 1,228 1,261 1,298 1,385 1,403 1,407 1,414 1,542 1,547 1,576 1,632 1,662 1,667 1,676 1,677 1,678 1,683 1,693 1,694 1,715 1,728 1,732 1,739 1,757 1,789 1,790 1,808 1,852 1,869 1,871 1}
{1 1, 4 1, 23 1,29 1,58 1,121 1,148 1,159 1,281 1,297 1,366 1,368 1,386 1,407 1,417 1,423 1,496 1,577 1,642 1,651 1,654 1,716 1,870 1,894 1}
{1 1, 13 1,23 1,40 1,58 1,70 1,158 1,228 1,298 1,385 1,403 1,407 1,414 1,417 1,436 1,469 1,542 1,547 1,632 1,667 1,676 1,677 1,678 1,683 1,693 1,694 1,715 1,721 1,728 1,732 1,739 1,757 1,789 1,790 1,791 1,808 1,852 1,869 1,871 1}
{1 1, 13 1,59 1,177 1,180 1,199 1,261 1,298 1,366 1,417 1,469 1,476 1,483 1,517 1,547 1,577 1,632 1,649 1,691 1,694 1,721 1,728 1,770 1,815 1,857 1,888 1,908 1,911 1,923 1}
{1 1, 13 1,70 1,158 1,414 1,423 1,527 1,566 1,576 1,664 1,716 1,791 1,808 1,870 1,879 1,906 1,918 1}
{1 1, 23 1,29 1,58 1,70 1,222 1,285 1,297 1,414 1,417 1,458 1,532 1,541 1,576 1,632 1,935 1}
{1 1, 4 1, 24 1,50 1,54 1,55 1,58 1,59 1,63 1,65 1,78 1,114 1,121 1,158 1,160 1,162 1,174 1,176 1,180 1,193 1,218 1,222 1,405 1,407 1,408 1,414 1,415 1,423 1,428 1,433 1,457 1,471 1,479 1,481 1,505 1,506 1,528 1,540 1,545 1,574 1,603 1,605 1,650 1,651 1,662 1,674 1,716 1,741 1,757 1,770 1,782 1,795 1,803 1,812 1,830 1,840 1,853 1,857 1,866 1,870 1,893 1,899 1,910 1,916 1,922 1,938 1}
{1 1, 4 1, 13 1,59 1,177 1,180 1,199 1,261 1,298 1,414 1,417 1,469 1,476 1,483 1,517 1,547 1,577 1,632 1,649 1,651 1,691 1,694 1,728 1,770 1,815 1,857 1,888 1,908 1,911 1,923 1}
{4 1, 42 1,158 1,174 1,297 1,298 1,402 1,414 1,632 1,649 1,782 1,918 1}
{1 1, 3 1, 23 1,58 1,59 1,162 1,177 1,226 1,298 1,483 1,515 1,547 1,561 1,601 1,632 1,649 1,651 1,695 1,770 1,771 1,782 1,839 1,861 1,888 1,908 1,911 1,923 1}
{1 1, 16 1,63 1,408 1,417 1,455 1,532 1,601 1,697 1,716 1,800 1,868 1,870 1,912 1,913 1,915 1}
{1 1, 24 1,70 1,92 1,148 1,297 1,414 1,576 1,628 1,778 1,808 1,821 1,886 1}
{1 1, 58 1,63 1,174 1,261 1,371 1,389 1,474 1,479 1,483 1,603 1,650 1,656 1,662 1,694 1,732 1,758 1,772 1,782 1,823 1,856 1,861 1,865 1,869 1,892 1,912 1,927 1,931 1,946 1,949 1}
{1 1, 23 1,58 1,70 1,298 1,414 1,417 1,507 1,528 1,576 1,632 1,649 1,667 1,677 1,782 1,789 1,790 1,808 1}
{4 1, 29 1,70 1,266 1,299 1,417 1,561 1,576 1,601 1,632 1,662 1,771 1,772 1,839 1,846 1,882 1,946 1}
{1 1, 58 1,304 1,414 1,417 1,424 1,467 1,542 1,577 1,601 1,647 1,650 1,655 1,704 1,713 1,731 1,736 1,775 1,782 1,790 1,797 1,838 1,868 1,916 1,924 1}
{1 1, 12 1,13 1,58 1,70 1,73 1,199 1,200 1,214 1,216 1,288 1,319 1,356 1,365 1,414 1,465 1,501 1,576 1,577 1,588 1,607 1,640 1,644 1,647 1,648 1,649 1,745 1,754 1,771 1,772 1,796 1,803 1,823 1,839 1,884 1,903 1,905 1,911 1,917 1,918 1,924 1}
{1 1, 4 1, 12 1,20 1,29 1,70 1,242 1,269 1,300 1,379 1,403 1,469 1,501 1,507 1,772 1,784 1,786 1,823 1,874 1,905 1,910 1,915 1}
{1 1, 12 1,58 1,70 1,201 1,375 1,403 1,417 1,577 1}
{0 1, 91 1,99 1,102 1,159 1,417 1,457 1,562 1,581 1,583 1,596 1,628 1,717 1}
{3 1, 91 1,247 1,375 1,706 1,717 1,805 1}
{0 1, 204 1,290 1,458 1,501 1,542 1,706 1,717 1}
{3 1, 4 1, 12 1,272 1,691 1,807 1,837 1}
{2 1, 13 1,58 1,59 1,371 1,384 1,534 1,561 1,628 1,832 1,877 1,891 1,912 1}
{1 1, 70 1,200 1,221 1,297 1,300 1,477 1,517 1,576 1,659 1,748 1,810 1,813 1,902 1,914 1}
{0 1, 70 1,92 1,100 1,114 1,115 1,144 1,178 1,211 1,243 1,289 1,300 1,363 1,385 1,403 1,420 1,428 1,525 1,542 1,699 1,748 1,809 1,845 1,895 1,941 1}
{1 1, 3 1, 12 1,25 1,55 1,58 1,59 1,70 1,132 1,207 1,237 1,362 1,365 1,403 1,428 1,581 1,588 1,589 1,613 1,645 1,743 1,766 1,809 1,875 1,882 1}
{4 1, 12 1,59 1,85 1,174 1,221 1,222 1,237 1,371 1,464 1,476 1,656 1,661 1,713 1,731 1,736 1,809 1,815 1,835 1,890 1,892 1,903 1,912 1,919 1}
{4 1, 50 1,58 1,70 1,221 1,261 1,365 1,547 1,576 1,603 1,640 1,774 1,794 1}
{1 1, 4 1, 32 1,58 1,59 1,70 1,160 1,180 1,207 1,297 1,319 1,479 1,496 1,509 1,547 1,576 1,589 1,645 1,684 1,690 1,697 1,709 1,715 1,825 1,830 1,847 1,880 1,930 1}
