{
{0, 90, 30, 80, 50}, 
{20, 60, 30, 170, 50}, 
{20, 50, 40, 175, 50}, 
{20, 50, 40, 175, 140}, 
{20, 60, 30, 175, 140}, 
{165, 90, 30, 175, 140}, 
{130, 50, 20, 95, 140}, 
{130, 50, 20, 95, 50}, 
{165, 90, 30, 95, 90}, 
{165, 90, 30, 95, 90}, 
{165, 90, 30, 95, 90}
}