{
{90, 150, 4, 90, 40},
{140, 55, 50, 145, 40},
{140, 55, 73, 145, 40},
{140, 55, 73, 145, 140},
{140, 55, 50, 145, 140},
{130, 150, 4, 90, 140},
{90, 150, 4, 90, 140},
{60, 110, 50, 90, 140},
{60, 105, 75, 90, 140},
{60, 105, 75, 90, 40},
{90, 150, 4, 90, 40}
}