{
{165, 90, 30, 80, 100}, 
{130, 80, 30, 105, 50}, 
{130, 50, 30, 105, 50}, 
{130, 45, 35, 105, 50}, 
{130, 45, 35, 105, 140}, 
{130, 90, 30, 80, 140}, 
{0, 90, 30, 80, 140}, 
{25, 90, 30, 80, 140}, 
{25, 50, 25, 170, 140}, 
{25, 50, 25, 170, 50}, 
{90, 90, 30, 80, 100}
}