{
{90, 130, 20, 90, 100},
{50, 40, 50, 5, 40},
{50, 35, 60, 5, 60},
{50, 35, 60, 5, 160},
{50, 40, 50, 5, 160},
{90, 130, 20, 90, 160},
{145, 30, 60, 90, 160},
{145, 30, 60, 90, 60},
{145, 30, 50, 90, 60},
{90, 130, 20, 90, 100},
{90, 130, 20, 90, 100}
}