{
  "mongoURI": "mongodb+srv://adm:OVuHAoRRQGcOZGmV@cluster0.bplyq.mongodb.net/mensal_dois?retryWrites=true&w=majority",
  "jwtSecret": "4D636732CC493475B29EBF7B161C1",
  "AWS_S3_ID": "AKIAJR5KMIEY72BTS2ZQ",
  "AWS_S3_SECRET": "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",
  "AWS_S3_BUCKETNAME": "crud-noticias"
}