{
  "host": "0.0.0.0",
  "port": 3000,
  "version": null,
  "prometheus_exporter": 9091,
  "token": {
    "secret": "json web token secret",
    "duration": 3600
  },
  "openid": {
    "discovery_url": null,
    "client_id": null,
    "client_secret": null
  },
  "mongodb": "mongodb://localhost/stargate",
  "website_url": "http://localhost:4200",
  "backend_url": "pprod-stargate.intradef.gouv.fr",
  "mail": {
    "whitelist_domains": [""],
    "transporter": {
      "host": "",
      "port": 1025,
      "secure": false,
      "auth": {
        "user": "",
        "pass": ""
      },
      "tls": {
        "reject_unauthorized": false,
        "ignore_t_l_s": false,
        "require_t_l_s": false,
        "min_version": "TLSv1"
      }
    },
    "default_from": "\"name\" <name@localhost>"
  },
  "default_timezone": "Europe/Paris"
}
