<svg width="10" height="11" viewBox="0 0 10 11" fill="none" xmlns="http://www.w3.org/2000/svg">
  <path d="M0.726455 0.488605L1.03724 0.404001C1.69153 0.217874 2.28039 0.285556 2.75475 0.590128C3.32725 0.962383 3.73618 1.67305 3.93246 2.63753L4.50496 5.61557C4.52132 5.71709 4.60311 5.76786 4.70125 5.76786L7.05668 5.53097C7.97269 5.48021 8.79055 5.71709 9.29762 6.22471C9.73926 6.64773 10.001 7.25688 10.001 7.98447V8.05215C10.001 8.54285 9.62476 8.96587 9.18312 9.11815V9.37196C9.18312 9.84574 8.8069 10.2011 8.3489 10.2011H3.0001C2.5421 10.2011 2.14953 9.84574 2.14953 9.37196V8.2552C2.01867 8.06907 1.92053 7.8491 1.8551 7.61221L0.12124 1.58845C0.0230961 1.08083 0.284811 0.62397 0.726455 0.488605ZM2.82017 9.35504C2.82017 9.45656 2.91832 9.50733 3.01646 9.50733H8.36526C8.4634 9.50733 8.54519 9.43964 8.54519 9.35504V9.16891H3.88339C3.50718 9.16891 3.13096 9.05047 2.82017 8.84742V9.35504ZM0.75917 1.35156L2.50939 7.39224C2.67296 8.03523 3.24546 8.49209 3.88339 8.49209H8.87233C9.10133 8.49209 9.36305 8.27212 9.36305 8.03523V7.96755C9.36305 7.42608 9.16676 7.00307 8.85597 6.69849C8.51247 6.36008 7.95633 6.17395 7.33476 6.17395C7.26933 6.17395 7.18754 6.17395 7.12211 6.17395L4.78304 6.42776C4.34139 6.47853 3.93246 6.17395 3.86703 5.73402L3.29453 2.78982C3.13096 2.01147 2.83653 1.45308 2.41124 1.18235C2.0841 0.979304 1.67517 0.928542 1.20081 1.06391L0.890026 1.14851C0.80824 1.18235 0.742812 1.26696 0.75917 1.35156Z" fill="black"/>
</svg>
