{
  "collection": "@nestjs/schematics",
  "sourceRoot": "src",
  "compilerOptions": {
    "assets": [
      {
        "include": "../flight_documents_template",
        "outDir": "dist/flight_documents_template",
        "watchAssets": true
      },
      {
        "include": "../mail_template",
        "outDir": "dist/mail_template",
        "watchAssets": true
      }
    ],
    "watchAssets": true
  }
}
