<?xml version="1.0" standalone="no"?>
 <!DOCTYPE svg PUBLIC "-//W3C//DTD SVG 1.1//EN" 
 "http://www.w3.org/Graphics/SVG/1.1/DTD/svg11.dtd"> 
<svg
  xmlns:svg="http://www.w3.org/2000/svg"
  xmlns="http://www.w3.org/2000/svg"
  xmlns:xlink="http://www.w3.org/1999/xlink"
  version="1.1"
  width="45.2882mm" height="50.1142mm" viewBox="0.0000 0.0000 45.2882 50.1142">
<title>SVG Image created as quentorres_v2-brd.svg date 2024/01/26 11:43:18 </title>
  <desc>Image generated by PCBNEW </desc>
<g style="fill:#000000; fill-opacity:1.0000;stroke:#000000; stroke-opacity:1.0000;
stroke-linecap:round; stroke-linejoin:round;"
 transform="translate(0 0) scale(1 1)">
</g>
<g style="fill:#000000; fill-opacity:0.0; 
stroke:#000000; stroke-width:0.0000; stroke-opacity:1; 
stroke-linecap:round; stroke-linejoin:round;">
</g>
<g style="fill:#000000; fill-opacity:0.0; 
stroke:#000000; stroke-width:0.3000; stroke-opacity:1; 
stroke-linecap:round; stroke-linejoin:round;">
<text x="3.0920" y="44.2130"
textLength="2.0492" font-size="3.3333" lengthAdjust="spacingAndGlyphs"
text-anchor="start" opacity="0">T</text>
<g class="stroked-text"><desc>T</desc>
</g>
<g style="fill:#000000; fill-opacity:1.0000; 
stroke:#000000; stroke-width:0.0000; stroke-opacity:1; 
stroke-linecap:round; stroke-linejoin:round;">
<path style="fill:#000000; fill-opacity:1.0000; 
stroke:#000000; stroke-width:0.0000; stroke-opacity:1; 
stroke-linecap:round; stroke-linejoin:round;fill-rule:evenodd;"
d="M 3.9505,43.7880
3.9505,41.3651
4.2943,41.3651
4.2943,43.7880
Z" /> 
<path style="fill:#000000; fill-opacity:1.0000; 
stroke:#000000; stroke-width:0.0000; stroke-opacity:1; 
stroke-linecap:round; stroke-linejoin:round;fill-rule:evenodd;"
d="M 3.2294,41.6875
3.2294,41.3651
5.0154,41.3651
5.0154,41.6875
Z" /> 
</g></g>
<g style="fill:#000000; fill-opacity:1.0000; 
stroke:#000000; stroke-width:0.3000; stroke-opacity:1; 
stroke-linecap:round; stroke-linejoin:round;">
</g>
<g style="fill:#000000; fill-opacity:0.0; 
stroke:#000000; stroke-width:0.3000; stroke-opacity:1; 
stroke-linecap:round; stroke-linejoin:round;">
<text x="0.8060" y="42.6890"
textLength="2.0492" font-size="3.3333" lengthAdjust="spacingAndGlyphs"
text-anchor="start" opacity="0">Q</text>
<g class="stroked-text"><desc>Q</desc>
</g>
<g style="fill:#000000; fill-opacity:1.0000; 
stroke:#000000; stroke-width:0.0000; stroke-opacity:1; 
stroke-linecap:round; stroke-linejoin:round;">
<path style="fill:#000000; fill-opacity:1.0000; 
stroke:#000000; stroke-width:0.0000; stroke-opacity:1; 
stroke-linecap:round; stroke-linejoin:round;fill-rule:evenodd;"
d="M 1.8920,39.8033
1.9456,39.8070
1.9974,39.8132
2.0475,39.8218
2.0958,39.8330
2.1424,39.8466
2.1872,39.8627
2.2302,39.8813
2.2715,39.9023
2.3110,39.9258
2.3488,39.9518
2.3848,39.9803
2.4190,40.0112
2.4515,40.0447
2.4823,40.0806
2.5113,40.1189
2.5385,40.1598
2.5640,40.2031
2.5877,40.2489
2.6096,40.2972
2.6298,40.3479
2.6483,40.4012
2.6650,40.4569
2.6799,40.5151
2.6931,40.5757
2.7045,40.6389
2.7142,40.7045
2.7221,40.7726
2.7282,40.8431
2.7326,40.9162
2.7353,40.9917
2.7361,41.0697
2.7353,41.1455
2.7326,41.2190
2.7282,41.2901
2.7221,41.3587
2.7142,41.4250
2.7045,41.4888
2.6931,41.5503
2.6799,41.6093
2.6650,41.6659
2.6483,41.7201
2.6298,41.7719
2.6096,41.8213
2.5877,41.8682
2.5640,41.9128
2.5385,41.9550
2.5113,41.9947
2.4823,42.0321
2.4515,42.0670
2.4190,42.0995
2.3848,42.1296
2.3488,42.1573
2.3110,42.1826
2.2715,42.2055
2.2302,42.2260
2.1872,42.2441
2.1424,42.2597
2.0958,42.2730
2.0475,42.2838
1.9979,42.2922
1.9979,42.3061
1.9983,42.3330
1.9995,42.3589
2.0015,42.3841
2.0042,42.4083
2.0099,42.4432
2.0173,42.4761
2.0265,42.5071
2.0375,42.5362
2.0503,42.5633
2.0648,42.5886
2.0812,42.6120
2.0993,42.6334
2.1192,42.6529
2.1408,42.6706
2.1643,42.6863
2.1895,42.7000
2.2166,42.7119
2.2454,42.7218
2.2760,42.7298
2.3083,42.7359
2.3425,42.7400
2.3784,42.7423
2.4033,42.7427
2.5786,42.7427
2.5438,43.0553
2.4033,43.0553
2.3577,43.0546
2.3134,43.0524
2.2706,43.0487
2.2292,43.0436
2.1893,43.0370
2.1508,43.0289
2.1137,43.0193
2.0780,43.0083
2.0438,42.9958
2.0111,42.9819
1.9798,42.9665
1.9499,42.9496
1.9214,42.9312
1.8944,42.9114
1.8688,42.8901
1.8446,42.8673
1.8220,42.8431
1.8009,42.8175
1.7811,42.7903
1.7629,42.7618
1.7461,42.7317
1.7308,42.7002
1.7169,42.6671
1.7045,42.6327
1.6936,42.5967
1.6841,42.5593
1.6760,42.5203
1.6695,42.4800
1.6644,42.4381
1.6607,42.3948
1.6585,42.3500
1.6578,42.3037
1.6578,42.2892
1.6258,42.2838
1.5774,42.2730
1.5308,42.2597
1.4860,42.2441
1.4429,42.2260
1.4016,42.2055
1.3621,42.1826
1.3243,42.1573
1.2882,42.1296
1.2540,42.0995
1.2214,42.0670
1.1907,42.0321
1.1617,41.9947
1.1344,41.9550
1.1089,41.9128
1.0852,41.8682
1.0632,41.8213
1.0430,41.7719
1.0246,41.7201
1.0079,41.6659
0.9929,41.6093
0.9797,41.5503
0.9683,41.4888
0.9586,41.4250
0.9507,41.3587
0.9446,41.2901
0.9402,41.2190
0.9375,41.1455
0.9367,41.0697
1.2969,41.0697
1.2975,41.1263
1.2990,41.1812
1.3017,41.2342
1.3054,41.2855
1.3101,41.3349
1.3159,41.3826
1.3228,41.4284
1.3307,41.4725
1.3396,41.5148
1.3496,41.5552
1.3607,41.5939
1.3728,41.6308
1.3860,41.6658
1.4002,41.6991
1.4155,41.7306
1.4319,41.7602
1.4493,41.7881
1.4677,41.8142
1.4872,41.8385
1.5078,41.8610
1.5294,41.8816
1.5521,41.9005
1.5758,41.9176
1.6006,41.9329
1.6264,41.9464
1.6533,41.9581
1.6812,41.9680
1.7102,41.9761
1.7402,41.9824
1.7713,41.9869
1.8035,41.9895
1.8367,41.9904
1.8699,41.9895
1.9020,41.9869
1.9331,41.9824
1.9631,41.9761
1.9920,41.9680
2.0199,41.9581
2.0468,41.9464
2.0726,41.9329
2.0973,41.9176
2.1210,41.9005
2.1437,41.8816
2.1653,41.8610
2.1858,41.8385
2.2053,41.8142
2.2237,41.7881
2.2411,41.7602
2.2574,41.7306
2.2727,41.6991
2.2869,41.6658
2.3001,41.6308
2.3122,41.5939
2.3232,41.5552
2.3332,41.5148
2.3422,41.4725
2.3501,41.4284
2.3569,41.3826
2.3627,41.3349
2.3674,41.2855
2.3711,41.2342
2.3738,41.1812
2.3753,41.1263
2.3759,41.0697
2.3753,41.0109
2.3738,40.9540
2.3711,40.8990
2.3674,40.8458
2.3627,40.7945
2.3569,40.7451
2.3501,40.6975
2.3422,40.6518
2.3332,40.6080
2.3232,40.5660
2.3122,40.5259
2.3001,40.4877
2.2869,40.4513
2.2727,40.4168
2.2574,40.3842
2.2411,40.3534
2.2237,40.3245
2.2053,40.2975
2.1858,40.2723
2.1653,40.2490
2.1437,40.2275
2.1210,40.2079
2.0973,40.1902
2.0726,40.1743
2.0468,40.1604
2.0199,40.1482
1.9920,40.1380
1.9631,40.1296
1.9331,40.1231
1.9020,40.1184
1.8699,40.1156
1.8367,40.1147
1.8035,40.1156
1.7713,40.1184
1.7402,40.1231
1.7102,40.1296
1.6812,40.1380
1.6533,40.1482
1.6264,40.1604
1.6006,40.1743
1.5758,40.1902
1.5521,40.2079
1.5294,40.2275
1.5078,40.2490
1.4872,40.2723
1.4677,40.2975
1.4493,40.3245
1.4319,40.3534
1.4155,40.3842
1.4002,40.4168
1.3860,40.4513
1.3728,40.4877
1.3607,40.5259
1.3496,40.5660
1.3396,40.6080
1.3307,40.6518
1.3228,40.6975
1.3159,40.7451
1.3101,40.7945
1.3054,40.8458
1.3017,40.8990
1.2990,40.9540
1.2975,41.0109
1.2969,41.0697
0.9367,41.0697
0.9375,40.9917
0.9402,40.9162
0.9446,40.8431
0.9507,40.7726
0.9586,40.7045
0.9683,40.6389
0.9797,40.5757
0.9929,40.5151
1.0079,40.4569
1.0246,40.4012
1.0430,40.3479
1.0632,40.2972
1.0852,40.2489
1.1089,40.2031
1.1344,40.1598
1.1617,40.1189
1.1907,40.0806
1.2214,40.0447
1.2540,40.0112
1.2882,39.9803
1.3243,39.9518
1.3621,39.9258
1.4016,39.9023
1.4429,39.8813
1.4860,39.8627
1.5308,39.8466
1.5774,39.8330
1.6258,39.8218
1.6759,39.8132
1.7277,39.8070
1.7813,39.8033
1.8367,39.8020
Z" /> 
</g><circle cx="41.8060" cy="27.0940" r="0.4000" /> 
<g >
<path style="fill:#000000; fill-opacity:1.0000; 
stroke:#000000; stroke-width:0.0000; stroke-opacity:1; 
stroke-linecap:round; stroke-linejoin:round;fill-rule:evenodd;"
d="M 24.7760,37.1570
23.0760,37.1570
23.0760,35.7570
24.7760,35.7570
Z" /> 
<path style="fill:#000000; fill-opacity:1.0000; 
stroke:#000000; stroke-width:0.0000; stroke-opacity:1; 
stroke-linecap:round; stroke-linejoin:round;fill-rule:evenodd;"
d="M 24.7760,33.7570
23.0760,33.7570
23.0760,32.3570
24.7760,32.3570
Z" /> 
</g>
<g >
</g>
<g style="fill:#000000; fill-opacity:1.0000; 
stroke:#000000; stroke-width:0.0000; stroke-opacity:1; 
stroke-linecap:round; stroke-linejoin:round;">
<path style="fill:#000000; fill-opacity:1.0000; 
stroke:#000000; stroke-width:0.0000; stroke-opacity:1; 
stroke-linecap:round; stroke-linejoin:round;fill-rule:evenodd;"
d="M 17.6900,25.7790
17.6900,27.4790
16.2900,27.4790
16.2900,25.7790
Z" /> 
<path style="fill:#000000; fill-opacity:1.0000; 
stroke:#000000; stroke-width:0.0000; stroke-opacity:1; 
stroke-linecap:round; stroke-linejoin:round;fill-rule:evenodd;"
d="M 14.2900,25.7790
14.2900,27.4790
12.8900,27.4790
12.8900,25.7790
Z" /> 
</g>
<g >
</g>
<g style="fill:#000000; fill-opacity:1.0000; 
stroke:#000000; stroke-width:0.0000; stroke-opacity:1; 
stroke-linecap:round; stroke-linejoin:round;">
<path style="fill:#000000; fill-opacity:1.0000; 
stroke:#000000; stroke-width:0.0000; stroke-opacity:1; 
stroke-linecap:round; stroke-linejoin:round;fill-rule:evenodd;"
d="M 13.9100,5.2850
13.9100,4.2850
15.9100,4.2850
15.9100,5.2850
Z" /> 
<path style="fill:#000000; fill-opacity:1.0000; 
stroke:#000000; stroke-width:0.0000; stroke-opacity:1; 
stroke-linecap:round; stroke-linejoin:round;fill-rule:evenodd;"
d="M 17.2100,7.8250
17.2100,6.8250
19.2100,6.8250
19.2100,7.8250
Z" /> 
<path style="fill:#000000; fill-opacity:1.0000; 
stroke:#000000; stroke-width:0.0000; stroke-opacity:1; 
stroke-linecap:round; stroke-linejoin:round;fill-rule:evenodd;"
d="M 13.9100,10.3650
13.9100,9.3650
15.9100,9.3650
15.9100,10.3650
Z" /> 
<path style="fill:#000000; fill-opacity:1.0000; 
stroke:#000000; stroke-width:0.0000; stroke-opacity:1; 
stroke-linecap:round; stroke-linejoin:round;fill-rule:evenodd;"
d="M 17.2100,12.9050
17.2100,11.9050
19.2100,11.9050
19.2100,12.9050
Z" /> 
<path style="fill:#000000; fill-opacity:1.0000; 
stroke:#000000; stroke-width:0.0000; stroke-opacity:1; 
stroke-linecap:round; stroke-linejoin:round;fill-rule:evenodd;"
d="M 13.9100,15.4450
13.9100,14.4450
15.9100,14.4450
15.9100,15.4450
Z" /> 
<path style="fill:#000000; fill-opacity:1.0000; 
stroke:#000000; stroke-width:0.0000; stroke-opacity:1; 
stroke-linecap:round; stroke-linejoin:round;fill-rule:evenodd;"
d="M 17.2100,17.9850
17.2100,16.9850
19.2100,16.9850
19.2100,17.9850
Z" /> 
<path style="fill:#000000; fill-opacity:1.0000; 
stroke:#000000; stroke-width:0.0000; stroke-opacity:1; 
stroke-linecap:round; stroke-linejoin:round;fill-rule:evenodd;"
d="M 13.9100,20.5250
13.9100,19.5250
15.9100,19.5250
15.9100,20.5250
Z" /> 
<path style="fill:#000000; fill-opacity:1.0000; 
stroke:#000000; stroke-width:0.0000; stroke-opacity:1; 
stroke-linecap:round; stroke-linejoin:round;fill-rule:evenodd;"
d="M 32.4500,20.5250
32.4500,19.5250
34.4500,19.5250
34.4500,20.5250
Z" /> 
<path style="fill:#000000; fill-opacity:1.0000; 
stroke:#000000; stroke-width:0.0000; stroke-opacity:1; 
stroke-linecap:round; stroke-linejoin:round;fill-rule:evenodd;"
d="M 29.1500,17.9850
29.1500,16.9850
31.1500,16.9850
31.1500,17.9850
Z" /> 
<path style="fill:#000000; fill-opacity:1.0000; 
stroke:#000000; stroke-width:0.0000; stroke-opacity:1; 
stroke-linecap:round; stroke-linejoin:round;fill-rule:evenodd;"
d="M 32.4500,15.4450
32.4500,14.4450
34.4500,14.4450
34.4500,15.4450
Z" /> 
<path style="fill:#000000; fill-opacity:1.0000; 
stroke:#000000; stroke-width:0.0000; stroke-opacity:1; 
stroke-linecap:round; stroke-linejoin:round;fill-rule:evenodd;"
d="M 29.1500,12.9050
29.1500,11.9050
31.1500,11.9050
31.1500,12.9050
Z" /> 
<path style="fill:#000000; fill-opacity:1.0000; 
stroke:#000000; stroke-width:0.0000; stroke-opacity:1; 
stroke-linecap:round; stroke-linejoin:round;fill-rule:evenodd;"
d="M 32.4500,10.3650
32.4500,9.3650
34.4500,9.3650
34.4500,10.3650
Z" /> 
<path style="fill:#000000; fill-opacity:1.0000; 
stroke:#000000; stroke-width:0.0000; stroke-opacity:1; 
stroke-linecap:round; stroke-linejoin:round;fill-rule:evenodd;"
d="M 29.1500,7.8250
29.1500,6.8250
31.1500,6.8250
31.1500,7.8250
Z" /> 
<path style="fill:#000000; fill-opacity:1.0000; 
stroke:#000000; stroke-width:0.0000; stroke-opacity:1; 
stroke-linecap:round; stroke-linejoin:round;fill-rule:evenodd;"
d="M 32.4500,5.2850
32.4500,4.2850
34.4500,4.2850
34.4500,5.2850
Z" /> 
</g>
<g >
</g>
<g style="fill:#000000; fill-opacity:1.0000; 
stroke:#000000; stroke-width:0.0000; stroke-opacity:1; 
stroke-linecap:round; stroke-linejoin:round;">
<path style="fill:#000000; fill-opacity:1.0000; 
stroke:#000000; stroke-width:0.0000; stroke-opacity:1; 
stroke-linecap:round; stroke-linejoin:round;fill-rule:evenodd;"
d="M 5.4720,12.2650
3.7720,12.2650
3.7720,10.8650
5.4720,10.8650
Z" /> 
<path style="fill:#000000; fill-opacity:1.0000; 
stroke:#000000; stroke-width:0.0000; stroke-opacity:1; 
stroke-linecap:round; stroke-linejoin:round;fill-rule:evenodd;"
d="M 5.4720,8.8650
3.7720,8.8650
3.7720,7.4650
5.4720,7.4650
Z" /> 
</g>
<g >
</g>
<g style="fill:#000000; fill-opacity:1.0000; 
stroke:#000000; stroke-width:0.0000; stroke-opacity:1; 
stroke-linecap:round; stroke-linejoin:round;">
<path style="fill:#000000; fill-opacity:1.0000; 
stroke:#000000; stroke-width:0.0000; stroke-opacity:1; 
stroke-linecap:round; stroke-linejoin:round;fill-rule:evenodd;"
d="M 7.1420,19.5930
8.6420,19.5930
8.6420,22.0930
7.1420,22.0930
Z" /> 
<path style="fill:#000000; fill-opacity:1.0000; 
stroke:#000000; stroke-width:0.0000; stroke-opacity:1; 
stroke-linecap:round; stroke-linejoin:round;fill-rule:evenodd;"
d="M 7.1420,26.5930
8.6420,26.5930
8.6420,29.0930
7.1420,29.0930
Z" /> 
<path style="fill:#000000; fill-opacity:1.0000; 
stroke:#000000; stroke-width:0.0000; stroke-opacity:1; 
stroke-linecap:round; stroke-linejoin:round;fill-rule:evenodd;"
d="M 3.1420,19.5930
4.6420,19.5930
4.6420,22.0930
3.1420,22.0930
Z" /> 
<path style="fill:#000000; fill-opacity:1.0000; 
stroke:#000000; stroke-width:0.0000; stroke-opacity:1; 
stroke-linecap:round; stroke-linejoin:round;fill-rule:evenodd;"
d="M 3.1420,26.5930
4.6420,26.5930
4.6420,29.0930
3.1420,29.0930
Z" /> 
</g>
<g >
</g>
<g style="fill:#000000; fill-opacity:1.0000; 
stroke:#000000; stroke-width:0.0000; stroke-opacity:1; 
stroke-linecap:round; stroke-linejoin:round;">
<path style="fill:#000000; fill-opacity:1.0000; 
stroke:#000000; stroke-width:0.0000; stroke-opacity:1; 
stroke-linecap:round; stroke-linejoin:round;fill-rule:evenodd;"
d="M 3.7460,16.5570
3.7460,14.8570
5.1460,14.8570
5.1460,16.5570
Z" /> 
<path style="fill:#000000; fill-opacity:1.0000; 
stroke:#000000; stroke-width:0.0000; stroke-opacity:1; 
stroke-linecap:round; stroke-linejoin:round;fill-rule:evenodd;"
d="M 7.1460,16.5570
7.1460,14.8570
8.5460,14.8570
8.5460,16.5570
Z" /> 
</g>
<g >
</g>
<g style="fill:#000000; fill-opacity:1.0000; 
stroke:#000000; stroke-width:0.0000; stroke-opacity:1; 
stroke-linecap:round; stroke-linejoin:round;">
<path style="fill:#000000; fill-opacity:1.0000; 
stroke:#000000; stroke-width:0.0000; stroke-opacity:1; 
stroke-linecap:round; stroke-linejoin:round;fill-rule:evenodd;"
d="M 18.9730,33.9950
20.2430,33.9950
20.2430,36.5350
18.9730,36.5350
Z" /> 
<path style="fill:#000000; fill-opacity:1.0000; 
stroke:#000000; stroke-width:0.0000; stroke-opacity:1; 
stroke-linecap:round; stroke-linejoin:round;fill-rule:evenodd;"
d="M 16.4330,33.9950
17.7030,33.9950
17.7030,36.5350
16.4330,36.5350
Z" /> 
<path style="fill:#000000; fill-opacity:1.0000; 
stroke:#000000; stroke-width:0.0000; stroke-opacity:1; 
stroke-linecap:round; stroke-linejoin:round;fill-rule:evenodd;"
d="M 13.8930,33.9950
15.1630,33.9950
15.1630,36.5350
13.8930,36.5350
Z" /> 
<path style="fill:#000000; fill-opacity:1.0000; 
stroke:#000000; stroke-width:0.0000; stroke-opacity:1; 
stroke-linecap:round; stroke-linejoin:round;fill-rule:evenodd;"
d="M 11.3530,33.9950
12.6230,33.9950
12.6230,36.5350
11.3530,36.5350
Z" /> 
<path style="fill:#000000; fill-opacity:1.0000; 
stroke:#000000; stroke-width:0.0000; stroke-opacity:1; 
stroke-linecap:round; stroke-linejoin:round;fill-rule:evenodd;"
d="M 8.8130,33.9950
10.0830,33.9950
10.0830,36.5350
8.8130,36.5350
Z" /> 
<path style="fill:#000000; fill-opacity:1.0000; 
stroke:#000000; stroke-width:0.0000; stroke-opacity:1; 
stroke-linecap:round; stroke-linejoin:round;fill-rule:evenodd;"
d="M 6.2730,33.9950
7.5430,33.9950
7.5430,36.5350
6.2730,36.5350
Z" /> 
</g>
<g >
</g>
<g style="fill:#000000; fill-opacity:1.0000; 
stroke:#000000; stroke-width:0.0000; stroke-opacity:1; 
stroke-linecap:round; stroke-linejoin:round;">
<circle cx="38.4040" cy="4.7850" r="0.8500" /> 
</g>
<g style="fill:#000000; fill-opacity:1.0000; 
stroke:#000000; stroke-width:0.0212; stroke-opacity:1; 
stroke-linecap:round; stroke-linejoin:round;">
</g>
<g style="fill:#000000; fill-opacity:1.0000; 
stroke:#000000; stroke-width:0.0000; stroke-opacity:1; 
stroke-linecap:round; stroke-linejoin:round;">
<circle cx="38.4040" cy="7.3250" r="0.8500" /> 
<circle cx="38.4040" cy="9.8650" r="0.8500" /> 
<circle cx="38.4040" cy="12.4050" r="0.8500" /> 
<circle cx="38.4040" cy="14.9450" r="0.8500" /> 
<circle cx="38.4040" cy="17.4850" r="0.8500" /> 
<circle cx="38.4040" cy="20.0250" r="0.8500" /> 
</g>
<g >
</g>
<g style="fill:#000000; fill-opacity:1.0000; 
stroke:#000000; stroke-width:0.0000; stroke-opacity:1; 
stroke-linecap:round; stroke-linejoin:round;">
<path style="fill:#000000; fill-opacity:1.0000; 
stroke:#000000; stroke-width:0.0000; stroke-opacity:1; 
stroke-linecap:round; stroke-linejoin:round;fill-rule:evenodd;"
d="M 40.9360,37.8590
40.9360,39.5590
39.5360,39.5590
39.5360,37.8590
Z" /> 
<path style="fill:#000000; fill-opacity:1.0000; 
stroke:#000000; stroke-width:0.0000; stroke-opacity:1; 
stroke-linecap:round; stroke-linejoin:round;fill-rule:evenodd;"
d="M 37.5360,37.8590
37.5360,39.5590
36.1360,39.5590
36.1360,37.8590
Z" /> 
</g>
<g >
</g>
<g style="fill:#000000; fill-opacity:1.0000; 
stroke:#000000; stroke-width:0.0000; stroke-opacity:1; 
stroke-linecap:round; stroke-linejoin:round;">
<path style="fill:#000000; fill-opacity:1.0000; 
stroke:#000000; stroke-width:0.0000; stroke-opacity:1; 
stroke-linecap:round; stroke-linejoin:round;fill-rule:evenodd;"
d="M 32.0660,33.3590
32.8060,33.3590
32.8060,35.7590
32.0660,35.7590
Z" /> 
<path style="fill:#000000; fill-opacity:1.0000; 
stroke:#000000; stroke-width:0.0000; stroke-opacity:1; 
stroke-linecap:round; stroke-linejoin:round;fill-rule:evenodd;"
d="M 32.0660,37.2590
32.8060,37.2590
32.8060,39.6590
32.0660,39.6590
Z" /> 
<path style="fill:#000000; fill-opacity:1.0000; 
stroke:#000000; stroke-width:0.0000; stroke-opacity:1; 
stroke-linecap:round; stroke-linejoin:round;fill-rule:evenodd;"
d="M 30.7960,33.3590
31.5360,33.3590
31.5360,35.7590
30.7960,35.7590
Z" /> 
<path style="fill:#000000; fill-opacity:1.0000; 
stroke:#000000; stroke-width:0.0000; stroke-opacity:1; 
stroke-linecap:round; stroke-linejoin:round;fill-rule:evenodd;"
d="M 30.7960,37.2590
31.5360,37.2590
31.5360,39.6590
30.7960,39.6590
Z" /> 
<path style="fill:#000000; fill-opacity:1.0000; 
stroke:#000000; stroke-width:0.0000; stroke-opacity:1; 
stroke-linecap:round; stroke-linejoin:round;fill-rule:evenodd;"
d="M 29.5260,33.3590
30.2660,33.3590
30.2660,35.7590
29.5260,35.7590
Z" /> 
<path style="fill:#000000; fill-opacity:1.0000; 
stroke:#000000; stroke-width:0.0000; stroke-opacity:1; 
stroke-linecap:round; stroke-linejoin:round;fill-rule:evenodd;"
d="M 29.5260,37.2590
30.2660,37.2590
30.2660,39.6590
29.5260,39.6590
Z" /> 
<path style="fill:#000000; fill-opacity:1.0000; 
stroke:#000000; stroke-width:0.0000; stroke-opacity:1; 
stroke-linecap:round; stroke-linejoin:round;fill-rule:evenodd;"
d="M 28.2560,33.3590
28.9960,33.3590
28.9960,35.7590
28.2560,35.7590
Z" /> 
<path style="fill:#000000; fill-opacity:1.0000; 
stroke:#000000; stroke-width:0.0000; stroke-opacity:1; 
stroke-linecap:round; stroke-linejoin:round;fill-rule:evenodd;"
d="M 28.2560,37.2590
28.9960,37.2590
28.9960,39.6590
28.2560,39.6590
Z" /> 
<path style="fill:#000000; fill-opacity:1.0000; 
stroke:#000000; stroke-width:0.0000; stroke-opacity:1; 
stroke-linecap:round; stroke-linejoin:round;fill-rule:evenodd;"
d="M 26.9860,33.3590
27.7260,33.3590
27.7260,35.7590
26.9860,35.7590
Z" /> 
<path style="fill:#000000; fill-opacity:1.0000; 
stroke:#000000; stroke-width:0.0000; stroke-opacity:1; 
stroke-linecap:round; stroke-linejoin:round;fill-rule:evenodd;"
d="M 26.9860,37.2590
27.7260,37.2590
27.7260,39.6590
26.9860,39.6590
Z" /> 
</g>
<g >
</g>
<g style="fill:#000000; fill-opacity:1.0000; 
stroke:#000000; stroke-width:0.0000; stroke-opacity:1; 
stroke-linecap:round; stroke-linejoin:round;">
<path style="fill:#000000; fill-opacity:1.0000; 
stroke:#000000; stroke-width:0.0000; stroke-opacity:1; 
stroke-linecap:round; stroke-linejoin:round;fill-rule:evenodd;"
d="M 33.5360,29.8390
31.8360,29.8390
31.8360,28.4390
33.5360,28.4390
Z" /> 
<path style="fill:#000000; fill-opacity:1.0000; 
stroke:#000000; stroke-width:0.0000; stroke-opacity:1; 
stroke-linecap:round; stroke-linejoin:round;fill-rule:evenodd;"
d="M 33.5360,26.4390
31.8360,26.4390
31.8360,25.0390
33.5360,25.0390
Z" /> 
</g>
<g >
</g>
<g style="fill:#000000; fill-opacity:1.0000; 
stroke:#000000; stroke-width:0.0000; stroke-opacity:1; 
stroke-linecap:round; stroke-linejoin:round;">
<path style="fill:#000000; fill-opacity:1.0000; 
stroke:#000000; stroke-width:0.0000; stroke-opacity:1; 
stroke-linecap:round; stroke-linejoin:round;fill-rule:evenodd;"
d="M 6.7940,5.6350
6.7940,3.9350
8.1940,3.9350
8.1940,5.6350
Z" /> 
<path style="fill:#000000; fill-opacity:1.0000; 
stroke:#000000; stroke-width:0.0000; stroke-opacity:1; 
stroke-linecap:round; stroke-linejoin:round;fill-rule:evenodd;"
d="M 10.1940,5.6350
10.1940,3.9350
11.5940,3.9350
11.5940,5.6350
Z" /> 
</g>
<g >
</g>
<g style="fill:#000000; fill-opacity:1.0000; 
stroke:#000000; stroke-width:0.0000; stroke-opacity:1; 
stroke-linecap:round; stroke-linejoin:round;">
<path style="fill:#000000; fill-opacity:1.0000; 
stroke:#000000; stroke-width:0.0000; stroke-opacity:1; 
stroke-linecap:round; stroke-linejoin:round;fill-rule:evenodd;"
d="M 39.7760,26.3940
40.7760,26.3940
40.7760,29.5440
39.7760,29.5440
Z" /> 
<path style="fill:#000000; fill-opacity:1.0000; 
stroke:#000000; stroke-width:0.0000; stroke-opacity:1; 
stroke-linecap:round; stroke-linejoin:round;fill-rule:evenodd;"
d="M 39.7760,31.4440
40.7760,31.4440
40.7760,34.5940
39.7760,34.5940
Z" /> 
<path style="fill:#000000; fill-opacity:1.0000; 
stroke:#000000; stroke-width:0.0000; stroke-opacity:1; 
stroke-linecap:round; stroke-linejoin:round;fill-rule:evenodd;"
d="M 37.2360,26.3940
38.2360,26.3940
38.2360,29.5440
37.2360,29.5440
Z" /> 
<path style="fill:#000000; fill-opacity:1.0000; 
stroke:#000000; stroke-width:0.0000; stroke-opacity:1; 
stroke-linecap:round; stroke-linejoin:round;fill-rule:evenodd;"
d="M 37.2360,31.4440
38.2360,31.4440
38.2360,34.5940
37.2360,34.5940
Z" /> 
</g>
<g >
</g>
<g style="fill:#000000; fill-opacity:1.0000; 
stroke:#000000; stroke-width:0.0000; stroke-opacity:1; 
stroke-linecap:round; stroke-linejoin:round;">
<path style="fill:#000000; fill-opacity:1.0000; 
stroke:#000000; stroke-width:0.0000; stroke-opacity:1; 
stroke-linecap:round; stroke-linejoin:round;fill-rule:evenodd;"
d="M 24.7760,29.8390
23.0760,29.8390
23.0760,28.4390
24.7760,28.4390
Z" /> 
<path style="fill:#000000; fill-opacity:1.0000; 
stroke:#000000; stroke-width:0.0000; stroke-opacity:1; 
stroke-linecap:round; stroke-linejoin:round;fill-rule:evenodd;"
d="M 24.7760,26.4390
23.0760,26.4390
23.0760,25.0390
24.7760,25.0390
Z" /> 
</g>
<g >
</g>
<g >
</g>
<g style="fill:#000000; fill-opacity:1.0000; 
stroke:#000000; stroke-width:0.0000; stroke-opacity:1; 
stroke-linecap:round; stroke-linejoin:round;">
</g>
<g style="fill:#000000; fill-opacity:1.0000; 
stroke:#000000; stroke-width:0.4000; stroke-opacity:1; 
stroke-linecap:round; stroke-linejoin:round;">
</g>
<g style="fill:#000000; fill-opacity:0.0; 
stroke:#000000; stroke-width:0.4000; stroke-opacity:1; 
stroke-linecap:round; stroke-linejoin:round;">
<path d="M4.6220 8.1650
L4.6220 6.0550
" />
<path d="M4.6220 6.0550
L5.8920 4.7850
" />
<path d="M5.8920 4.7850
L7.4940 4.7850
" />
<path d="M10.8940 4.7850
L14.9100 4.7850
" />
<path d="M23.9260 29.1390
L23.9260 33.0570
" />
<path d="M23.9260 23.8350
L23.9260 25.7390
" />
<path d="M14.9100 20.0250
L20.1160 20.0250
" />
<path d="M20.1160 20.0250
L23.9260 23.8350
" />
<path d="M32.6860 29.2490
L33.8760 30.4390
" />
<path d="M33.8760 30.4390
L33.8760 35.7490
" />
<path d="M33.8760 35.7490
L36.8360 38.7090
" />
<path d="M32.6860 29.1390
L32.6860 29.2490
" />
<path d="M33.4500 20.0250
L33.4660 20.0410
" />
<path d="M33.4660 20.0410
L33.4660 24.9590
" />
<path d="M33.4500 20.0250
L38.4040 20.0250
" />
<path d="M33.4660 24.9590
L32.6860 25.7390
" />
<path d="M17.0680 26.7070
L16.9900 26.6290
" />
<path d="M17.0680 35.2650
L17.0680 26.7070
" />
<path d="M10.7180 12.6590
L10.7180 27.3910
" />
<path d="M10.7180 27.3910
L14.5280 31.2010
" />
<path d="M14.5280 31.2010
L14.5280 35.2650
" />
<path d="M13.5120 9.8650
L10.7180 12.6590
" />
<path d="M14.9100 9.8650
L13.5120 9.8650
" />
<path d="M11.9880 41.6150
L11.9880 35.2650
" />
<path d="M39.9280 4.7850
L40.0550 4.9120
" />
<path d="M43.7380 40.3450
L41.1140 42.9690
" />
<path d="M41.1140 42.9690
L13.3420 42.9690
" />
<path d="M13.3420 42.9690
L11.9880 41.6150
" />
<path d="M43.7380 8.5950
L43.7380 40.3450
" />
<path d="M39.9230 4.7800
L40.0550 4.9120
" />
<path d="M40.0550 4.9120
L43.7380 8.5950
" />
<path d="M33.4500 4.7850
L38.4040 4.7850
" />
<path d="M38.4040 4.7850
L39.9280 4.7850
" />
<path d="M29.9460 38.4790
L29.9460 40.3390
" />
<path d="M42.4680 36.4770
L42.4680 29.8090
" />
<path d="M30.1500 7.3250
L38.4040 7.3250
" />
<path d="M42.4680 30.1610
L40.2760 27.9690
" />
<path d="M14.5280 41.6150
L13.2580 40.3450
" />
<path d="M23.9260 41.6150
L14.5280 41.6150
" />
<path d="M42.4680 9.8650
L42.4680 28.1530
" />
<path d="M5.8920 34.2490
L6.9080 35.2650
" />
<path d="M4.6220 15.5310
L4.4460 15.7070
" />
<path d="M13.2580 33.2910
L12.0760 32.1090
" />
<path d="M4.4460 17.3090
L5.8920 18.7550
" />
<path d="M4.4460 15.7070
L4.4460 17.3090
" />
<path d="M23.9260 41.6150
L27.4000 41.6150
" />
<path d="M27.4000 41.6150
L28.6760 40.3390
" />
<path d="M23.9260 36.4570
L23.9260 41.6150
" />
<path d="M39.9280 41.6150
L42.4680 39.0750
" />
<path d="M5.8920 32.1090
L5.8920 32.7250
" />
<path d="M12.0760 32.1090
L5.8920 32.1090
" />
<path d="M29.9460 40.3390
L31.2220 41.6150
" />
<path d="M39.9180 7.3250
L39.9230 7.3200
" />
<path d="M31.2220 41.6150
L33.5780 41.6150
" />
<path d="M5.8920 18.7550
L5.8920 32.7250
" />
<path d="M5.8920 32.7250
L5.8920 34.2490
" />
<path d="M13.2580 40.3450
L13.2580 33.2910
" />
<path d="M4.6220 11.5650
L4.6220 15.5310
" />
<path d="M28.6760 40.3390
L28.6760 38.4790
" />
<path d="M42.4680 29.8090
L42.4680 28.1530
" />
<path d="M28.6760 38.4790
L29.9460 38.4790
" />
<path d="M33.5780 41.6150
L39.9280 41.6150
" />
<path d="M40.2360 38.7090
L42.4680 36.4770
" />
<path d="M42.4680 39.0750
L42.4680 28.1530
" />
<path d="M33.5780 41.6150
L33.5780 38.4850
" />
<path d="M39.9230 7.3200
L42.4680 9.8650
" />
<path d="M38.4040 7.3250
L39.9180 7.3250
" />
<path d="M32.4360 33.4430
L32.4360 32.8190
" />
<path d="M30.2860 30.6690
L30.2860 17.6210
" />
<path d="M36.7960 35.6190
L35.2160 34.0390
" />
<path d="M40.2760 34.5290
L39.1860 35.6190
" />
<path d="M40.2760 33.0190
L40.2760 34.5290
" />
<path d="M35.2160 28.9190
L33.6960 27.3990
" />
<path d="M35.2160 34.0390
L35.2160 28.9190
" />
<path d="M32.4360 32.8190
L30.2860 30.6690
" />
<path d="M30.1500 17.4850
L38.4040 17.4850
" />
<path d="M33.6960 27.3990
L31.5960 27.3990
" />
<path d="M31.5960 27.3990
L30.2860 26.0890
" />
<path d="M39.1860 35.6190
L36.7960 35.6190
" />
<path d="M30.2860 17.6210
L30.1500 17.4850
" />
<path d="M27.9900 21.0730
L28.6260 21.7090
" />
<path d="M36.1960 30.1690
L37.7360 31.7090
" />
<path d="M27.9900 15.9610
L27.9900 21.0730
" />
<path d="M33.4500 14.9450
L38.4040 14.9450
" />
<path d="M40.3460 16.8870
L40.3460 22.2590
" />
<path d="M39.1160 23.4890
L37.6160 23.4890
" />
<path d="M36.1960 24.9090
L36.1960 30.1690
" />
<path d="M38.4040 14.9450
L40.3460 16.8870
" />
<path d="M37.6160 23.4890
L36.1960 24.9090
" />
<path d="M37.7360 31.7090
L37.7360 33.0190
" />
<path d="M28.6260 21.7090
L28.6260 34.5590
" />
<path d="M29.0060 14.9450
L27.9900 15.9610
" />
<path d="M33.4500 14.9450
L29.0060 14.9450
" />
<path d="M40.3460 22.2590
L39.1160 23.4890
" />
<path d="M30.1500 12.4050
L38.4040 12.4050
" />
<path d="M26.7200 33.9230
L26.7200 13.6750
" />
<path d="M41.1460 15.1470
L41.1460 23.2690
" />
<path d="M41.1460 23.2690
L37.7360 26.6790
" />
<path d="M37.7360 26.6790
L37.7360 27.9690
" />
<path d="M27.9900 12.4050
L30.1500 12.4050
" />
<path d="M38.4040 12.4050
L41.1460 15.1470
" />
<path d="M26.7200 13.6750
L27.9900 12.4050
" />
<path d="M27.3560 34.5590
L26.7200 33.9230
" />
<path d="M7.8920 20.8430
L7.8920 15.7530
" />
<path d="M7.8920 15.7530
L7.8460 15.7070
" />
<path d="M7.8460 12.7370
L13.2580 7.3250
" />
<path d="M13.2580 7.3250
L18.2100 7.3250
" />
<path d="M7.8920 20.8430
L7.8920 27.8430
" />
<path d="M7.8460 15.7070
L7.8460 12.7370
" />
<path d="M1.3200 18.2710
L3.8920 20.8430
" />
<path d="M20.3700 3.7690
L18.5920 1.9910
" />
<path d="M1.3200 5.5470
L1.3200 18.2710
" />
<path d="M23.4180 9.8650
L20.3700 6.8170
" />
<path d="M4.8760 1.9910
L1.3200 5.5470
" />
<path d="M3.8920 20.8430
L3.8920 27.8430
" />
<path d="M18.5920 1.9910
L4.8760 1.9910
" />
<path d="M38.4040 9.8650
L23.4180 9.8650
" />
<path d="M20.3700 6.8170
L20.3700 3.7690
" />
<path d="M11.9880 14.1830
L11.9880 25.3590
" />
<path d="M13.2580 26.6290
L13.5900 26.6290
" />
<path d="M18.2100 12.4050
L13.7660 12.4050
" />
<path d="M11.9880 25.3590
L13.2580 26.6290
" />
<path d="M13.7660 12.4050
L11.9880 14.1830
" />
</g>
<g >
</g>
</g>
<g style="fill:#FFFFFF; fill-opacity:0.0; 
stroke:#FFFFFF; stroke-width:0.4000; stroke-opacity:1; 
stroke-linecap:round; stroke-linejoin:round;">
</g>
<g style="fill:#FFFFFF; fill-opacity:1.0000; 
stroke:#FFFFFF; stroke-width:0.0000; stroke-opacity:1; 
stroke-linecap:round; stroke-linejoin:round;">
<circle cx="38.4040" cy="4.7850" r="0.5000" /> 
</g>
<g style="fill:#FFFFFF; fill-opacity:1.0000; 
stroke:#FFFFFF; stroke-width:0.0212; stroke-opacity:1; 
stroke-linecap:round; stroke-linejoin:round;">
</g>
<g style="fill:#FFFFFF; fill-opacity:1.0000; 
stroke:#FFFFFF; stroke-width:0.0000; stroke-opacity:1; 
stroke-linecap:round; stroke-linejoin:round;">
<circle cx="38.4040" cy="7.3250" r="0.5000" /> 
</g>
<g style="fill:#FFFFFF; fill-opacity:1.0000; 
stroke:#FFFFFF; stroke-width:0.0212; stroke-opacity:1; 
stroke-linecap:round; stroke-linejoin:round;">
</g>
<g style="fill:#FFFFFF; fill-opacity:1.0000; 
stroke:#FFFFFF; stroke-width:0.0000; stroke-opacity:1; 
stroke-linecap:round; stroke-linejoin:round;">
<circle cx="38.4040" cy="9.8650" r="0.5000" /> 
</g>
<g style="fill:#FFFFFF; fill-opacity:1.0000; 
stroke:#FFFFFF; stroke-width:0.0212; stroke-opacity:1; 
stroke-linecap:round; stroke-linejoin:round;">
</g>
<g style="fill:#FFFFFF; fill-opacity:1.0000; 
stroke:#FFFFFF; stroke-width:0.0000; stroke-opacity:1; 
stroke-linecap:round; stroke-linejoin:round;">
<circle cx="38.4040" cy="12.4050" r="0.5000" /> 
</g>
<g style="fill:#FFFFFF; fill-opacity:1.0000; 
stroke:#FFFFFF; stroke-width:0.0212; stroke-opacity:1; 
stroke-linecap:round; stroke-linejoin:round;">
</g>
<g style="fill:#FFFFFF; fill-opacity:1.0000; 
stroke:#FFFFFF; stroke-width:0.0000; stroke-opacity:1; 
stroke-linecap:round; stroke-linejoin:round;">
<circle cx="38.4040" cy="14.9450" r="0.5000" /> 
</g>
<g style="fill:#FFFFFF; fill-opacity:1.0000; 
stroke:#FFFFFF; stroke-width:0.0212; stroke-opacity:1; 
stroke-linecap:round; stroke-linejoin:round;">
</g>
<g style="fill:#FFFFFF; fill-opacity:1.0000; 
stroke:#FFFFFF; stroke-width:0.0000; stroke-opacity:1; 
stroke-linecap:round; stroke-linejoin:round;">
<circle cx="38.4040" cy="17.4850" r="0.5000" /> 
</g>
<g style="fill:#FFFFFF; fill-opacity:1.0000; 
stroke:#FFFFFF; stroke-width:0.0212; stroke-opacity:1; 
stroke-linecap:round; stroke-linejoin:round;">
</g>
<g style="fill:#FFFFFF; fill-opacity:1.0000; 
stroke:#FFFFFF; stroke-width:0.0000; stroke-opacity:1; 
stroke-linecap:round; stroke-linejoin:round;">
<circle cx="38.4040" cy="20.0250" r="0.5000" /> 
</g>
<g style="fill:#FFFFFF; fill-opacity:1.0000; 
stroke:#FFFFFF; stroke-width:0.0212; stroke-opacity:1; 
stroke-linecap:round; stroke-linejoin:round;">
</g>
<g style="fill:#000000; fill-opacity:1.0000; 
stroke:#000000; stroke-width:0.0212; stroke-opacity:1; 
stroke-linecap:round; stroke-linejoin:round;">
</g>
<g style="fill:#000000; fill-opacity:0.0; 
stroke:#000000; stroke-width:0.1000; stroke-opacity:1; 
stroke-linecap:round; stroke-linejoin:round;">
<path d="M0.0500 42.8850 A2.7940 2.7940 0.0 0 0 2.8440 45.6790" />
<path d="M45.2620 3.5150 A2.7940 2.7940 0.0 0 0 42.4680 0.7210" />
<path d="M45.2620 42.8850
L45.2620 3.5150
" />
<path d="M42.4680 0.7210
L2.8440 0.7210
" />
<path d="M0.0500 3.5150
L0.0500 42.8850
" />
<path d="M42.4680 45.6790 A2.7940 2.7940 0.0 0 0 45.2620 42.8850" />
<path d="M2.8440 45.6790
L42.4680 45.6790
" />
<path d="M2.8440 0.7210 A2.7940 2.7940 0.0 0 0 0.0500 3.5150" />
<g >
</g>
<g >
</g>
<g >
</g>
<g >
</g>
<g >
</g>
<g >
</g>
<g >
</g>
<g >
</g>
<g >
</g>
<g >
</g>
<g >
</g>
<g >
</g>
<g >
</g>
<g >
</g>
<g >
</g>
<g >
</g>
<g >
</g>
</g> 
</svg>
