G04 #@! TF.GenerationSoftware,KiCad,Pcbnew,(5.1.5-0-10_14)*
G04 #@! TF.CreationDate,2020-09-21T09:54:51+02:00*
G04 #@! TF.ProjectId,BarduinoStepperBoard,42617264-7569-46e6-9f53-746570706572,rev?*
G04 #@! TF.SameCoordinates,Original*
G04 #@! TF.FileFunction,Copper,L1,Top*
G04 #@! TF.FilePolarity,Positive*
%FSLAX46Y46*%
G04 Gerber Fmt 4.6, Leading zero omitted, Abs format (unit mm)*
G04 Created by KiCad (PCBNEW (5.1.5-0-10_14)) date 2020-09-21 09:54:51*
%MOMM*%
%LPD*%
G04 APERTURE LIST*
%ADD10C,0.100000*%
%ADD11R,5.397500X6.197600*%
%ADD12R,0.998220X1.597660*%
%ADD13R,1.270000X1.905000*%
%ADD14R,1.198880X0.998220*%
%ADD15R,1.905000X1.270000*%
%ADD16O,1.600000X1.600000*%
%ADD17R,1.600000X1.600000*%
%ADD18O,1.524000X3.048000*%
%ADD19O,3.048000X1.524000*%
%ADD20R,1.500000X0.800000*%
%ADD21R,1.400000X0.800000*%
%ADD22R,1.500000X1.300000*%
%ADD23R,1.500000X1.500000*%
%ADD24R,1.000000X1.450000*%
%ADD25R,1.550000X1.000000*%
%ADD26R,1.750000X0.700000*%
%ADD27R,1.270000X2.540000*%
%ADD28R,1.524000X3.000000*%
%ADD29R,3.000000X1.524000*%
%ADD30R,2.540000X1.270000*%
%ADD31O,4.000000X1.800000*%
%ADD32O,1.800000X4.000000*%
%ADD33R,1.800000X4.400000*%
%ADD34R,2.200000X2.200000*%
%ADD35O,2.200000X2.200000*%
%ADD36R,0.300000X1.600000*%
%ADD37R,3.000000X3.000000*%
%ADD38C,3.000000*%
%ADD39C,0.800000*%
%ADD40C,2.000000*%
%ADD41C,0.800000*%
%ADD42C,0.400000*%
%ADD43C,1.500000*%
%ADD44C,0.200000*%
%ADD45C,0.300000*%
G04 APERTURE END LIST*
G04 #@! TA.AperFunction,ComponentPad*
D10*
G36*
X166862000Y-101784000D02*
G01*
X164322000Y-101784000D01*
X164322000Y-100260000D01*
X166862000Y-100260000D01*
X166862000Y-101784000D01*
G37*
G04 #@! TD.AperFunction*
G04 #@! TA.AperFunction,ComponentPad*
G36*
X164322000Y-97720000D02*
G01*
X166862000Y-97720000D01*
X166862000Y-99244000D01*
X164322000Y-99244000D01*
X164322000Y-97720000D01*
G37*
G04 #@! TD.AperFunction*
G04 #@! TA.AperFunction,ComponentPad*
G36*
X164322000Y-88720000D02*
G01*
X166862000Y-88720000D01*
X166862000Y-90244000D01*
X164322000Y-90244000D01*
X164322000Y-88720000D01*
G37*
G04 #@! TD.AperFunction*
G04 #@! TA.AperFunction,ComponentPad*
G36*
X164322000Y-86080000D02*
G01*
X166862000Y-86080000D01*
X166862000Y-87604000D01*
X164322000Y-87604000D01*
X164322000Y-86080000D01*
G37*
G04 #@! TD.AperFunction*
G04 #@! TA.AperFunction,ComponentPad*
G36*
X145780000Y-100260000D02*
G01*
X148320000Y-100260000D01*
X148320000Y-101784000D01*
X145780000Y-101784000D01*
X145780000Y-100260000D01*
G37*
G04 #@! TD.AperFunction*
G04 #@! TA.AperFunction,ComponentPad*
G36*
X145780000Y-97720000D02*
G01*
X148320000Y-97720000D01*
X148320000Y-99244000D01*
X145780000Y-99244000D01*
X145780000Y-97720000D01*
G37*
G04 #@! TD.AperFunction*
G04 #@! TA.AperFunction,ComponentPad*
G36*
X145780000Y-88720000D02*
G01*
X148320000Y-88720000D01*
X148320000Y-90244000D01*
X145780000Y-90244000D01*
X145780000Y-88720000D01*
G37*
G04 #@! TD.AperFunction*
G04 #@! TA.AperFunction,ComponentPad*
G36*
X145780000Y-86080000D02*
G01*
X148320000Y-86080000D01*
X148320000Y-87604000D01*
X145780000Y-87604000D01*
X145780000Y-86080000D01*
G37*
G04 #@! TD.AperFunction*
D11*
X173430000Y-75570000D03*
D12*
X171151620Y-68272580D03*
X175708380Y-68272580D03*
D13*
X95599000Y-84750000D03*
X98901000Y-84750000D03*
X98871000Y-81970000D03*
X95569000Y-81970000D03*
D14*
X98768700Y-77819360D03*
X98768700Y-75320000D03*
X98768700Y-72820640D03*
D15*
X150680000Y-76641000D03*
X150680000Y-73339000D03*
G04 #@! TA.AperFunction,ComponentPad*
D10*
G36*
X153168000Y-82740000D02*
G01*
X153168000Y-80200000D01*
X154692000Y-80200000D01*
X154692000Y-82740000D01*
X153168000Y-82740000D01*
G37*
G04 #@! TD.AperFunction*
G04 #@! TA.AperFunction,ComponentPad*
G36*
X153168000Y-70040000D02*
G01*
X153168000Y-67500000D01*
X154692000Y-67500000D01*
X154692000Y-70040000D01*
X153168000Y-70040000D01*
G37*
G04 #@! TD.AperFunction*
G04 #@! TA.AperFunction,ComponentPad*
G36*
X150628000Y-82740000D02*
G01*
X150628000Y-80200000D01*
X152152000Y-80200000D01*
X152152000Y-82740000D01*
X150628000Y-82740000D01*
G37*
G04 #@! TD.AperFunction*
G04 #@! TA.AperFunction,ComponentPad*
G36*
X148088000Y-82740000D02*
G01*
X148088000Y-80200000D01*
X149612000Y-80200000D01*
X149612000Y-82740000D01*
X148088000Y-82740000D01*
G37*
G04 #@! TD.AperFunction*
G04 #@! TA.AperFunction,ComponentPad*
G36*
X145548000Y-82740000D02*
G01*
X145548000Y-80200000D01*
X147072000Y-80200000D01*
X147072000Y-82740000D01*
X145548000Y-82740000D01*
G37*
G04 #@! TD.AperFunction*
G04 #@! TA.AperFunction,ComponentPad*
G36*
X143008000Y-82740000D02*
G01*
X143008000Y-80200000D01*
X144532000Y-80200000D01*
X144532000Y-82740000D01*
X143008000Y-82740000D01*
G37*
G04 #@! TD.AperFunction*
G04 #@! TA.AperFunction,ComponentPad*
G36*
X150628000Y-70040000D02*
G01*
X150628000Y-67500000D01*
X152152000Y-67500000D01*
X152152000Y-70040000D01*
X150628000Y-70040000D01*
G37*
G04 #@! TD.AperFunction*
G04 #@! TA.AperFunction,ComponentPad*
G36*
X148088000Y-70040000D02*
G01*
X148088000Y-67500000D01*
X149612000Y-67500000D01*
X149612000Y-70040000D01*
X148088000Y-70040000D01*
G37*
G04 #@! TD.AperFunction*
G04 #@! TA.AperFunction,ComponentPad*
G36*
X145548000Y-70040000D02*
G01*
X145548000Y-67500000D01*
X147072000Y-67500000D01*
X147072000Y-70040000D01*
X145548000Y-70040000D01*
G37*
G04 #@! TD.AperFunction*
G04 #@! TA.AperFunction,ComponentPad*
G36*
X143008000Y-70040000D02*
G01*
X143008000Y-67500000D01*
X144532000Y-67500000D01*
X144532000Y-70040000D01*
X143008000Y-70040000D01*
G37*
G04 #@! TD.AperFunction*
D16*
X154800000Y-107000000D03*
X172580000Y-119700000D03*
X157340000Y-107000000D03*
X170040000Y-119700000D03*
X159880000Y-107000000D03*
X167500000Y-119700000D03*
X162420000Y-107000000D03*
X164960000Y-119700000D03*
X164960000Y-107000000D03*
X162420000Y-119700000D03*
X167500000Y-107000000D03*
X159880000Y-119700000D03*
X170040000Y-107000000D03*
X157340000Y-119700000D03*
X172580000Y-107000000D03*
D17*
X154800000Y-119700000D03*
D16*
X130730000Y-107000000D03*
X148510000Y-119700000D03*
X133270000Y-107000000D03*
X145970000Y-119700000D03*
X135810000Y-107000000D03*
X143430000Y-119700000D03*
X138350000Y-107000000D03*
X140890000Y-119700000D03*
X140890000Y-107000000D03*
X138350000Y-119700000D03*
X143430000Y-107000000D03*
X135810000Y-119700000D03*
X145970000Y-107000000D03*
X133270000Y-119700000D03*
X148510000Y-107000000D03*
D17*
X130730000Y-119700000D03*
D16*
X103400000Y-106930000D03*
X121180000Y-119630000D03*
X105940000Y-106930000D03*
X118640000Y-119630000D03*
X108480000Y-106930000D03*
X116100000Y-119630000D03*
X111020000Y-106930000D03*
X113560000Y-119630000D03*
X113560000Y-106930000D03*
X111020000Y-119630000D03*
X116100000Y-106930000D03*
X108480000Y-119630000D03*
X118640000Y-106930000D03*
X105940000Y-119630000D03*
X121180000Y-106930000D03*
D17*
X103400000Y-119630000D03*
G04 #@! TA.AperFunction,SMDPad,CuDef*
D10*
G36*
X162849504Y-112401204D02*
G01*
X162873773Y-112404804D01*
X162897571Y-112410765D01*
X162920671Y-112419030D01*
X162942849Y-112429520D01*
X162963893Y-112442133D01*
X162983598Y-112456747D01*
X163001777Y-112473223D01*
X163018253Y-112491402D01*
X163032867Y-112511107D01*
X163045480Y-112532151D01*
X163055970Y-112554329D01*
X163064235Y-112577429D01*
X163070196Y-112601227D01*
X163073796Y-112625496D01*
X163075000Y-112650000D01*
X163075000Y-113750000D01*
X163073796Y-113774504D01*
X163070196Y-113798773D01*
X163064235Y-113822571D01*
X163055970Y-113845671D01*
X163045480Y-113867849D01*
X163032867Y-113888893D01*
X163018253Y-113908598D01*
X163001777Y-113926777D01*
X162983598Y-113943253D01*
X162963893Y-113957867D01*
X162942849Y-113970480D01*
X162920671Y-113980970D01*
X162897571Y-113989235D01*
X162873773Y-113995196D01*
X162849504Y-113998796D01*
X162825000Y-114000000D01*
X159400000Y-114000000D01*
X159375496Y-113998796D01*
X159351227Y-113995196D01*
X159327429Y-113989235D01*
X159304329Y-113980970D01*
X159282151Y-113970480D01*
X159261107Y-113957867D01*
X159241402Y-113943253D01*
X159223223Y-113926777D01*
X159206747Y-113908598D01*
X159192133Y-113888893D01*
X159179520Y-113867849D01*
X159169030Y-113845671D01*
X159160765Y-113822571D01*
X159154804Y-113798773D01*
X159151204Y-113774504D01*
X159150000Y-113750000D01*
X159150000Y-112650000D01*
X159151204Y-112625496D01*
X159154804Y-112601227D01*
X159160765Y-112577429D01*
X159169030Y-112554329D01*
X159179520Y-112532151D01*
X159192133Y-112511107D01*
X159206747Y-112491402D01*
X159223223Y-112473223D01*
X159241402Y-112456747D01*
X159261107Y-112442133D01*
X159282151Y-112429520D01*
X159304329Y-112419030D01*
X159327429Y-112410765D01*
X159351227Y-112404804D01*
X159375496Y-112401204D01*
X159400000Y-112400000D01*
X162825000Y-112400000D01*
X162849504Y-112401204D01*
G37*
G04 #@! TD.AperFunction*
G04 #@! TA.AperFunction,SMDPad,CuDef*
G36*
X169024504Y-112401204D02*
G01*
X169048773Y-112404804D01*
X169072571Y-112410765D01*
X169095671Y-112419030D01*
X169117849Y-112429520D01*
X169138893Y-112442133D01*
X169158598Y-112456747D01*
X169176777Y-112473223D01*
X169193253Y-112491402D01*
X169207867Y-112511107D01*
X169220480Y-112532151D01*
X169230970Y-112554329D01*
X169239235Y-112577429D01*
X169245196Y-112601227D01*
X169248796Y-112625496D01*
X169250000Y-112650000D01*
X169250000Y-113750000D01*
X169248796Y-113774504D01*
X169245196Y-113798773D01*
X169239235Y-113822571D01*
X169230970Y-113845671D01*
X169220480Y-113867849D01*
X169207867Y-113888893D01*
X169193253Y-113908598D01*
X169176777Y-113926777D01*
X169158598Y-113943253D01*
X169138893Y-113957867D01*
X169117849Y-113970480D01*
X169095671Y-113980970D01*
X169072571Y-113989235D01*
X169048773Y-113995196D01*
X169024504Y-113998796D01*
X169000000Y-114000000D01*
X165575000Y-114000000D01*
X165550496Y-113998796D01*
X165526227Y-113995196D01*
X165502429Y-113989235D01*
X165479329Y-113980970D01*
X165457151Y-113970480D01*
X165436107Y-113957867D01*
X165416402Y-113943253D01*
X165398223Y-113926777D01*
X165381747Y-113908598D01*
X165367133Y-113888893D01*
X165354520Y-113867849D01*
X165344030Y-113845671D01*
X165335765Y-113822571D01*
X165329804Y-113798773D01*
X165326204Y-113774504D01*
X165325000Y-113750000D01*
X165325000Y-112650000D01*
X165326204Y-112625496D01*
X165329804Y-112601227D01*
X165335765Y-112577429D01*
X165344030Y-112554329D01*
X165354520Y-112532151D01*
X165367133Y-112511107D01*
X165381747Y-112491402D01*
X165398223Y-112473223D01*
X165416402Y-112456747D01*
X165436107Y-112442133D01*
X165457151Y-112429520D01*
X165479329Y-112419030D01*
X165502429Y-112410765D01*
X165526227Y-112404804D01*
X165550496Y-112401204D01*
X165575000Y-112400000D01*
X169000000Y-112400000D01*
X169024504Y-112401204D01*
G37*
G04 #@! TD.AperFunction*
G04 #@! TA.AperFunction,SMDPad,CuDef*
G36*
X138179504Y-112401204D02*
G01*
X138203773Y-112404804D01*
X138227571Y-112410765D01*
X138250671Y-112419030D01*
X138272849Y-112429520D01*
X138293893Y-112442133D01*
X138313598Y-112456747D01*
X138331777Y-112473223D01*
X138348253Y-112491402D01*
X138362867Y-112511107D01*
X138375480Y-112532151D01*
X138385970Y-112554329D01*
X138394235Y-112577429D01*
X138400196Y-112601227D01*
X138403796Y-112625496D01*
X138405000Y-112650000D01*
X138405000Y-113750000D01*
X138403796Y-113774504D01*
X138400196Y-113798773D01*
X138394235Y-113822571D01*
X138385970Y-113845671D01*
X138375480Y-113867849D01*
X138362867Y-113888893D01*
X138348253Y-113908598D01*
X138331777Y-113926777D01*
X138313598Y-113943253D01*
X138293893Y-113957867D01*
X138272849Y-113970480D01*
X138250671Y-113980970D01*
X138227571Y-113989235D01*
X138203773Y-113995196D01*
X138179504Y-113998796D01*
X138155000Y-114000000D01*
X134730000Y-114000000D01*
X134705496Y-113998796D01*
X134681227Y-113995196D01*
X134657429Y-113989235D01*
X134634329Y-113980970D01*
X134612151Y-113970480D01*
X134591107Y-113957867D01*
X134571402Y-113943253D01*
X134553223Y-113926777D01*
X134536747Y-113908598D01*
X134522133Y-113888893D01*
X134509520Y-113867849D01*
X134499030Y-113845671D01*
X134490765Y-113822571D01*
X134484804Y-113798773D01*
X134481204Y-113774504D01*
X134480000Y-113750000D01*
X134480000Y-112650000D01*
X134481204Y-112625496D01*
X134484804Y-112601227D01*
X134490765Y-112577429D01*
X134499030Y-112554329D01*
X134509520Y-112532151D01*
X134522133Y-112511107D01*
X134536747Y-112491402D01*
X134553223Y-112473223D01*
X134571402Y-112456747D01*
X134591107Y-112442133D01*
X134612151Y-112429520D01*
X134634329Y-112419030D01*
X134657429Y-112410765D01*
X134681227Y-112404804D01*
X134705496Y-112401204D01*
X134730000Y-112400000D01*
X138155000Y-112400000D01*
X138179504Y-112401204D01*
G37*
G04 #@! TD.AperFunction*
G04 #@! TA.AperFunction,SMDPad,CuDef*
G36*
X144354504Y-112401204D02*
G01*
X144378773Y-112404804D01*
X144402571Y-112410765D01*
X144425671Y-112419030D01*
X144447849Y-112429520D01*
X144468893Y-112442133D01*
X144488598Y-112456747D01*
X144506777Y-112473223D01*
X144523253Y-112491402D01*
X144537867Y-112511107D01*
X144550480Y-112532151D01*
X144560970Y-112554329D01*
X144569235Y-112577429D01*
X144575196Y-112601227D01*
X144578796Y-112625496D01*
X144580000Y-112650000D01*
X144580000Y-113750000D01*
X144578796Y-113774504D01*
X144575196Y-113798773D01*
X144569235Y-113822571D01*
X144560970Y-113845671D01*
X144550480Y-113867849D01*
X144537867Y-113888893D01*
X144523253Y-113908598D01*
X144506777Y-113926777D01*
X144488598Y-113943253D01*
X144468893Y-113957867D01*
X144447849Y-113970480D01*
X144425671Y-113980970D01*
X144402571Y-113989235D01*
X144378773Y-113995196D01*
X144354504Y-113998796D01*
X144330000Y-114000000D01*
X140905000Y-114000000D01*
X140880496Y-113998796D01*
X140856227Y-113995196D01*
X140832429Y-113989235D01*
X140809329Y-113980970D01*
X140787151Y-113970480D01*
X140766107Y-113957867D01*
X140746402Y-113943253D01*
X140728223Y-113926777D01*
X140711747Y-113908598D01*
X140697133Y-113888893D01*
X140684520Y-113867849D01*
X140674030Y-113845671D01*
X140665765Y-113822571D01*
X140659804Y-113798773D01*
X140656204Y-113774504D01*
X140655000Y-113750000D01*
X140655000Y-112650000D01*
X140656204Y-112625496D01*
X140659804Y-112601227D01*
X140665765Y-112577429D01*
X140674030Y-112554329D01*
X140684520Y-112532151D01*
X140697133Y-112511107D01*
X140711747Y-112491402D01*
X140728223Y-112473223D01*
X140746402Y-112456747D01*
X140766107Y-112442133D01*
X140787151Y-112429520D01*
X140809329Y-112419030D01*
X140832429Y-112410765D01*
X140856227Y-112404804D01*
X140880496Y-112401204D01*
X140905000Y-112400000D01*
X144330000Y-112400000D01*
X144354504Y-112401204D01*
G37*
G04 #@! TD.AperFunction*
G04 #@! TA.AperFunction,SMDPad,CuDef*
G36*
X111659504Y-112401204D02*
G01*
X111683773Y-112404804D01*
X111707571Y-112410765D01*
X111730671Y-112419030D01*
X111752849Y-112429520D01*
X111773893Y-112442133D01*
X111793598Y-112456747D01*
X111811777Y-112473223D01*
X111828253Y-112491402D01*
X111842867Y-112511107D01*
X111855480Y-112532151D01*
X111865970Y-112554329D01*
X111874235Y-112577429D01*
X111880196Y-112601227D01*
X111883796Y-112625496D01*
X111885000Y-112650000D01*
X111885000Y-113750000D01*
X111883796Y-113774504D01*
X111880196Y-113798773D01*
X111874235Y-113822571D01*
X111865970Y-113845671D01*
X111855480Y-113867849D01*
X111842867Y-113888893D01*
X111828253Y-113908598D01*
X111811777Y-113926777D01*
X111793598Y-113943253D01*
X111773893Y-113957867D01*
X111752849Y-113970480D01*
X111730671Y-113980970D01*
X111707571Y-113989235D01*
X111683773Y-113995196D01*
X111659504Y-113998796D01*
X111635000Y-114000000D01*
X108210000Y-114000000D01*
X108185496Y-113998796D01*
X108161227Y-113995196D01*
X108137429Y-113989235D01*
X108114329Y-113980970D01*
X108092151Y-113970480D01*
X108071107Y-113957867D01*
X108051402Y-113943253D01*
X108033223Y-113926777D01*
X108016747Y-113908598D01*
X108002133Y-113888893D01*
X107989520Y-113867849D01*
X107979030Y-113845671D01*
X107970765Y-113822571D01*
X107964804Y-113798773D01*
X107961204Y-113774504D01*
X107960000Y-113750000D01*
X107960000Y-112650000D01*
X107961204Y-112625496D01*
X107964804Y-112601227D01*
X107970765Y-112577429D01*
X107979030Y-112554329D01*
X107989520Y-112532151D01*
X108002133Y-112511107D01*
X108016747Y-112491402D01*
X108033223Y-112473223D01*
X108051402Y-112456747D01*
X108071107Y-112442133D01*
X108092151Y-112429520D01*
X108114329Y-112419030D01*
X108137429Y-112410765D01*
X108161227Y-112404804D01*
X108185496Y-112401204D01*
X108210000Y-112400000D01*
X111635000Y-112400000D01*
X111659504Y-112401204D01*
G37*
G04 #@! TD.AperFunction*
G04 #@! TA.AperFunction,SMDPad,CuDef*
G36*
X117834504Y-112401204D02*
G01*
X117858773Y-112404804D01*
X117882571Y-112410765D01*
X117905671Y-112419030D01*
X117927849Y-112429520D01*
X117948893Y-112442133D01*
X117968598Y-112456747D01*
X117986777Y-112473223D01*
X118003253Y-112491402D01*
X118017867Y-112511107D01*
X118030480Y-112532151D01*
X118040970Y-112554329D01*
X118049235Y-112577429D01*
X118055196Y-112601227D01*
X118058796Y-112625496D01*
X118060000Y-112650000D01*
X118060000Y-113750000D01*
X118058796Y-113774504D01*
X118055196Y-113798773D01*
X118049235Y-113822571D01*
X118040970Y-113845671D01*
X118030480Y-113867849D01*
X118017867Y-113888893D01*
X118003253Y-113908598D01*
X117986777Y-113926777D01*
X117968598Y-113943253D01*
X117948893Y-113957867D01*
X117927849Y-113970480D01*
X117905671Y-113980970D01*
X117882571Y-113989235D01*
X117858773Y-113995196D01*
X117834504Y-113998796D01*
X117810000Y-114000000D01*
X114385000Y-114000000D01*
X114360496Y-113998796D01*
X114336227Y-113995196D01*
X114312429Y-113989235D01*
X114289329Y-113980970D01*
X114267151Y-113970480D01*
X114246107Y-113957867D01*
X114226402Y-113943253D01*
X114208223Y-113926777D01*
X114191747Y-113908598D01*
X114177133Y-113888893D01*
X114164520Y-113867849D01*
X114154030Y-113845671D01*
X114145765Y-113822571D01*
X114139804Y-113798773D01*
X114136204Y-113774504D01*
X114135000Y-113750000D01*
X114135000Y-112650000D01*
X114136204Y-112625496D01*
X114139804Y-112601227D01*
X114145765Y-112577429D01*
X114154030Y-112554329D01*
X114164520Y-112532151D01*
X114177133Y-112511107D01*
X114191747Y-112491402D01*
X114208223Y-112473223D01*
X114226402Y-112456747D01*
X114246107Y-112442133D01*
X114267151Y-112429520D01*
X114289329Y-112419030D01*
X114312429Y-112410765D01*
X114336227Y-112404804D01*
X114360496Y-112401204D01*
X114385000Y-112400000D01*
X117810000Y-112400000D01*
X117834504Y-112401204D01*
G37*
G04 #@! TD.AperFunction*
D18*
X178550000Y-62630000D03*
X176010000Y-62630000D03*
X173470000Y-62630000D03*
X170930000Y-62630000D03*
X168390000Y-62630000D03*
X165850000Y-62630000D03*
X163310000Y-62630000D03*
X160770000Y-62630000D03*
D19*
X95390000Y-106345000D03*
X95390000Y-103805000D03*
X95390000Y-101265000D03*
X95390000Y-98725000D03*
X95390000Y-96185000D03*
X95390000Y-93645000D03*
X95390000Y-91105000D03*
X95390000Y-88565000D03*
X183380000Y-113030000D03*
X183380000Y-110490000D03*
X183380000Y-107950000D03*
X183380000Y-105410000D03*
D20*
X105380000Y-56820000D03*
D21*
X106030000Y-68745000D03*
D22*
X97780000Y-57070000D03*
D23*
X97780000Y-68420000D03*
D24*
X106880000Y-57145000D03*
D25*
X108455000Y-68345000D03*
D26*
X97655000Y-58270000D03*
X97655000Y-59370000D03*
X97655000Y-60470000D03*
X97655000Y-61570000D03*
X97655000Y-62670000D03*
X97655000Y-63770000D03*
X97655000Y-64870000D03*
X97655000Y-65970000D03*
D27*
X133600000Y-97648460D03*
X133600000Y-92190000D03*
X136140000Y-97648460D03*
X136140000Y-92190000D03*
X138680000Y-97648460D03*
X138680000Y-92190000D03*
X123280000Y-97663460D03*
X123280000Y-92205000D03*
X125820000Y-97663460D03*
X125820000Y-92205000D03*
X128360000Y-97663460D03*
X128360000Y-92205000D03*
X113750000Y-97648460D03*
X113750000Y-92190000D03*
X116290000Y-97648460D03*
X116290000Y-92190000D03*
X118830000Y-97648460D03*
X118830000Y-92190000D03*
D13*
X180749000Y-76680000D03*
X184051000Y-76680000D03*
D15*
X153530000Y-73339000D03*
X153530000Y-76641000D03*
D13*
X184051000Y-73686292D03*
X180749000Y-73686292D03*
X165051000Y-75070000D03*
X161749000Y-75070000D03*
X184051000Y-70692586D03*
X180749000Y-70692586D03*
D28*
X107690000Y-48650000D03*
X110230000Y-48650000D03*
X112770000Y-48650000D03*
X115310000Y-48650000D03*
X117850000Y-48650000D03*
X120390000Y-48650000D03*
X122930000Y-48650000D03*
X125470000Y-48650000D03*
X128010000Y-48650000D03*
X130550000Y-48650000D03*
X133090000Y-48650000D03*
X135630000Y-48650000D03*
D29*
X135630000Y-60490000D03*
X135630000Y-63030000D03*
X135630000Y-65570000D03*
X135630000Y-68110000D03*
X135630000Y-70650000D03*
X135630000Y-73190000D03*
X135630000Y-75730000D03*
X135630000Y-78270000D03*
X135630000Y-80810000D03*
D28*
X135630000Y-84450000D03*
X133090000Y-84450000D03*
X130550000Y-84450000D03*
X128010000Y-84450000D03*
X125470000Y-84450000D03*
X122930000Y-84450000D03*
X120390000Y-84450000D03*
X117850000Y-84450000D03*
X115310000Y-84450000D03*
X112770000Y-84450000D03*
X110230000Y-84450000D03*
X107690000Y-84450000D03*
X105150000Y-84450000D03*
D18*
X159900000Y-125110000D03*
X162440000Y-125110000D03*
X164980000Y-125110000D03*
X167520000Y-125110000D03*
X135810000Y-125120000D03*
X138350000Y-125120000D03*
X140890000Y-125120000D03*
X143430000Y-125120000D03*
X108410000Y-125220000D03*
X110950000Y-125220000D03*
X113490000Y-125220000D03*
X116030000Y-125220000D03*
D30*
X165998460Y-81610000D03*
X160540000Y-81610000D03*
X165998460Y-79070000D03*
X160540000Y-79070000D03*
D18*
X181100000Y-62620000D03*
X183640000Y-62620000D03*
X160770000Y-47440000D03*
X163310000Y-47440000D03*
X165850000Y-47440000D03*
X168390000Y-47440000D03*
X170930000Y-47440000D03*
X173470000Y-47440000D03*
X176010000Y-47440000D03*
X178550000Y-47440000D03*
X181090000Y-47440000D03*
X183630000Y-47440000D03*
D31*
X174540000Y-89860000D03*
D32*
X177340000Y-94660000D03*
D33*
X171540000Y-94660000D03*
D34*
X183090000Y-81350000D03*
D35*
X172930000Y-81350000D03*
X172860000Y-85380000D03*
D34*
X183020000Y-85380000D03*
D15*
X147440000Y-73179000D03*
X147440000Y-76481000D03*
D36*
X145365000Y-73450000D03*
X144715000Y-73450000D03*
X144065000Y-73450000D03*
X143415000Y-73450000D03*
X143415000Y-76850000D03*
X144065000Y-76850000D03*
X144715000Y-76850000D03*
X145365000Y-76850000D03*
D13*
X102529000Y-72940000D03*
X105831000Y-72940000D03*
D37*
X147620000Y-49410000D03*
D38*
X152700000Y-49410000D03*
D18*
X160770000Y-68160000D03*
X163310000Y-68160000D03*
X165850000Y-68160000D03*
X168390000Y-68160000D03*
D19*
X95370000Y-116520000D03*
X95370000Y-113980000D03*
X95370000Y-111440000D03*
X95370000Y-108900000D03*
D34*
X183370000Y-101750000D03*
D35*
X173210000Y-101750000D03*
D39*
X178550000Y-73040000D03*
X168730000Y-78107552D03*
X141450000Y-77720000D03*
X141460000Y-72110000D03*
X98449500Y-97320500D03*
X150370000Y-71830000D03*
X109335000Y-71380000D03*
D40*
X131230000Y-113290000D03*
D39*
X168380000Y-72870000D03*
D40*
X176320000Y-104440000D03*
D39*
X103430000Y-62670000D03*
X125650000Y-73550000D03*
X103820000Y-123890000D03*
D40*
X172550000Y-114590000D03*
X148520000Y-113780000D03*
X121180000Y-114690000D03*
X120300000Y-110280000D03*
D39*
X139840000Y-62860000D03*
X139850000Y-68000000D03*
X156800000Y-75460000D03*
X178770000Y-76580000D03*
X100440000Y-102670000D03*
X100430000Y-79970000D03*
X103580000Y-76630000D03*
X145000000Y-78450000D03*
X141850000Y-66760000D03*
X138840000Y-66780000D03*
X139950000Y-81550000D03*
X122410000Y-72650000D03*
X122460000Y-54890000D03*
X157769999Y-66470000D03*
X143050000Y-64000000D03*
X128030000Y-57809980D03*
X110220000Y-55590000D03*
X105720000Y-61570000D03*
X105760000Y-59420000D03*
X163440000Y-74260000D03*
X181280000Y-67620000D03*
D41*
X110170000Y-113447500D02*
X109922500Y-113200000D01*
X109862500Y-113140000D02*
X109922500Y-113200000D01*
X168390000Y-63392000D02*
X169952000Y-64954000D01*
X171908000Y-64954000D02*
X173470000Y-63392000D01*
X169952000Y-64954000D02*
X171908000Y-64954000D01*
X168390000Y-62630000D02*
X168390000Y-63392000D01*
X176988000Y-64954000D02*
X178550000Y-63392000D01*
X175032000Y-64954000D02*
X176988000Y-64954000D01*
X173470000Y-63392000D02*
X175032000Y-64954000D01*
X173470000Y-62630000D02*
X173470000Y-63392000D01*
X178550000Y-63392000D02*
X178550000Y-62630000D01*
X169952000Y-49764000D02*
X171908000Y-49764000D01*
X168390000Y-48202000D02*
X169952000Y-49764000D01*
X171908000Y-49764000D02*
X173470000Y-48202000D01*
X175032000Y-49764000D02*
X176988000Y-49764000D01*
X173470000Y-48202000D02*
X175032000Y-49764000D01*
X176988000Y-49764000D02*
X178550000Y-48202000D01*
X173470000Y-47440000D02*
X173470000Y-48202000D01*
X183630000Y-48202000D02*
X183630000Y-47440000D01*
X182068000Y-49764000D02*
X183630000Y-48202000D01*
X180112000Y-49764000D02*
X182068000Y-49764000D01*
X178550000Y-48202000D02*
X180112000Y-49764000D01*
X178550000Y-47440000D02*
X178550000Y-48202000D01*
X166828000Y-49764000D02*
X168390000Y-48202000D01*
X164872000Y-49764000D02*
X166828000Y-49764000D01*
X163310000Y-48202000D02*
X164872000Y-49764000D01*
X168390000Y-48202000D02*
X168390000Y-47440000D01*
X163310000Y-47440000D02*
X163310000Y-48202000D01*
X178550000Y-73040000D02*
X180102708Y-73040000D01*
X180102708Y-73040000D02*
X180749000Y-73686292D01*
X168730000Y-77314000D02*
X168730000Y-78107552D01*
X98449500Y-100129500D02*
X97314000Y-101265000D01*
X97314000Y-101265000D02*
X95390000Y-101265000D01*
X98449500Y-97320500D02*
X98449500Y-100129500D01*
X97314000Y-106345000D02*
X98449500Y-105209500D01*
X95390000Y-106345000D02*
X97314000Y-106345000D01*
X98449500Y-105209500D02*
X98449500Y-100129500D01*
X98449500Y-92240500D02*
X98449500Y-97320500D01*
X95390000Y-91105000D02*
X97314000Y-91105000D01*
X97314000Y-91105000D02*
X98449500Y-92240500D01*
X141450000Y-77720000D02*
X141460000Y-72110000D01*
D42*
X153212500Y-76641000D02*
X153530000Y-76641000D01*
X147757500Y-76481000D02*
X149308500Y-74930000D01*
X147440000Y-76481000D02*
X147757500Y-76481000D01*
X149308500Y-74930000D02*
X150260000Y-74930000D01*
X150680000Y-74510000D02*
X150680000Y-73339000D01*
X150260000Y-74930000D02*
X150680000Y-74510000D01*
X150680000Y-74374000D02*
X150866000Y-74560000D01*
X150680000Y-73339000D02*
X150680000Y-74374000D01*
X153530000Y-75606000D02*
X153530000Y-76641000D01*
X152484000Y-74560000D02*
X153530000Y-75606000D01*
X150866000Y-74560000D02*
X152484000Y-74560000D01*
D41*
X150370000Y-73029000D02*
X150680000Y-73339000D01*
X150370000Y-71830000D02*
X150370000Y-73029000D01*
X105130000Y-57070000D02*
X105380000Y-56820000D01*
X97780000Y-57070000D02*
X105130000Y-57070000D01*
X105380000Y-56820000D02*
X105380000Y-56290000D01*
X105705000Y-68420000D02*
X106030000Y-68745000D01*
X97780000Y-68420000D02*
X105705000Y-68420000D01*
X106030000Y-68745000D02*
X106330000Y-68745000D01*
D43*
X154800000Y-119898002D02*
X157321998Y-122420000D01*
X154800000Y-119700000D02*
X154800000Y-119898002D01*
X170040000Y-120831370D02*
X170040000Y-119700000D01*
X168451370Y-122420000D02*
X170040000Y-120831370D01*
X157321998Y-122420000D02*
X168451370Y-122420000D01*
X170040000Y-120831370D02*
X171768630Y-122560000D01*
X182618000Y-113030000D02*
X183380000Y-113030000D01*
X173088000Y-122560000D02*
X182618000Y-113030000D01*
X171768630Y-122560000D02*
X173088000Y-122560000D01*
X145970000Y-120831370D02*
X147898630Y-122760000D01*
X154800000Y-122000000D02*
X154800000Y-119700000D01*
X154040000Y-122760000D02*
X154800000Y-122000000D01*
X147898630Y-122760000D02*
X154040000Y-122760000D01*
X118640000Y-120761370D02*
X120438630Y-122560000D01*
X130730000Y-122000000D02*
X130730000Y-119700000D01*
X130170000Y-122560000D02*
X130730000Y-122000000D01*
X120438630Y-122560000D02*
X130170000Y-122560000D01*
X130730000Y-119898002D02*
X133351998Y-122520000D01*
X130730000Y-119700000D02*
X130730000Y-119898002D01*
X145970000Y-120831370D02*
X145970000Y-119700000D01*
X144281370Y-122520000D02*
X145970000Y-120831370D01*
X133351998Y-122520000D02*
X144281370Y-122520000D01*
X103400000Y-119828002D02*
X105851998Y-122280000D01*
X103400000Y-119630000D02*
X103400000Y-119828002D01*
X118640000Y-120761370D02*
X118640000Y-119630000D01*
X117121370Y-122280000D02*
X118640000Y-120761370D01*
X105851998Y-122280000D02*
X117121370Y-122280000D01*
X136442500Y-113200000D02*
X139972500Y-109670000D01*
X139972500Y-109670000D02*
X157582500Y-109670000D01*
X157582500Y-109670000D02*
X161112500Y-113200000D01*
D41*
X103400000Y-119630000D02*
X103400000Y-116490000D01*
X106690000Y-113200000D02*
X109922500Y-113200000D01*
X103400000Y-116490000D02*
X106690000Y-113200000D01*
D43*
X136352500Y-113290000D02*
X136442500Y-113200000D01*
X131230000Y-113290000D02*
X136352500Y-113290000D01*
D41*
X168390000Y-60306000D02*
X168390000Y-62630000D01*
X147836000Y-60306000D02*
X168390000Y-60306000D01*
X144150000Y-56290000D02*
X147836000Y-60306000D01*
X113420000Y-56210000D02*
X144150000Y-56290000D01*
X107690000Y-48650000D02*
X107690000Y-50950000D01*
X97780000Y-68420000D02*
X99330000Y-68420000D01*
X97714000Y-91105000D02*
X95390000Y-91105000D01*
X98380000Y-90439000D02*
X97714000Y-91105000D01*
X98380000Y-87480000D02*
X98380000Y-90439000D01*
X97034000Y-84750000D02*
X97050000Y-84766000D01*
X95599000Y-84750000D02*
X97034000Y-84750000D01*
X97050000Y-86150000D02*
X98380000Y-87480000D01*
X97050000Y-84766000D02*
X97050000Y-86150000D01*
X107690000Y-51330000D02*
X107690000Y-48650000D01*
D42*
X97655000Y-60470000D02*
X106940000Y-60470000D01*
D41*
X107690000Y-53980000D02*
X107690000Y-48650000D01*
X105380000Y-56290000D02*
X107690000Y-53980000D01*
D42*
X109060000Y-58350000D02*
X109060000Y-52220000D01*
X106940000Y-60470000D02*
X109060000Y-58350000D01*
D41*
X109060000Y-52220000D02*
X113420000Y-56210000D01*
X107690000Y-50950000D02*
X109060000Y-52220000D01*
X107170000Y-71380000D02*
X109335000Y-71380000D01*
X106030000Y-70240000D02*
X107170000Y-71380000D01*
X106030000Y-68745000D02*
X106030000Y-70240000D01*
D42*
X97655000Y-60470000D02*
X96210000Y-60470000D01*
X96210000Y-60470000D02*
X95770000Y-60910000D01*
X96630000Y-68420000D02*
X97780000Y-68420000D01*
X95770000Y-67560000D02*
X96630000Y-68420000D01*
X95770000Y-60910000D02*
X95770000Y-67560000D01*
X168502580Y-68272580D02*
X168390000Y-68160000D01*
D41*
X171151620Y-68272580D02*
X168502580Y-68272580D01*
X168390000Y-62630000D02*
X168390000Y-68160000D01*
X166486000Y-75070000D02*
X168730000Y-77314000D01*
X165051000Y-75070000D02*
X166486000Y-75070000D01*
X166486000Y-74764000D02*
X168380000Y-72870000D01*
X166486000Y-75070000D02*
X166486000Y-74764000D01*
X97814000Y-108960000D02*
X98440000Y-108334000D01*
X95490000Y-108960000D02*
X97814000Y-108960000D01*
X98440000Y-108334000D02*
X98440000Y-107050000D01*
X98449500Y-105209500D02*
X98440000Y-107050000D01*
X103400000Y-115530353D02*
X103400000Y-119630000D01*
X96829647Y-108960000D02*
X103400000Y-115530353D01*
X95490000Y-108960000D02*
X96829647Y-108960000D01*
X105831000Y-72719000D02*
X107170000Y-71380000D01*
X105831000Y-72940000D02*
X105831000Y-72719000D01*
X161140000Y-113627500D02*
X161112500Y-113600000D01*
X161112500Y-113600000D02*
X161112500Y-112480430D01*
D43*
X161112500Y-112400000D02*
X162712500Y-110800000D01*
X161112500Y-113200000D02*
X161112500Y-112400000D01*
X162712500Y-110800000D02*
X173730000Y-110800000D01*
X176320000Y-108210000D02*
X176320000Y-104440000D01*
X173730000Y-110800000D02*
X176320000Y-108210000D01*
D41*
X113130000Y-92190000D02*
X113750000Y-92190000D01*
X107690000Y-86750000D02*
X113130000Y-92190000D01*
X107690000Y-84450000D02*
X107690000Y-86750000D01*
X132631369Y-117929999D02*
X133270000Y-118568630D01*
X105940000Y-119630000D02*
X107540001Y-118029999D01*
X113750000Y-92190000D02*
X121170000Y-92190000D01*
X121170000Y-92190000D02*
X138680000Y-92190000D01*
X157340000Y-118568630D02*
X157340000Y-119700000D01*
X155961370Y-117190000D02*
X157340000Y-118568630D01*
X133270000Y-119700000D02*
X135770000Y-117200000D01*
X183320000Y-110430000D02*
X183380000Y-110490000D01*
D42*
X148810000Y-70774000D02*
X148810000Y-68990000D01*
X147440000Y-72144000D02*
X148810000Y-70774000D01*
X144171000Y-72144000D02*
X147440000Y-72144000D01*
X144065000Y-72250000D02*
X144171000Y-72144000D01*
D41*
X132631369Y-117929999D02*
X132179999Y-117929999D01*
X132179999Y-117929999D02*
X125240000Y-110990000D01*
X125240000Y-104630000D02*
X121120000Y-100510000D01*
X125240000Y-110990000D02*
X125240000Y-104630000D01*
X121170000Y-92190000D02*
X121120000Y-100510000D01*
X133270000Y-118568630D02*
X133270000Y-119700000D01*
X132731369Y-118029999D02*
X133270000Y-118568630D01*
X107540001Y-118029999D02*
X132731369Y-118029999D01*
X155951370Y-117200000D02*
X155961370Y-117190000D01*
X135770000Y-117200000D02*
X155951370Y-117200000D01*
X97655000Y-62670000D02*
X103430000Y-62670000D01*
X158478629Y-117430001D02*
X157340000Y-118568630D01*
X174115999Y-117430001D02*
X158478629Y-117430001D01*
X181056000Y-110490000D02*
X174115999Y-117430001D01*
X183380000Y-110490000D02*
X181056000Y-110490000D01*
X148048000Y-68228000D02*
X148048000Y-66238000D01*
X148810000Y-68990000D02*
X148048000Y-68228000D01*
X133569999Y-59027999D02*
X125650000Y-66947998D01*
X140837999Y-59027999D02*
X133569999Y-59027999D01*
X148048000Y-66238000D02*
X140837999Y-59027999D01*
X125650000Y-66947998D02*
X125650000Y-73550000D01*
X97814000Y-111500000D02*
X101060621Y-114746621D01*
X95490000Y-111500000D02*
X97814000Y-111500000D01*
X101060621Y-114746621D02*
X101060621Y-121130621D01*
X101060621Y-121130621D02*
X103820000Y-123890000D01*
D42*
X144065000Y-73450000D02*
X144065000Y-72250000D01*
D41*
X170090000Y-106950000D02*
X170040000Y-107000000D01*
D42*
X165789980Y-102749980D02*
X170040000Y-107000000D01*
X138680000Y-99980000D02*
X141009962Y-99980000D01*
X141009962Y-99980000D02*
X143779942Y-102749980D01*
X143779942Y-102749980D02*
X165789980Y-102749980D01*
X138680000Y-97648460D02*
X138680000Y-99980000D01*
X163949990Y-103449990D02*
X167500000Y-107000000D01*
X143489990Y-103449990D02*
X163949990Y-103449990D01*
X141899980Y-101859980D02*
X143489990Y-103449990D01*
X136140000Y-97648460D02*
X136140000Y-99318460D01*
X138681520Y-101859980D02*
X141899980Y-101859980D01*
X136140000Y-99318460D02*
X138681520Y-101859980D01*
D41*
X165010000Y-106950000D02*
X164960000Y-107000000D01*
D42*
X136841530Y-102559990D02*
X133600000Y-99318460D01*
X141069990Y-102559990D02*
X136841530Y-102559990D01*
X162110000Y-104150000D02*
X142660000Y-104150000D01*
X133600000Y-99318460D02*
X133600000Y-97648460D01*
X142660000Y-104150000D02*
X141069990Y-102559990D01*
X164960000Y-107000000D02*
X162110000Y-104150000D01*
D43*
X152700000Y-49410000D02*
X155470000Y-52180000D01*
X176590000Y-52180000D02*
X183640000Y-59230000D01*
X183640000Y-59230000D02*
X183640000Y-62620000D01*
X155470000Y-52180000D02*
X176590000Y-52180000D01*
X171160000Y-113200000D02*
X172550000Y-114590000D01*
X167287500Y-113200000D02*
X171160000Y-113200000D01*
X147940000Y-113200000D02*
X148520000Y-113780000D01*
X142617500Y-113200000D02*
X147940000Y-113200000D01*
X119500000Y-113200000D02*
X116097500Y-113200000D01*
X121180000Y-114690000D02*
X119500000Y-113200000D01*
X120300000Y-110280000D02*
X120300000Y-113810000D01*
X120300000Y-113810000D02*
X121180000Y-114690000D01*
D41*
X140900000Y-119710000D02*
X140890000Y-119700000D01*
D42*
X129841540Y-104860000D02*
X123280000Y-98298460D01*
X140890000Y-105868630D02*
X139881370Y-104860000D01*
X123280000Y-98298460D02*
X123280000Y-97663460D01*
X139881370Y-104860000D02*
X129841540Y-104860000D01*
X140890000Y-107000000D02*
X140890000Y-105868630D01*
X130446550Y-103960010D02*
X140390010Y-103960010D01*
X125820000Y-99333460D02*
X130446550Y-103960010D01*
X140390010Y-103960010D02*
X143430000Y-107000000D01*
X125820000Y-97663460D02*
X125820000Y-99333460D01*
X143990000Y-105020000D02*
X145970000Y-107000000D01*
X132286540Y-103260000D02*
X140679963Y-103260000D01*
X140679963Y-103260000D02*
X142439963Y-105020000D01*
X142439963Y-105020000D02*
X143990000Y-105020000D01*
X128360000Y-99333460D02*
X132286540Y-103260000D01*
X128360000Y-97663460D02*
X128360000Y-99333460D01*
D41*
X118590000Y-106880000D02*
X118640000Y-106930000D01*
D42*
X118830000Y-105608630D02*
X118830000Y-97648460D01*
X118640000Y-106930000D02*
X118640000Y-105798630D01*
X118640000Y-105798630D02*
X118830000Y-105608630D01*
D41*
X116050000Y-106880000D02*
X116100000Y-106930000D01*
D42*
X116290000Y-100430000D02*
X116290000Y-97648460D01*
X116100000Y-100620000D02*
X116100000Y-106930000D01*
X116290000Y-100430000D02*
X116100000Y-100620000D01*
D41*
X113510000Y-106880000D02*
X113560000Y-106930000D01*
D42*
X113750000Y-97648460D02*
X113750000Y-105608630D01*
X113560000Y-106930000D02*
X113560000Y-105798630D01*
X113560000Y-105798630D02*
X113750000Y-105608630D01*
D41*
X113570000Y-119640000D02*
X113560000Y-119630000D01*
D42*
X139830000Y-65780000D02*
X139840000Y-62860000D01*
X139850000Y-68000000D02*
X139830000Y-65780000D01*
X115310000Y-84450000D02*
X115310000Y-83712000D01*
D41*
X178770000Y-76580000D02*
X180649000Y-76580000D01*
X180649000Y-76580000D02*
X180749000Y-76680000D01*
X180749000Y-85009000D02*
X181120000Y-85380000D01*
X180749000Y-76680000D02*
X180749000Y-85009000D01*
X183380000Y-107950000D02*
X182618000Y-107950000D01*
D44*
X144715000Y-78499315D02*
X144710000Y-78504315D01*
D41*
X183380000Y-107950000D02*
X181056000Y-107950000D01*
X156800000Y-67403998D02*
X156800000Y-75460000D01*
X153140000Y-63480000D02*
X156800000Y-67403998D01*
X149070000Y-63480000D02*
X153140000Y-63480000D01*
X130350000Y-57580000D02*
X143620000Y-57610000D01*
X143620000Y-57610000D02*
X149070000Y-63480000D01*
X115860000Y-72600000D02*
X130350000Y-57580000D01*
X113140000Y-75320000D02*
X115860000Y-72600000D01*
X98768700Y-75320000D02*
X113140000Y-75320000D01*
X100440000Y-79980000D02*
X100430000Y-79970000D01*
X100440000Y-102670000D02*
X100440000Y-79980000D01*
X102270000Y-75320000D02*
X98768700Y-75320000D01*
X103580000Y-76630000D02*
X102270000Y-75320000D01*
X102270000Y-74951500D02*
X102270000Y-75320000D01*
X102529000Y-74692500D02*
X102270000Y-74951500D01*
X181055990Y-85444010D02*
X181055990Y-107949990D01*
X181055990Y-107949990D02*
X181056000Y-107950000D01*
X181055990Y-85444010D02*
X181120000Y-85380000D01*
X181120000Y-85380000D02*
X183020000Y-85380000D01*
X102529000Y-72940000D02*
X102529000Y-74692500D01*
D45*
X147440000Y-73179000D02*
X147275998Y-73179000D01*
X144715000Y-78499315D02*
X144715000Y-76850000D01*
X144710000Y-78504315D02*
X145000000Y-78450000D01*
X147440000Y-74114000D02*
X146304000Y-75250000D01*
X147440000Y-73179000D02*
X147440000Y-74114000D01*
X144715000Y-75739998D02*
X144715000Y-76850000D01*
X145204998Y-75250000D02*
X144715000Y-75739998D01*
X146304000Y-75250000D02*
X145204998Y-75250000D01*
D42*
X151100000Y-69240000D02*
X151350000Y-68990000D01*
X151150000Y-68790000D02*
X151350000Y-68990000D01*
X153212500Y-73339000D02*
X153530000Y-73339000D01*
X151350000Y-71476500D02*
X153212500Y-73339000D01*
X151350000Y-68990000D02*
X151350000Y-71476500D01*
X137530000Y-60490000D02*
X135630000Y-60490000D01*
X138840000Y-66780000D02*
X138840000Y-62030000D01*
X138840000Y-62030000D02*
X137530000Y-60490000D01*
X165850000Y-68160000D02*
X163310000Y-68160000D01*
D45*
X143415000Y-78085000D02*
X139950000Y-81550000D01*
X143415000Y-76850000D02*
X143415000Y-78085000D01*
D42*
X131850000Y-82090000D02*
X131850000Y-82290000D01*
X122410000Y-72650000D02*
X131850000Y-82090000D01*
X117240000Y-54910000D02*
X112770000Y-50550000D01*
X112770000Y-50550000D02*
X112770000Y-48650000D01*
X118250000Y-54910000D02*
X117240000Y-54910000D01*
X122460000Y-54890000D02*
X118250000Y-54910000D01*
X157910000Y-63390000D02*
X158670000Y-62630000D01*
X157910000Y-76047070D02*
X157910000Y-63390000D01*
X155931069Y-78026001D02*
X157910000Y-76047070D01*
X158670000Y-62630000D02*
X160770000Y-62630000D01*
X146310000Y-67500000D02*
X146310000Y-68770000D01*
X144669999Y-65859999D02*
X146310000Y-67500000D01*
X140949999Y-66327999D02*
X141417999Y-65859999D01*
X140549328Y-68750672D02*
X140949999Y-68350001D01*
X140949999Y-68350001D02*
X140949999Y-66327999D01*
X140549328Y-79052674D02*
X140549328Y-68750672D01*
X137312002Y-82290000D02*
X140549328Y-79052674D01*
X141417999Y-65859999D02*
X144669999Y-65859999D01*
X131850000Y-82290000D02*
X137312002Y-82290000D01*
D45*
X141320306Y-79052674D02*
X142650000Y-77722980D01*
X140549328Y-79052674D02*
X141320306Y-79052674D01*
X142650000Y-75854998D02*
X143104998Y-75400000D01*
X142650000Y-77722980D02*
X142650000Y-75854998D01*
X144065000Y-75739998D02*
X144065000Y-76850000D01*
X143725002Y-75400000D02*
X144065000Y-75739998D01*
X143104998Y-75400000D02*
X143725002Y-75400000D01*
X150680000Y-77576000D02*
X150680000Y-76641000D01*
D42*
X151030001Y-78026001D02*
X155931069Y-78026001D01*
X150680000Y-77676000D02*
X151030001Y-78026001D01*
X150680000Y-76641000D02*
X150680000Y-77676000D01*
D45*
X141417999Y-65632001D02*
X143050000Y-64000000D01*
X141417999Y-65859999D02*
X141417999Y-65632001D01*
D41*
X120390000Y-50950000D02*
X123150000Y-53710000D01*
X120390000Y-48650000D02*
X120390000Y-50950000D01*
X123150000Y-53710000D02*
X124430000Y-53710000D01*
X124430000Y-53710000D02*
X125440000Y-54720000D01*
X125440000Y-54720000D02*
X144240000Y-54720000D01*
X170930000Y-60306000D02*
X170930000Y-62630000D01*
X169829990Y-59205990D02*
X170930000Y-60306000D01*
X148725990Y-59205990D02*
X169829990Y-59205990D01*
X144240000Y-54720000D02*
X148725990Y-59205990D01*
X173720000Y-75280000D02*
X173430000Y-75570000D01*
D43*
X147620000Y-52710000D02*
X149380000Y-54470000D01*
X149380000Y-54470000D02*
X174068122Y-54470000D01*
X174068122Y-54470000D02*
X181100000Y-61501878D01*
X181100000Y-61501878D02*
X181100000Y-62620000D01*
X147620000Y-49410000D02*
X147620000Y-52710000D01*
X173615823Y-75570000D02*
X178707501Y-70478322D01*
X173430000Y-75570000D02*
X173615823Y-75570000D01*
X178700000Y-65800000D02*
X178707501Y-70478322D01*
X181100000Y-65075823D02*
X178700000Y-65800000D01*
X181100000Y-62620000D02*
X181100000Y-65075823D01*
X180534736Y-70478322D02*
X180749000Y-70692586D01*
X178707501Y-70478322D02*
X180534736Y-70478322D01*
D42*
X127890020Y-57809980D02*
X128030000Y-57809980D01*
X120969980Y-64870000D02*
X128030000Y-57809980D01*
X97655000Y-64870000D02*
X120969980Y-64870000D01*
X105900000Y-63770000D02*
X97655000Y-63770000D01*
X110220000Y-59450000D02*
X105900000Y-63770000D01*
X110220000Y-55590000D02*
X110220000Y-59450000D01*
X97655000Y-61570000D02*
X105720000Y-61570000D01*
X97655000Y-59370000D02*
X105710000Y-59370000D01*
X105710000Y-59370000D02*
X105760000Y-59420000D01*
D41*
X160540000Y-76279000D02*
X161749000Y-75070000D01*
X160540000Y-79070000D02*
X160540000Y-76279000D01*
X175708380Y-67972860D02*
X175708380Y-68272580D01*
X161749000Y-73317500D02*
X163806500Y-71260000D01*
X161749000Y-75070000D02*
X161749000Y-73317500D01*
X174319790Y-71260000D02*
X175708380Y-69871410D01*
X175708380Y-69871410D02*
X175708380Y-68272580D01*
X163806500Y-71260000D02*
X174319790Y-71260000D01*
D42*
X165998460Y-79070000D02*
X165998460Y-81610000D01*
D41*
X151350000Y-81690000D02*
X151350000Y-82960000D01*
X152050010Y-83660010D02*
X165383450Y-83660010D01*
X165383450Y-83660010D02*
X165998460Y-83045000D01*
X151350000Y-82960000D02*
X152050010Y-83660010D01*
X165998460Y-83045000D02*
X165998460Y-81610000D01*
D45*
X164428460Y-79070000D02*
X165998460Y-79070000D01*
X163440000Y-78081540D02*
X164428460Y-79070000D01*
X163440000Y-74260000D02*
X163440000Y-78081540D01*
D42*
X151390000Y-80200000D02*
X149390000Y-78200000D01*
X151390000Y-81470000D02*
X151390000Y-80200000D01*
X145365000Y-77500000D02*
X145365000Y-76850000D01*
X146065000Y-78200000D02*
X145365000Y-77500000D01*
X149390000Y-78200000D02*
X146065000Y-78200000D01*
D41*
X97369260Y-77819360D02*
X98768700Y-77819360D01*
X97050000Y-78138620D02*
X97369260Y-77819360D01*
X97050000Y-81924000D02*
X97050000Y-78138620D01*
X97004000Y-81970000D02*
X97050000Y-81924000D01*
X95569000Y-81970000D02*
X97004000Y-81970000D01*
X105150000Y-82150000D02*
X105150000Y-84450000D01*
X100819360Y-77819360D02*
X105150000Y-82150000D01*
X98768700Y-77819360D02*
X100819360Y-77819360D01*
X184051000Y-76680000D02*
X184051000Y-73686292D01*
X182694213Y-67620000D02*
X183424213Y-68350000D01*
X181280000Y-67620000D02*
X182694213Y-67620000D01*
X184051000Y-68940086D02*
X184051000Y-70692586D01*
X183460914Y-68350000D02*
X184051000Y-68940086D01*
X183424213Y-68350000D02*
X183460914Y-68350000D01*
X147050000Y-89082000D02*
X147050000Y-86542000D01*
X150898000Y-92930000D02*
X147050000Y-89082000D01*
X167800000Y-92930000D02*
X150898000Y-92930000D01*
X168360000Y-88324366D02*
X168360000Y-92370000D01*
X171304366Y-85380000D02*
X168360000Y-88324366D01*
X168360000Y-92370000D02*
X167800000Y-92930000D01*
X172860000Y-85380000D02*
X171304366Y-85380000D01*
X98871000Y-81970000D02*
X98911000Y-83950000D01*
D42*
X160540000Y-81610000D02*
X158870000Y-81610000D01*
X163310000Y-62630000D02*
X165850000Y-62630000D01*
X158669999Y-81409999D02*
X158669999Y-66430001D01*
X158870000Y-81610000D02*
X158669999Y-81409999D01*
X158669999Y-66430001D02*
X160100000Y-65000000D01*
X163310000Y-64554000D02*
X163310000Y-62630000D01*
X162864000Y-65000000D02*
X163310000Y-64554000D01*
X160100000Y-65000000D02*
X162864000Y-65000000D01*
M02*
