%!PS-Adobe-3.0
%%Creator: PCBNEW
%%CreationDate: Mon Sep 21 09:55:00 2020
%%Title: /Users/macoscar/Documents/04_Projects/02_FabLab/03_General/01_Repositories/fablabbcn-projects/electronics/barduino-cnc-shield/exports/gerbers/BarduinoStepperBoard-drl_map.ps
%%Pages: 1
%%PageOrder: Ascend
%%BoundingBox: 0 0 596 842
%%DocumentMedia: A4 595 842 0 () ()
%%Orientation: Landscape
%%EndComments
%%BeginProlog
/line { newpath moveto lineto stroke } bind def
/cir0 { newpath 0 360 arc stroke } bind def
/cir1 { newpath 0 360 arc gsave fill grestore stroke } bind def
/cir2 { newpath 0 360 arc gsave fill grestore stroke } bind def
/arc0 { newpath arc stroke } bind def
/arc1 { newpath 4 index 4 index moveto arc closepath gsave fill
    grestore stroke } bind def
/arc2 { newpath 4 index 4 index moveto arc closepath gsave fill
    grestore stroke } bind def
/poly0 { stroke } bind def
/poly1 { closepath gsave fill grestore stroke } bind def
/poly2 { closepath gsave fill grestore stroke } bind def
/rect0 { rectstroke } bind def
/rect1 { rectfill } bind def
/rect2 { rectfill } bind def
/linemode0 { 0 setlinecap 0 setlinejoin 0 setlinewidth } bind def
/linemode1 { 1 setlinecap 1 setlinejoin } bind def
/dashedline { [200] 100 setdash } bind def
/solidline { [] 0 setdash } bind def
/phantomshow { moveto
    /KicadFont findfont 0.000001 scalefont setfont
    show } bind def
/textshow { gsave
    findfont exch scalefont setfont concat 1 scale 0 0 moveto show
    } bind def
/reencodefont {
  findfont dup length dict begin
  { 1 index /FID ne
    { def }
    { pop pop } ifelse
  } forall
  /Encoding ISOLatin1Encoding def
  currentdict
  end } bind def
/KicadFont /Helvetica reencodefont definefont pop
/KicadFont-Bold /Helvetica-Bold reencodefont definefont pop
/KicadFont-Oblique /Helvetica-Oblique reencodefont definefont pop
/KicadFont-BoldOblique /Helvetica-BoldOblique reencodefont definefont pop
%%EndProlog
%%Page: 1 1
%%BeginPageSetup
gsave
0.0072 0.0072 scale
linemode1
82680 0 translate 90 rotate
64.6053 setlinewidth
%%EndPageSetup
0 0 0 setrgbcolor
25.4351 setlinewidth
35853.2 37978.1 956.361 180 270 arc0
0 0 0 setrgbcolor
81076.8 37983.2 956.361 -90 -0 arc0
0 0 0 setrgbcolor
81076.8 77773.9 956.361 -0 90 arc0
0 0 0 setrgbcolor
35858.2 77758.7 956.361 90 180 arc0
0 0 0 setrgbcolor
37348.7 39295.6 1271.76 cir0
0 0 0 setrgbcolor
79484.6 39371.9 1271.76 cir0
0 0 0 setrgbcolor
37338.6 76283.4 1271.76 cir0
0 0 0 setrgbcolor
36412.7 64181.4 228.916 cir0
0 0 0 setrgbcolor
36412.7 62650.2 228.916 cir0
0 0 0 setrgbcolor
newpath
34896.8 60574.7 moveto
34896.8 37978.1 lineto
stroke
0 0 0 setrgbcolor
newpath
34896.8 66353.5 moveto
34901.9 77758.7 lineto
stroke
0 0 0 setrgbcolor
newpath
35955.1 61617.5 moveto
35955.1 65310.7 lineto
stroke
0 0 0 setrgbcolor
35410.6 66353.5 513.79 -180 -90 arc0
0 0 0 setrgbcolor
35425.8 65310.7 529.271 -5.50723e-05 91.6523 arc0
0 0 0 setrgbcolor
35425.8 61617.5 529.271 -91.6523 5.50723e-05 arc0
0 0 0 setrgbcolor
35410.6 60574.7 513.79 90 180 arc0
0 0 0 setrgbcolor
newpath
35858.2 78715 moveto
81076.8 78730.3 lineto
stroke
0 0 0 setrgbcolor
newpath
82033.2 37983.2 moveto
82033.2 77773.9 lineto
stroke
0 0 0 setrgbcolor
newpath
35853.2 37021.7 moveto
81076.8 37026.8 lineto
stroke
78.7401 setlinewidth
newpath
37521.4 52328.3 moveto
37724.9 52124.9 lineto
stroke
newpath
37724.9 52328.3 moveto
37521.4 52124.9 lineto
stroke
newpath
38528.9 61154.6 moveto
38732.4 60951.1 lineto
stroke
newpath
38732.4 61154.6 moveto
38528.9 60951.1 lineto
stroke
newpath
38534 49607 moveto
38737.5 49403.6 lineto
stroke
newpath
38737.5 49607 moveto
38534 49403.6 lineto
stroke
newpath
40055 69955.1 moveto
40258.5 69751.7 lineto
stroke
newpath
40258.5 69955.1 moveto
40055 69751.7 lineto
stroke
newpath
40131.3 62853.7 moveto
40334.8 62650.2 lineto
stroke
newpath
40334.8 62853.7 moveto
40131.3 62650.2 lineto
stroke
newpath
40253.4 38812.4 moveto
40456.9 38608.9 lineto
stroke
newpath
40456.9 38812.4 moveto
40253.4 38608.9 lineto
stroke
newpath
41220 70514.7 moveto
41423.5 70311.2 lineto
stroke
newpath
41423.5 70514.7 moveto
41220 70311.2 lineto
stroke
newpath
41240.3 71608.4 moveto
41443.8 71405 lineto
stroke
newpath
41443.8 71608.4 moveto
41240.3 71405 lineto
stroke
newpath
43058.9 65524.3 moveto
43262.4 65320.9 lineto
stroke
newpath
43262.4 65524.3 moveto
43058.9 65320.9 lineto
stroke
newpath
43509.1 73556.8 moveto
43712.6 73353.3 lineto
stroke
newpath
43712.6 73556.8 moveto
43509.1 73353.3 lineto
stroke
newpath
49710.2 64878.3 moveto
49913.7 64674.8 lineto
stroke
newpath
49913.7 64878.3 moveto
49710.2 64674.8 lineto
stroke
newpath
49735.7 73912.9 moveto
49939.1 73709.4 lineto
stroke
newpath
49939.1 73912.9 moveto
49735.7 73709.4 lineto
stroke
newpath
51358.4 64420.5 moveto
51561.9 64217 lineto
stroke
newpath
51561.9 64420.5 moveto
51358.4 64217 lineto
stroke
newpath
52569.1 72427.5 moveto
52772.6 72224 lineto
stroke
newpath
52772.6 72427.5 moveto
52569.1 72224 lineto
stroke
newpath
58068.2 67864.4 moveto
58271.7 67660.9 lineto
stroke
newpath
58271.7 67864.4 moveto
58068.2 67660.9 lineto
stroke
newpath
58576.9 69858.5 moveto
58780.4 69655 lineto
stroke
newpath
58780.4 69858.5 moveto
58576.9 69655 lineto
stroke
newpath
58582 67243.8 moveto
58785.5 67040.3 lineto
stroke
newpath
58785.5 67243.8 moveto
58582 67040.3 lineto
stroke
newpath
58632.9 60350.8 moveto
58836.4 60147.4 lineto
stroke
newpath
58836.4 60350.8 moveto
58632.9 60147.4 lineto
stroke
newpath
59395.9 62299.2 moveto
59599.4 62095.7 lineto
stroke
newpath
59599.4 62299.2 moveto
59395.9 62095.7 lineto
stroke
newpath
59401 65153 moveto
59604.5 64949.5 lineto
stroke
newpath
59604.5 65153 moveto
59401 64949.5 lineto
stroke
newpath
59599.4 67874.6 moveto
59802.9 67671.1 lineto
stroke
newpath
59802.9 67874.6 moveto
59599.4 67671.1 lineto
stroke
newpath
60209.9 69278.6 moveto
60413.3 69075.1 lineto
stroke
newpath
60413.3 69278.6 moveto
60209.9 69075.1 lineto
stroke
newpath
61201.8 61927.8 moveto
61405.3 61724.3 lineto
stroke
newpath
61405.3 61927.8 moveto
61201.8 61724.3 lineto
stroke
newpath
63933.6 65295.4 moveto
64137 65092 lineto
stroke
newpath
64137 65295.4 moveto
63933.6 65092 lineto
stroke
newpath
67204.5 63448.8 moveto
67408 63245.4 lineto
stroke
newpath
67408 63448.8 moveto
67204.5 63245.4 lineto
stroke
newpath
67698 68022.1 moveto
67901.4 67818.6 lineto
stroke
newpath
67901.4 68022.1 moveto
67698 67818.6 lineto
stroke
newpath
70582.3 64059.3 moveto
70785.8 63855.8 lineto
stroke
newpath
70785.8 64059.3 moveto
70582.3 63855.8 lineto
stroke
newpath
73095.3 64766.4 moveto
73298.8 64562.9 lineto
stroke
newpath
73298.8 64766.4 moveto
73095.3 64562.9 lineto
stroke
newpath
73273.3 62102 moveto
73476.8 61898.5 lineto
stroke
newpath
73476.8 62102 moveto
73273.3 61898.5 lineto
stroke
newpath
78268.8 64679.9 moveto
78472.3 64476.4 lineto
stroke
newpath
78472.3 64679.9 moveto
78268.8 64476.4 lineto
stroke
newpath
78380.7 62879.1 moveto
78584.2 62675.6 lineto
stroke
newpath
78584.2 62879.1 moveto
78380.7 62675.6 lineto
stroke
newpath
79657.6 67437.1 moveto
79861 67233.6 lineto
stroke
newpath
79861 67437.1 moveto
79657.6 67233.6 lineto
stroke
41031.8 58773.9 193.816 cir0
42323.9 76985.4 193.816 cir0
42323.9 58773.9 193.816 cir0
43616 76985.4 193.816 cir0
43616 58773.9 193.816 cir0
44908.1 76985.4 193.816 cir0
44908.1 58773.9 193.816 cir0
46200.2 76985.4 193.816 cir0
46200.2 58773.9 193.816 cir0
47492.3 76985.4 193.816 cir0
47492.3 58773.9 193.816 cir0
48784.4 76985.4 193.816 cir0
48784.4 58773.9 193.816 cir0
50076.5 76985.4 193.816 cir0
50076.5 58773.9 193.816 cir0
51368.6 76985.4 193.816 cir0
51368.6 58773.9 193.816 cir0
52660.7 76985.4 193.816 cir0
52660.7 58773.9 193.816 cir0
53952.8 76985.4 193.816 cir0
53952.8 58773.9 193.816 cir0
55244.9 76985.4 193.816 cir0
55244.9 58773.9 193.816 cir0
56537 76985.4 193.816 cir0
56537 70962.4 193.816 cir0
56537 69670.3 193.816 cir0
56537 68378.2 193.816 cir0
56537 67086.1 193.816 cir0
56537 65794 193.816 cir0
56537 64501.9 193.816 cir0
56537 63209.7 193.816 cir0
56537 61917.6 193.816 cir0
56537 60625.5 193.816 cir0
56537 58773.9 193.816 cir0
newpath
60677.9 66945 moveto
60677.9 66555.7 lineto
stroke
newpath
60483.2 66750.3 moveto
60872.5 66750.3 lineto
stroke
newpath
60677.9 60484.4 moveto
60677.9 60095.2 lineto
stroke
newpath
60483.2 60289.8 moveto
60872.5 60289.8 lineto
stroke
newpath
61970 66945 moveto
61970 66555.7 lineto
stroke
newpath
61775.3 66750.3 moveto
62164.6 66750.3 lineto
stroke
newpath
61970 60484.4 moveto
61970 60095.2 lineto
stroke
newpath
61775.3 60289.8 moveto
62164.6 60289.8 lineto
stroke
newpath
63262.1 66945 moveto
63262.1 66555.7 lineto
stroke
newpath
63067.4 66750.3 moveto
63456.7 66750.3 lineto
stroke
newpath
63262.1 60484.4 moveto
63262.1 60095.2 lineto
stroke
newpath
63067.4 60289.8 moveto
63456.7 60289.8 lineto
stroke
newpath
64554.2 66945 moveto
64554.2 66555.7 lineto
stroke
newpath
64359.5 66750.3 moveto
64748.8 66750.3 lineto
stroke
newpath
64554.2 60484.4 moveto
64554.2 60095.2 lineto
stroke
newpath
64359.5 60289.8 moveto
64748.8 60289.8 lineto
stroke
newpath
65846.3 66945 moveto
65846.3 66555.7 lineto
stroke
newpath
65651.6 66750.3 moveto
66040.9 66750.3 lineto
stroke
newpath
65846.3 60484.4 moveto
65846.3 60095.2 lineto
stroke
newpath
65651.6 60289.8 moveto
66040.9 60289.8 lineto
stroke
newpath
62346.4 57751.7 moveto
62346.4 57362.4 lineto
stroke
newpath
62151.8 57557 moveto
62541 57557 lineto
stroke
newpath
62346.4 56408.7 moveto
62346.4 56019.4 lineto
stroke
newpath
62151.8 56214.1 moveto
62541 56214.1 lineto
stroke
newpath
62346.4 51830.4 moveto
62346.4 51441.1 lineto
stroke
newpath
62151.8 51635.7 moveto
62541 51635.7 lineto
stroke
newpath
62346.4 50538.3 moveto
62346.4 50149 lineto
stroke
newpath
62151.8 50343.6 moveto
62541 50343.6 lineto
stroke
newpath
71778.8 57751.7 moveto
71778.8 57362.4 lineto
stroke
newpath
71584.1 57557 moveto
71973.4 57557 lineto
stroke
newpath
71778.8 56408.7 moveto
71778.8 56019.4 lineto
stroke
newpath
71584.1 56214.1 moveto
71973.4 56214.1 lineto
stroke
newpath
71778.8 51830.4 moveto
71778.8 51441.1 lineto
stroke
newpath
71584.1 51635.7 moveto
71973.4 51635.7 lineto
stroke
newpath
71778.8 50538.3 moveto
71778.8 50149 lineto
stroke
newpath
71584.1 50343.6 moveto
71973.4 50343.6 lineto
stroke
newpath
54188.3 47158.7 moveto
54188.3 47446.5 lineto
53900.5 47446.5 lineto
53900.5 47158.7 lineto
54188.3 47158.7 lineto
poly0
newpath
54188.3 40698.2 moveto
54188.3 40986 lineto
53900.5 40986 lineto
53900.5 40698.2 lineto
54188.3 40698.2 lineto
poly0
newpath
55480.4 47158.7 moveto
55480.4 47446.5 lineto
55192.6 47446.5 lineto
55192.6 47158.7 lineto
55480.4 47158.7 lineto
poly0
newpath
55480.4 40698.2 moveto
55480.4 40986 lineto
55192.6 40986 lineto
55192.6 40698.2 lineto
55480.4 40698.2 lineto
poly0
newpath
56772.5 47158.7 moveto
56772.5 47446.5 lineto
56484.7 47446.5 lineto
56484.7 47158.7 lineto
56772.5 47158.7 lineto
poly0
newpath
56772.5 40698.2 moveto
56772.5 40986 lineto
56484.7 40986 lineto
56484.7 40698.2 lineto
56772.5 40698.2 lineto
poly0
newpath
58064.6 47158.7 moveto
58064.6 47446.5 lineto
57776.8 47446.5 lineto
57776.8 47158.7 lineto
58064.6 47158.7 lineto
poly0
newpath
58064.6 40698.2 moveto
58064.6 40986 lineto
57776.8 40986 lineto
57776.8 40698.2 lineto
58064.6 40698.2 lineto
poly0
newpath
59356.7 47158.7 moveto
59356.7 47446.5 lineto
59068.9 47446.5 lineto
59068.9 47158.7 lineto
59356.7 47158.7 lineto
poly0
newpath
59356.7 40698.2 moveto
59356.7 40986 lineto
59068.9 40986 lineto
59068.9 40698.2 lineto
59356.7 40698.2 lineto
poly0
newpath
60648.8 47158.7 moveto
60648.8 47446.5 lineto
60361 47446.5 lineto
60361 47158.7 lineto
60648.8 47158.7 lineto
poly0
newpath
60648.8 40698.2 moveto
60648.8 40986 lineto
60361 40986 lineto
60361 40698.2 lineto
60648.8 40698.2 lineto
poly0
newpath
61940.9 47158.7 moveto
61940.9 47446.5 lineto
61653.1 47446.5 lineto
61653.1 47158.7 lineto
61940.9 47158.7 lineto
poly0
newpath
61940.9 40698.2 moveto
61940.9 40986 lineto
61653.1 40986 lineto
61653.1 40698.2 lineto
61940.9 40698.2 lineto
poly0
newpath
63233 47158.7 moveto
63233 47446.5 lineto
62945.2 47446.5 lineto
62945.2 47158.7 lineto
63233 47158.7 lineto
poly0
newpath
63233 40698.2 moveto
63233 40986 lineto
62945.2 40986 lineto
62945.2 40698.2 lineto
63233 40698.2 lineto
poly0
newpath
74948.4 53436.1 moveto
74948.4 53723.9 lineto
74660.7 53723.9 lineto
74660.7 53436.1 lineto
74948.4 53436.1 lineto
poly0
newpath
74968.6 52918.7 moveto
74968.6 54241.3 lineto
stroke
newpath
74640.4 52918.7 moveto
74640.4 54241.3 lineto
stroke
74804.5 54241.3 164.111 360 540 arc0
74804.5 52918.7 164.111 180 360 arc0
newpath
76474.5 55877.9 moveto
76474.5 56165.7 lineto
76186.8 56165.7 lineto
76186.8 55877.9 lineto
76474.5 55877.9 lineto
poly0
newpath
76890.2 56185.9 moveto
75771.1 56185.9 lineto
stroke
newpath
76890.2 55857.7 moveto
75771.1 55857.7 lineto
stroke
75771.1 56021.8 164.111 450 630 arc0
76890.2 56021.8 164.111 270 450 arc0
newpath
77898.9 53436.1 moveto
77898.9 53723.9 lineto
77611.1 53723.9 lineto
77611.1 53436.1 lineto
77898.9 53436.1 lineto
poly0
newpath
77919.1 53020.4 moveto
77919.1 54139.6 lineto
stroke
newpath
77590.9 53020.4 moveto
77590.9 54139.6 lineto
stroke
77755 54139.6 164.111 360 540 arc0
77755 53020.4 164.111 180 360 arc0
newpath
40285.4 47194.3 moveto
40285.4 47482.1 lineto
39997.6 47482.1 lineto
39997.6 47194.3 lineto
40285.4 47194.3 lineto
poly0
newpath
40285.4 40733.8 moveto
40285.4 41021.6 lineto
39997.6 41021.6 lineto
39997.6 40733.8 lineto
40285.4 40733.8 lineto
poly0
newpath
41577.5 47194.3 moveto
41577.5 47482.1 lineto
41289.7 47482.1 lineto
41289.7 47194.3 lineto
41577.5 47194.3 lineto
poly0
newpath
41577.5 40733.8 moveto
41577.5 41021.6 lineto
41289.7 41021.6 lineto
41289.7 40733.8 lineto
41577.5 40733.8 lineto
poly0
newpath
42869.6 47194.3 moveto
42869.6 47482.1 lineto
42581.8 47482.1 lineto
42581.8 47194.3 lineto
42869.6 47194.3 lineto
poly0
newpath
42869.6 40733.8 moveto
42869.6 41021.6 lineto
42581.8 41021.6 lineto
42581.8 40733.8 lineto
42869.6 40733.8 lineto
poly0
newpath
44161.7 47194.3 moveto
44161.7 47482.1 lineto
43874 47482.1 lineto
43874 47194.3 lineto
44161.7 47194.3 lineto
poly0
newpath
44161.7 40733.8 moveto
44161.7 41021.6 lineto
43874 41021.6 lineto
43874 40733.8 lineto
44161.7 40733.8 lineto
poly0
newpath
45453.8 47194.3 moveto
45453.8 47482.1 lineto
45166.1 47482.1 lineto
45166.1 47194.3 lineto
45453.8 47194.3 lineto
poly0
newpath
45453.8 40733.8 moveto
45453.8 41021.6 lineto
45166.1 41021.6 lineto
45166.1 40733.8 lineto
45453.8 40733.8 lineto
poly0
newpath
46745.9 47194.3 moveto
46745.9 47482.1 lineto
46458.2 47482.1 lineto
46458.2 47194.3 lineto
46745.9 47194.3 lineto
poly0
newpath
46745.9 40733.8 moveto
46745.9 41021.6 lineto
46458.2 41021.6 lineto
46458.2 40733.8 lineto
46745.9 40733.8 lineto
poly0
newpath
48038 47194.3 moveto
48038 47482.1 lineto
47750.3 47482.1 lineto
47750.3 47194.3 lineto
48038 47194.3 lineto
poly0
newpath
48038 40733.8 moveto
48038 41021.6 lineto
47750.3 41021.6 lineto
47750.3 40733.8 lineto
48038 40733.8 lineto
poly0
newpath
49330.1 47194.3 moveto
49330.1 47482.1 lineto
49042.4 47482.1 lineto
49042.4 47194.3 lineto
49330.1 47194.3 lineto
poly0
newpath
49330.1 40733.8 moveto
49330.1 41021.6 lineto
49042.4 41021.6 lineto
49042.4 40733.8 lineto
49330.1 40733.8 lineto
poly0
newpath
66432.7 47158.7 moveto
66432.7 47446.5 lineto
66145 47446.5 lineto
66145 47158.7 lineto
66432.7 47158.7 lineto
poly0
newpath
66432.7 40698.2 moveto
66432.7 40986 lineto
66145 40986 lineto
66145 40698.2 lineto
66432.7 40698.2 lineto
poly0
newpath
67724.8 47158.7 moveto
67724.8 47446.5 lineto
67437.1 47446.5 lineto
67437.1 47158.7 lineto
67724.8 47158.7 lineto
poly0
newpath
67724.8 40698.2 moveto
67724.8 40986 lineto
67437.1 40986 lineto
67437.1 40698.2 lineto
67724.8 40698.2 lineto
poly0
newpath
69016.9 47158.7 moveto
69016.9 47446.5 lineto
68729.2 47446.5 lineto
68729.2 47158.7 lineto
69016.9 47158.7 lineto
poly0
newpath
69016.9 40698.2 moveto
69016.9 40986 lineto
68729.2 40986 lineto
68729.2 40698.2 lineto
69016.9 40698.2 lineto
poly0
newpath
70309 47158.7 moveto
70309 47446.5 lineto
70021.3 47446.5 lineto
70021.3 47158.7 lineto
70309 47158.7 lineto
poly0
newpath
70309 40698.2 moveto
70309 40986 lineto
70021.3 40986 lineto
70021.3 40698.2 lineto
70309 40698.2 lineto
poly0
newpath
71601.2 47158.7 moveto
71601.2 47446.5 lineto
71313.4 47446.5 lineto
71313.4 47158.7 lineto
71601.2 47158.7 lineto
poly0
newpath
71601.2 40698.2 moveto
71601.2 40986 lineto
71313.4 40986 lineto
71313.4 40698.2 lineto
71601.2 40698.2 lineto
poly0
newpath
72893.3 47158.7 moveto
72893.3 47446.5 lineto
72605.5 47446.5 lineto
72605.5 47158.7 lineto
72893.3 47158.7 lineto
poly0
newpath
72893.3 40698.2 moveto
72893.3 40986 lineto
72605.5 40986 lineto
72605.5 40698.2 lineto
72893.3 40698.2 lineto
poly0
newpath
74185.4 47158.7 moveto
74185.4 47446.5 lineto
73897.6 47446.5 lineto
73897.6 47158.7 lineto
74185.4 47158.7 lineto
poly0
newpath
74185.4 40698.2 moveto
74185.4 40986 lineto
73897.6 40986 lineto
73897.6 40698.2 lineto
74185.4 40698.2 lineto
poly0
newpath
75477.5 47158.7 moveto
75477.5 47446.5 lineto
75189.7 47446.5 lineto
75189.7 47158.7 lineto
75477.5 47158.7 lineto
poly0
newpath
75477.5 40698.2 moveto
75477.5 40986 lineto
75189.7 40986 lineto
75189.7 40698.2 lineto
75477.5 40698.2 lineto
poly0
newpath
48738.6 45379.7 moveto
48993 45634.1 lineto
48738.6 45888.4 lineto
48484.2 45634.1 lineto
48738.6 45379.7 lineto
poly0
newpath
49186.3 43136.3 moveto
49440.6 43390.7 lineto
49186.3 43645 lineto
48931.9 43390.7 lineto
49186.3 43136.3 lineto
poly0
newpath
54298.7 43848.5 moveto
54553.1 44102.9 lineto
54298.7 44357.2 lineto
54044.4 44102.9 lineto
54298.7 43848.5 lineto
poly0
newpath
63094.2 43599.3 moveto
63348.5 43853.6 lineto
63094.2 44108 lineto
62839.8 43853.6 lineto
63094.2 43599.3 lineto
poly0
newpath
75318.3 43187.2 moveto
75572.7 43441.6 lineto
75318.3 43695.9 lineto
75064 43441.6 lineto
75318.3 43187.2 lineto
poly0
newpath
77236.1 48350.5 moveto
77490.5 48604.9 lineto
77236.1 48859.2 lineto
76981.8 48604.9 lineto
77236.1 48350.5 lineto
poly0
newpath
69067.4 77859.4 moveto
69584.2 77342.5 lineto
stroke
newpath
69584.2 77859.4 moveto
69067.4 77342.5 lineto
stroke
69325.8 77601 258.421 cir0
newpath
70359.5 77859.4 moveto
70876.3 77342.5 lineto
stroke
newpath
70876.3 77859.4 moveto
70359.5 77342.5 lineto
stroke
70617.9 77601 258.421 cir0
newpath
71651.6 77859.4 moveto
72168.4 77342.5 lineto
stroke
newpath
72168.4 77859.4 moveto
71651.6 77342.5 lineto
stroke
71910 77601 258.421 cir0
newpath
72943.7 77859.4 moveto
73460.5 77342.5 lineto
stroke
newpath
73460.5 77859.4 moveto
72943.7 77342.5 lineto
stroke
73202.1 77601 258.421 cir0
newpath
74235.8 77859.4 moveto
74752.6 77342.5 lineto
stroke
newpath
74752.6 77859.4 moveto
74235.8 77342.5 lineto
stroke
74494.2 77601 258.421 cir0
newpath
75527.9 77859.4 moveto
76044.8 77342.5 lineto
stroke
newpath
76044.8 77859.4 moveto
75527.9 77342.5 lineto
stroke
75786.3 77601 258.421 cir0
newpath
76820 77859.4 moveto
77336.9 77342.5 lineto
stroke
newpath
77336.9 77859.4 moveto
76820 77342.5 lineto
stroke
77078.4 77601 258.421 cir0
newpath
78112.1 77859.4 moveto
78629 77342.5 lineto
stroke
newpath
78629 77859.4 moveto
78112.1 77342.5 lineto
stroke
78370.5 77601 258.421 cir0
newpath
79404.2 77859.4 moveto
79921.1 77342.5 lineto
stroke
newpath
79921.1 77859.4 moveto
79404.2 77342.5 lineto
stroke
79662.6 77601 258.421 cir0
newpath
80696.3 77859.4 moveto
81213.2 77342.5 lineto
stroke
newpath
81213.2 77859.4 moveto
80696.3 77342.5 lineto
stroke
80954.8 77601 258.421 cir0
newpath
80569.2 48369.9 moveto
81086 47853 lineto
stroke
newpath
81086 48369.9 moveto
80569.2 47853 lineto
stroke
80827.6 48111.4 258.421 cir0
newpath
80569.2 47077.8 moveto
81086 46560.9 lineto
stroke
newpath
81086 47077.8 moveto
80569.2 46560.9 lineto
stroke
80827.6 46819.3 258.421 cir0
newpath
80569.2 45785.7 moveto
81086 45268.8 lineto
stroke
newpath
81086 45785.7 moveto
80569.2 45268.8 lineto
stroke
80827.6 45527.2 258.421 cir0
newpath
80569.2 44493.6 moveto
81086 43976.7 lineto
stroke
newpath
81086 44493.6 moveto
80569.2 43976.7 lineto
stroke
80827.6 44235.1 258.421 cir0
newpath
35798.2 46594.5 moveto
36315.1 46077.7 lineto
stroke
newpath
36315.1 46594.5 moveto
35798.2 46077.7 lineto
stroke
36056.6 46336.1 258.421 cir0
newpath
35798.2 45302.4 moveto
36315.1 44785.5 lineto
stroke
newpath
36315.1 45302.4 moveto
35798.2 44785.5 lineto
stroke
36056.6 45044 258.421 cir0
newpath
35798.2 44010.3 moveto
36315.1 43493.4 lineto
stroke
newpath
36315.1 44010.3 moveto
35798.2 43493.4 lineto
stroke
36056.6 43751.9 258.421 cir0
newpath
35798.2 42718.2 moveto
36315.1 42201.3 lineto
stroke
newpath
36315.1 42718.2 moveto
35798.2 42201.3 lineto
stroke
36056.6 42459.8 258.421 cir0
newpath
35808.4 56939 moveto
36325.2 56422.1 lineto
stroke
newpath
36325.2 56939 moveto
35808.4 56422.1 lineto
stroke
36066.8 56680.5 258.421 cir0
newpath
35808.4 55646.9 moveto
36325.2 55130 lineto
stroke
newpath
36325.2 55646.9 moveto
35808.4 55130 lineto
stroke
36066.8 55388.4 258.421 cir0
newpath
35808.4 54354.8 moveto
36325.2 53837.9 lineto
stroke
newpath
36325.2 54354.8 moveto
35808.4 53837.9 lineto
stroke
36066.8 54096.3 258.421 cir0
newpath
35808.4 53062.7 moveto
36325.2 52545.8 lineto
stroke
newpath
36325.2 53062.7 moveto
35808.4 52545.8 lineto
stroke
36066.8 52804.2 258.421 cir0
newpath
35808.4 51770.5 moveto
36325.2 51253.7 lineto
stroke
newpath
36325.2 51770.5 moveto
35808.4 51253.7 lineto
stroke
36066.8 51512.1 258.421 cir0
newpath
35808.4 50478.4 moveto
36325.2 49961.6 lineto
stroke
newpath
36325.2 50478.4 moveto
35808.4 49961.6 lineto
stroke
36066.8 50220 258.421 cir0
newpath
35808.4 49186.3 moveto
36325.2 48669.5 lineto
stroke
newpath
36325.2 49186.3 moveto
35808.4 48669.5 lineto
stroke
36066.8 48927.9 258.421 cir0
newpath
35808.4 47894.2 moveto
36325.2 47377.4 lineto
stroke
newpath
36325.2 47894.2 moveto
35808.4 47377.4 lineto
stroke
36066.8 47635.8 258.421 cir0
newpath
68624.8 38348.4 moveto
69141.7 37831.6 lineto
stroke
newpath
69141.7 38348.4 moveto
68624.8 37831.6 lineto
stroke
68883.2 38090 258.421 cir0
newpath
69916.9 38348.4 moveto
70433.8 37831.6 lineto
stroke
newpath
70433.8 38348.4 moveto
69916.9 37831.6 lineto
stroke
70175.3 38090 258.421 cir0
newpath
71209 38348.4 moveto
71725.9 37831.6 lineto
stroke
newpath
71725.9 38348.4 moveto
71209 37831.6 lineto
stroke
71467.4 38090 258.421 cir0
newpath
72501.1 38348.4 moveto
73018 37831.6 lineto
stroke
newpath
73018 38348.4 moveto
72501.1 37831.6 lineto
stroke
72759.6 38090 258.421 cir0
newpath
69067.4 70132.2 moveto
69584.2 69615.3 lineto
stroke
newpath
69584.2 70132.2 moveto
69067.4 69615.3 lineto
stroke
69325.8 69873.8 258.421 cir0
newpath
70359.5 70132.2 moveto
70876.3 69615.3 lineto
stroke
newpath
70876.3 70132.2 moveto
70359.5 69615.3 lineto
stroke
70617.9 69873.8 258.421 cir0
newpath
71651.6 70132.2 moveto
72168.4 69615.3 lineto
stroke
newpath
72168.4 70132.2 moveto
71651.6 69615.3 lineto
stroke
71910 69873.8 258.421 cir0
newpath
72943.7 70132.2 moveto
73460.5 69615.3 lineto
stroke
newpath
73460.5 70132.2 moveto
72943.7 69615.3 lineto
stroke
73202.1 69873.8 258.421 cir0
newpath
74235.8 70132.2 moveto
74752.6 69615.3 lineto
stroke
newpath
74752.6 70132.2 moveto
74235.8 69615.3 lineto
stroke
74494.2 69873.8 258.421 cir0
newpath
75527.9 70132.2 moveto
76044.8 69615.3 lineto
stroke
newpath
76044.8 70132.2 moveto
75527.9 69615.3 lineto
stroke
75786.3 69873.8 258.421 cir0
newpath
76820 70132.2 moveto
77336.9 69615.3 lineto
stroke
newpath
77336.9 70132.2 moveto
76820 69615.3 lineto
stroke
77078.4 69873.8 258.421 cir0
newpath
78112.1 70132.2 moveto
78629 69615.3 lineto
stroke
newpath
78629 70132.2 moveto
78112.1 69615.3 lineto
stroke
78370.5 69873.8 258.421 cir0
newpath
69067.4 67319.1 moveto
69584.2 66802.2 lineto
stroke
newpath
69584.2 67319.1 moveto
69067.4 66802.2 lineto
stroke
69325.8 67060.6 258.421 cir0
newpath
70359.5 67319.1 moveto
70876.3 66802.2 lineto
stroke
newpath
70876.3 67319.1 moveto
70359.5 66802.2 lineto
stroke
70617.9 67060.6 258.421 cir0
newpath
71651.6 67319.1 moveto
72168.4 66802.2 lineto
stroke
newpath
72168.4 67319.1 moveto
71651.6 66802.2 lineto
stroke
71910 67060.6 258.421 cir0
newpath
72943.7 67319.1 moveto
73460.5 66802.2 lineto
stroke
newpath
73460.5 67319.1 moveto
72943.7 66802.2 lineto
stroke
73202.1 67060.6 258.421 cir0
newpath
79409.3 70137.3 moveto
79926.2 69620.4 lineto
stroke
newpath
79926.2 70137.3 moveto
79409.3 69620.4 lineto
stroke
79667.7 69878.8 258.421 cir0
newpath
80701.4 70137.3 moveto
81218.3 69620.4 lineto
stroke
newpath
81218.3 70137.3 moveto
80701.4 69620.4 lineto
stroke
80959.8 69878.8 258.421 cir0
newpath
56370.2 38343.3 moveto
56887 37826.5 lineto
stroke
newpath
56887 38343.3 moveto
56370.2 37826.5 lineto
stroke
56628.6 38084.9 258.421 cir0
newpath
57662.3 38343.3 moveto
58179.1 37826.5 lineto
stroke
newpath
58179.1 38343.3 moveto
57662.3 37826.5 lineto
stroke
57920.7 38084.9 258.421 cir0
newpath
58954.4 38343.3 moveto
59471.2 37826.5 lineto
stroke
newpath
59471.2 38343.3 moveto
58954.4 37826.5 lineto
stroke
59212.8 38084.9 258.421 cir0
newpath
60246.5 38343.3 moveto
60763.3 37826.5 lineto
stroke
newpath
60763.3 38343.3 moveto
60246.5 37826.5 lineto
stroke
60504.9 38084.9 258.421 cir0
newpath
42431.7 38292.5 moveto
42948.5 37775.6 lineto
stroke
newpath
42948.5 38292.5 moveto
42431.7 37775.6 lineto
stroke
42690.1 38034 258.421 cir0
newpath
43723.8 38292.5 moveto
44240.7 37775.6 lineto
stroke
newpath
44240.7 38292.5 moveto
43723.8 37775.6 lineto
stroke
43982.2 38034 258.421 cir0
newpath
45015.9 38292.5 moveto
45532.8 37775.6 lineto
stroke
newpath
45532.8 38292.5 moveto
45015.9 37775.6 lineto
stroke
45274.3 38034 258.421 cir0
newpath
46308 38292.5 moveto
46824.9 37775.6 lineto
stroke
newpath
46824.9 38292.5 moveto
46308 37775.6 lineto
stroke
46566.4 38034 258.421 cir0
newpath
75196.2 58580.6 moveto
75755.8 58021 lineto
stroke
newpath
75755.8 58580.6 moveto
75196.2 58021 lineto
stroke
newpath
75476 58580.6 moveto
75476 58021 lineto
stroke
newpath
75196.2 58300.8 moveto
75755.8 58300.8 lineto
stroke
newpath
80364.7 58580.6 moveto
80924.2 58021 lineto
stroke
newpath
80924.2 58580.6 moveto
80364.7 58021 lineto
stroke
newpath
80644.4 58580.6 moveto
80644.4 58021 lineto
stroke
newpath
80364.7 58300.8 moveto
80924.2 58300.8 lineto
stroke
newpath
75374.3 50253.1 moveto
75933.9 49693.5 lineto
stroke
newpath
75933.9 50253.1 moveto
75374.3 49693.5 lineto
stroke
newpath
75654.1 50253.1 moveto
75654.1 49693.5 lineto
stroke
newpath
75374.3 49973.3 moveto
75933.9 49973.3 lineto
stroke
newpath
80542.7 50253.1 moveto
81102.3 49693.5 lineto
stroke
newpath
81102.3 50253.1 moveto
80542.7 49693.5 lineto
stroke
newpath
80822.5 50253.1 moveto
80822.5 49693.5 lineto
stroke
newpath
80542.7 49973.3 moveto
81102.3 49973.3 lineto
stroke
newpath
75231.8 60630.6 moveto
75791.4 60071.1 lineto
stroke
newpath
75791.4 60630.6 moveto
75231.8 60071.1 lineto
stroke
newpath
75511.6 60630.6 moveto
75511.6 60071.1 lineto
stroke
newpath
75231.8 60350.8 moveto
75791.4 60350.8 lineto
stroke
newpath
80400.3 60630.6 moveto
80959.8 60071.1 lineto
stroke
newpath
80959.8 60630.6 moveto
80400.3 60071.1 lineto
stroke
newpath
80680.1 60630.6 moveto
80680.1 60071.1 lineto
stroke
newpath
80400.3 60350.8 moveto
80959.8 60350.8 lineto
stroke
newpath
62249.7 76985.4 moveto
63023 76212.2 lineto
stroke
newpath
63023 76985.4 moveto
62249.7 76212.2 lineto
stroke
newpath
62909.7 76325.4 moveto
62909.7 76872.2 lineto
62363 76872.2 lineto
62363 76325.4 lineto
62909.7 76325.4 lineto
poly0
newpath
64834 76985.4 moveto
65607.2 76212.2 lineto
stroke
newpath
65607.2 76985.4 moveto
64834 76212.2 lineto
stroke
newpath
65494 76325.4 moveto
65494 76872.2 lineto
64947.2 76872.2 lineto
64947.2 76325.4 lineto
65494 76325.4 lineto
poly0
118.11 setlinewidth
0 0 0 setrgbcolor
0 0 0 setrgbcolor
newpath
36011.7 35175.5 moveto
36011.7 36356.6 lineto
36293 36356.6 lineto
36461.7 36300.3 lineto
36574.2 36187.9 lineto
36630.4 36075.4 lineto
36686.7 35850.4 lineto
36686.7 35681.7 lineto
36630.4 35456.7 lineto
36574.2 35344.2 lineto
36461.7 35231.7 lineto
36293 35175.5 lineto
36011.7 35175.5 lineto
stroke
newpath
37192.9 35175.5 moveto
37192.9 35962.9 lineto
stroke
newpath
37192.9 35737.9 moveto
37249.1 35850.4 lineto
37305.3 35906.6 lineto
37417.8 35962.9 lineto
37530.3 35962.9 lineto
stroke
newpath
37924 35175.5 moveto
37924 35962.9 lineto
stroke
newpath
37924 36356.6 moveto
37867.8 36300.3 lineto
37924 36244.1 lineto
37980.3 36300.3 lineto
37924 36356.6 lineto
37924 36244.1 lineto
stroke
newpath
38655.2 35175.5 moveto
38542.7 35231.7 lineto
38486.4 35344.2 lineto
38486.4 36356.6 lineto
stroke
newpath
39273.8 35175.5 moveto
39161.4 35231.7 lineto
39105.1 35344.2 lineto
39105.1 36356.6 lineto
stroke
newpath
40623.7 35175.5 moveto
40623.7 36356.6 lineto
41017.4 35512.9 lineto
41411.1 36356.6 lineto
41411.1 35175.5 lineto
stroke
newpath
42479.7 35175.5 moveto
42479.7 35794.2 lineto
42423.4 35906.6 lineto
42311 35962.9 lineto
42086 35962.9 lineto
41973.5 35906.6 lineto
stroke
newpath
42479.7 35231.7 moveto
42367.2 35175.5 lineto
42086 35175.5 lineto
41973.5 35231.7 lineto
41917.3 35344.2 lineto
41917.3 35456.7 lineto
41973.5 35569.2 lineto
42086 35625.4 lineto
42367.2 35625.4 lineto
42479.7 35681.7 lineto
stroke
newpath
43042.1 35962.9 moveto
43042.1 34781.8 lineto
stroke
newpath
43042.1 35906.6 moveto
43154.6 35962.9 lineto
43379.6 35962.9 lineto
43492.1 35906.6 lineto
43548.3 35850.4 lineto
43604.5 35737.9 lineto
43604.5 35400.5 lineto
43548.3 35288 lineto
43492.1 35231.7 lineto
43379.6 35175.5 lineto
43154.6 35175.5 lineto
43042.1 35231.7 lineto
stroke
newpath
44110.7 35288 moveto
44167 35231.7 lineto
44110.7 35175.5 lineto
44054.5 35231.7 lineto
44110.7 35288 lineto
44110.7 35175.5 lineto
stroke
newpath
44110.7 35906.6 moveto
44167 35850.4 lineto
44110.7 35794.2 lineto
44054.5 35850.4 lineto
44110.7 35906.6 lineto
44110.7 35794.2 lineto
stroke
newpath
34680.6 33331.2 moveto
34884.1 33127.7 lineto
stroke
newpath
34884.1 33331.2 moveto
34680.6 33127.7 lineto
stroke
0 0 0 setrgbcolor
0 0 0 setrgbcolor
newpath
36236.7 33876.3 moveto
36349.2 33876.3 lineto
36461.7 33820 lineto
36517.9 33763.8 lineto
36574.2 33651.3 lineto
36630.4 33426.3 lineto
36630.4 33145.1 lineto
36574.2 32920.1 lineto
36517.9 32807.7 lineto
36461.7 32751.4 lineto
36349.2 32695.2 lineto
36236.7 32695.2 lineto
36124.2 32751.4 lineto
36068 32807.7 lineto
36011.7 32920.1 lineto
35955.5 33145.1 lineto
35955.5 33426.3 lineto
36011.7 33651.3 lineto
36068 33763.8 lineto
36124.2 33820 lineto
36236.7 33876.3 lineto
stroke
newpath
37136.6 32807.7 moveto
37192.9 32751.4 lineto
37136.6 32695.2 lineto
37080.4 32751.4 lineto
37136.6 32807.7 lineto
37136.6 32695.2 lineto
stroke
newpath
38205.2 33482.6 moveto
38205.2 32695.2 lineto
stroke
newpath
37924 33932.5 moveto
37642.8 33088.9 lineto
38374 33088.9 lineto
stroke
newpath
39048.9 33876.3 moveto
39161.4 33876.3 lineto
39273.8 33820 lineto
39330.1 33763.8 lineto
39386.3 33651.3 lineto
39442.6 33426.3 lineto
39442.6 33145.1 lineto
39386.3 32920.1 lineto
39330.1 32807.7 lineto
39273.8 32751.4 lineto
39161.4 32695.2 lineto
39048.9 32695.2 lineto
38936.4 32751.4 lineto
38880.1 32807.7 lineto
38823.9 32920.1 lineto
38767.7 33145.1 lineto
38767.7 33426.3 lineto
38823.9 33651.3 lineto
38880.1 33763.8 lineto
38936.4 33820 lineto
39048.9 33876.3 lineto
stroke
newpath
39948.8 32695.2 moveto
39948.8 33482.6 lineto
stroke
newpath
39948.8 33370.1 moveto
40005 33426.3 lineto
40117.5 33482.6 lineto
40286.2 33482.6 lineto
40398.7 33426.3 lineto
40454.9 33313.8 lineto
40454.9 32695.2 lineto
stroke
newpath
40454.9 33313.8 moveto
40511.2 33426.3 lineto
40623.7 33482.6 lineto
40792.4 33482.6 lineto
40904.9 33426.3 lineto
40961.1 33313.8 lineto
40961.1 32695.2 lineto
stroke
newpath
41523.6 32695.2 moveto
41523.6 33482.6 lineto
stroke
newpath
41523.6 33370.1 moveto
41579.8 33426.3 lineto
41692.3 33482.6 lineto
41861 33482.6 lineto
41973.5 33426.3 lineto
42029.7 33313.8 lineto
42029.7 32695.2 lineto
stroke
newpath
42029.7 33313.8 moveto
42086 33426.3 lineto
42198.5 33482.6 lineto
42367.2 33482.6 lineto
42479.7 33426.3 lineto
42535.9 33313.8 lineto
42535.9 32695.2 lineto
stroke
newpath
44841.9 33932.5 moveto
43829.5 32414 lineto
stroke
newpath
46360.5 33876.3 moveto
46472.9 33876.3 lineto
46585.4 33820 lineto
46641.7 33763.8 lineto
46697.9 33651.3 lineto
46754.2 33426.3 lineto
46754.2 33145.1 lineto
46697.9 32920.1 lineto
46641.7 32807.7 lineto
46585.4 32751.4 lineto
46472.9 32695.2 lineto
46360.5 32695.2 lineto
46248 32751.4 lineto
46191.7 32807.7 lineto
46135.5 32920.1 lineto
46079.2 33145.1 lineto
46079.2 33426.3 lineto
46135.5 33651.3 lineto
46191.7 33763.8 lineto
46248 33820 lineto
46360.5 33876.3 lineto
stroke
newpath
47260.3 32807.7 moveto
47316.6 32751.4 lineto
47260.3 32695.2 lineto
47204.1 32751.4 lineto
47260.3 32807.7 lineto
47260.3 32695.2 lineto
stroke
newpath
48047.7 33876.3 moveto
48160.2 33876.3 lineto
48272.7 33820 lineto
48329 33763.8 lineto
48385.2 33651.3 lineto
48441.4 33426.3 lineto
48441.4 33145.1 lineto
48385.2 32920.1 lineto
48329 32807.7 lineto
48272.7 32751.4 lineto
48160.2 32695.2 lineto
48047.7 32695.2 lineto
47935.3 32751.4 lineto
47879 32807.7 lineto
47822.8 32920.1 lineto
47766.5 33145.1 lineto
47766.5 33426.3 lineto
47822.8 33651.3 lineto
47879 33763.8 lineto
47935.3 33820 lineto
48047.7 33876.3 lineto
stroke
newpath
49566.3 32695.2 moveto
48891.4 32695.2 lineto
stroke
newpath
49228.8 32695.2 moveto
49228.8 33876.3 lineto
49116.4 33707.5 lineto
49003.9 33595.1 lineto
48891.4 33538.8 lineto
stroke
newpath
50578.7 33876.3 moveto
50353.7 33876.3 lineto
50241.2 33820 lineto
50185 33763.8 lineto
50072.5 33595.1 lineto
50016.2 33370.1 lineto
50016.2 32920.1 lineto
50072.5 32807.7 lineto
50128.7 32751.4 lineto
50241.2 32695.2 lineto
50466.2 32695.2 lineto
50578.7 32751.4 lineto
50634.9 32807.7 lineto
50691.2 32920.1 lineto
50691.2 33201.4 lineto
50634.9 33313.8 lineto
50578.7 33370.1 lineto
50466.2 33426.3 lineto
50241.2 33426.3 lineto
50128.7 33370.1 lineto
50072.5 33313.8 lineto
50016.2 33201.4 lineto
stroke
newpath
51141.1 33876.3 moveto
51141.1 33651.3 lineto
stroke
newpath
51591.1 33876.3 moveto
51591.1 33651.3 lineto
stroke
newpath
53334.6 32245.2 moveto
53278.3 32301.5 lineto
53165.9 32470.2 lineto
53109.6 32582.7 lineto
53053.4 32751.4 lineto
52997.1 33032.6 lineto
52997.1 33257.6 lineto
53053.4 33538.8 lineto
53109.6 33707.5 lineto
53165.9 33820 lineto
53278.3 33988.8 lineto
53334.6 34045 lineto
stroke
newpath
53672 33876.3 moveto
54403.2 33876.3 lineto
54009.5 33426.3 lineto
54178.2 33426.3 lineto
54290.7 33370.1 lineto
54347 33313.8 lineto
54403.2 33201.4 lineto
54403.2 32920.1 lineto
54347 32807.7 lineto
54290.7 32751.4 lineto
54178.2 32695.2 lineto
53840.8 32695.2 lineto
53728.3 32751.4 lineto
53672 32807.7 lineto
stroke
newpath
54853.1 33763.8 moveto
54909.4 33820 lineto
55021.9 33876.3 lineto
55303.1 33876.3 lineto
55415.6 33820 lineto
55471.8 33763.8 lineto
55528.1 33651.3 lineto
55528.1 33538.8 lineto
55471.8 33370.1 lineto
54796.9 32695.2 lineto
55528.1 32695.2 lineto
stroke
newpath
56934.1 32695.2 moveto
56934.1 33876.3 lineto
stroke
newpath
57440.3 32695.2 moveto
57440.3 33313.8 lineto
57384.1 33426.3 lineto
57271.6 33482.6 lineto
57102.9 33482.6 lineto
56990.4 33426.3 lineto
56934.1 33370.1 lineto
stroke
newpath
58171.5 32695.2 moveto
58059 32751.4 lineto
58002.7 32807.7 lineto
57946.5 32920.1 lineto
57946.5 33257.6 lineto
58002.7 33370.1 lineto
58059 33426.3 lineto
58171.5 33482.6 lineto
58340.2 33482.6 lineto
58452.7 33426.3 lineto
58508.9 33370.1 lineto
58565.2 33257.6 lineto
58565.2 32920.1 lineto
58508.9 32807.7 lineto
58452.7 32751.4 lineto
58340.2 32695.2 lineto
58171.5 32695.2 lineto
stroke
newpath
59240.1 32695.2 moveto
59127.6 32751.4 lineto
59071.4 32863.9 lineto
59071.4 33876.3 lineto
stroke
newpath
60140 32751.4 moveto
60027.5 32695.2 lineto
59802.5 32695.2 lineto
59690 32751.4 lineto
59633.8 32863.9 lineto
59633.8 33313.8 lineto
59690 33426.3 lineto
59802.5 33482.6 lineto
60027.5 33482.6 lineto
60140 33426.3 lineto
60196.2 33313.8 lineto
60196.2 33201.4 lineto
59633.8 33088.9 lineto
stroke
newpath
60646.2 32751.4 moveto
60758.7 32695.2 lineto
60983.6 32695.2 lineto
61096.1 32751.4 lineto
61152.4 32863.9 lineto
61152.4 32920.1 lineto
61096.1 33032.6 lineto
60983.6 33088.9 lineto
60814.9 33088.9 lineto
60702.4 33145.1 lineto
60646.2 33257.6 lineto
60646.2 33313.8 lineto
60702.4 33426.3 lineto
60814.9 33482.6 lineto
60983.6 33482.6 lineto
61096.1 33426.3 lineto
stroke
newpath
61546.1 32245.2 moveto
61602.3 32301.5 lineto
61714.8 32470.2 lineto
61771 32582.7 lineto
61827.3 32751.4 lineto
61883.5 33032.6 lineto
61883.5 33257.6 lineto
61827.3 33538.8 lineto
61771 33707.5 lineto
61714.8 33820 lineto
61602.3 33988.8 lineto
61546.1 34045 lineto
stroke
34690.3 31670.4 193.816 cir0
0 0 0 setrgbcolor
0 0 0 setrgbcolor
newpath
36236.7 32317.2 moveto
36349.2 32317.2 lineto
36461.7 32261 lineto
36517.9 32204.7 lineto
36574.2 32092.2 lineto
36630.4 31867.3 lineto
36630.4 31586.1 lineto
36574.2 31361.1 lineto
36517.9 31248.6 lineto
36461.7 31192.4 lineto
36349.2 31136.1 lineto
36236.7 31136.1 lineto
36124.2 31192.4 lineto
36068 31248.6 lineto
36011.7 31361.1 lineto
35955.5 31586.1 lineto
35955.5 31867.3 lineto
36011.7 32092.2 lineto
36068 32204.7 lineto
36124.2 32261 lineto
36236.7 32317.2 lineto
stroke
newpath
37136.6 31248.6 moveto
37192.9 31192.4 lineto
37136.6 31136.1 lineto
37080.4 31192.4 lineto
37136.6 31248.6 lineto
37136.6 31136.1 lineto
stroke
newpath
37586.6 32317.2 moveto
38374 32317.2 lineto
37867.8 31136.1 lineto
stroke
newpath
39330.1 32317.2 moveto
39105.1 32317.2 lineto
38992.6 32261 lineto
38936.4 32204.7 lineto
38823.9 32036 lineto
38767.7 31811 lineto
38767.7 31361.1 lineto
38823.9 31248.6 lineto
38880.1 31192.4 lineto
38992.6 31136.1 lineto
39217.6 31136.1 lineto
39330.1 31192.4 lineto
39386.3 31248.6 lineto
39442.6 31361.1 lineto
39442.6 31642.3 lineto
39386.3 31754.8 lineto
39330.1 31811 lineto
39217.6 31867.3 lineto
38992.6 31867.3 lineto
38880.1 31811 lineto
38823.9 31754.8 lineto
38767.7 31642.3 lineto
stroke
newpath
39948.8 31136.1 moveto
39948.8 31923.5 lineto
stroke
newpath
39948.8 31811 moveto
40005 31867.3 lineto
40117.5 31923.5 lineto
40286.2 31923.5 lineto
40398.7 31867.3 lineto
40454.9 31754.8 lineto
40454.9 31136.1 lineto
stroke
newpath
40454.9 31754.8 moveto
40511.2 31867.3 lineto
40623.7 31923.5 lineto
40792.4 31923.5 lineto
40904.9 31867.3 lineto
40961.1 31754.8 lineto
40961.1 31136.1 lineto
stroke
newpath
41523.6 31136.1 moveto
41523.6 31923.5 lineto
stroke
newpath
41523.6 31811 moveto
41579.8 31867.3 lineto
41692.3 31923.5 lineto
41861 31923.5 lineto
41973.5 31867.3 lineto
42029.7 31754.8 lineto
42029.7 31136.1 lineto
stroke
newpath
42029.7 31754.8 moveto
42086 31867.3 lineto
42198.5 31923.5 lineto
42367.2 31923.5 lineto
42479.7 31867.3 lineto
42535.9 31754.8 lineto
42535.9 31136.1 lineto
stroke
newpath
44841.9 32373.5 moveto
43829.5 30854.9 lineto
stroke
newpath
46360.5 32317.2 moveto
46472.9 32317.2 lineto
46585.4 32261 lineto
46641.7 32204.7 lineto
46697.9 32092.2 lineto
46754.2 31867.3 lineto
46754.2 31586.1 lineto
46697.9 31361.1 lineto
46641.7 31248.6 lineto
46585.4 31192.4 lineto
46472.9 31136.1 lineto
46360.5 31136.1 lineto
46248 31192.4 lineto
46191.7 31248.6 lineto
46135.5 31361.1 lineto
46079.2 31586.1 lineto
46079.2 31867.3 lineto
46135.5 32092.2 lineto
46191.7 32204.7 lineto
46248 32261 lineto
46360.5 32317.2 lineto
stroke
newpath
47260.3 31248.6 moveto
47316.6 31192.4 lineto
47260.3 31136.1 lineto
47204.1 31192.4 lineto
47260.3 31248.6 lineto
47260.3 31136.1 lineto
stroke
newpath
48047.7 32317.2 moveto
48160.2 32317.2 lineto
48272.7 32261 lineto
48329 32204.7 lineto
48385.2 32092.2 lineto
48441.4 31867.3 lineto
48441.4 31586.1 lineto
48385.2 31361.1 lineto
48329 31248.6 lineto
48272.7 31192.4 lineto
48160.2 31136.1 lineto
48047.7 31136.1 lineto
47935.3 31192.4 lineto
47879 31248.6 lineto
47822.8 31361.1 lineto
47766.5 31586.1 lineto
47766.5 31867.3 lineto
47822.8 32092.2 lineto
47879 32204.7 lineto
47935.3 32261 lineto
48047.7 32317.2 lineto
stroke
newpath
48835.1 32317.2 moveto
49566.3 32317.2 lineto
49172.6 31867.3 lineto
49341.3 31867.3 lineto
49453.8 31811 lineto
49510.1 31754.8 lineto
49566.3 31642.3 lineto
49566.3 31361.1 lineto
49510.1 31248.6 lineto
49453.8 31192.4 lineto
49341.3 31136.1 lineto
49003.9 31136.1 lineto
48891.4 31192.4 lineto
48835.1 31248.6 lineto
stroke
newpath
50297.5 32317.2 moveto
50409.9 32317.2 lineto
50522.4 32261 lineto
50578.7 32204.7 lineto
50634.9 32092.2 lineto
50691.2 31867.3 lineto
50691.2 31586.1 lineto
50634.9 31361.1 lineto
50578.7 31248.6 lineto
50522.4 31192.4 lineto
50409.9 31136.1 lineto
50297.5 31136.1 lineto
50185 31192.4 lineto
50128.7 31248.6 lineto
50072.5 31361.1 lineto
50016.2 31586.1 lineto
50016.2 31867.3 lineto
50072.5 32092.2 lineto
50128.7 32204.7 lineto
50185 32261 lineto
50297.5 32317.2 lineto
stroke
newpath
51141.1 32317.2 moveto
51141.1 32092.2 lineto
stroke
newpath
51591.1 32317.2 moveto
51591.1 32092.2 lineto
stroke
newpath
53334.6 30686.2 moveto
53278.3 30742.4 lineto
53165.9 30911.1 lineto
53109.6 31023.6 lineto
53053.4 31192.4 lineto
52997.1 31473.6 lineto
52997.1 31698.5 lineto
53053.4 31979.8 lineto
53109.6 32148.5 lineto
53165.9 32261 lineto
53278.3 32429.7 lineto
53334.6 32485.9 lineto
stroke
newpath
53672 32317.2 moveto
54403.2 32317.2 lineto
54009.5 31867.3 lineto
54178.2 31867.3 lineto
54290.7 31811 lineto
54347 31754.8 lineto
54403.2 31642.3 lineto
54403.2 31361.1 lineto
54347 31248.6 lineto
54290.7 31192.4 lineto
54178.2 31136.1 lineto
53840.8 31136.1 lineto
53728.3 31192.4 lineto
53672 31248.6 lineto
stroke
newpath
55415.6 31923.5 moveto
55415.6 31136.1 lineto
stroke
newpath
55134.4 32373.5 moveto
54853.1 31529.8 lineto
55584.3 31529.8 lineto
stroke
newpath
56934.1 31136.1 moveto
56934.1 32317.2 lineto
stroke
newpath
57440.3 31136.1 moveto
57440.3 31754.8 lineto
57384.1 31867.3 lineto
57271.6 31923.5 lineto
57102.9 31923.5 lineto
56990.4 31867.3 lineto
56934.1 31811 lineto
stroke
newpath
58171.5 31136.1 moveto
58059 31192.4 lineto
58002.7 31248.6 lineto
57946.5 31361.1 lineto
57946.5 31698.5 lineto
58002.7 31811 lineto
58059 31867.3 lineto
58171.5 31923.5 lineto
58340.2 31923.5 lineto
58452.7 31867.3 lineto
58508.9 31811 lineto
58565.2 31698.5 lineto
58565.2 31361.1 lineto
58508.9 31248.6 lineto
58452.7 31192.4 lineto
58340.2 31136.1 lineto
58171.5 31136.1 lineto
stroke
newpath
59240.1 31136.1 moveto
59127.6 31192.4 lineto
59071.4 31304.8 lineto
59071.4 32317.2 lineto
stroke
newpath
60140 31192.4 moveto
60027.5 31136.1 lineto
59802.5 31136.1 lineto
59690 31192.4 lineto
59633.8 31304.8 lineto
59633.8 31754.8 lineto
59690 31867.3 lineto
59802.5 31923.5 lineto
60027.5 31923.5 lineto
60140 31867.3 lineto
60196.2 31754.8 lineto
60196.2 31642.3 lineto
59633.8 31529.8 lineto
stroke
newpath
60646.2 31192.4 moveto
60758.7 31136.1 lineto
60983.6 31136.1 lineto
61096.1 31192.4 lineto
61152.4 31304.8 lineto
61152.4 31361.1 lineto
61096.1 31473.6 lineto
60983.6 31529.8 lineto
60814.9 31529.8 lineto
60702.4 31586.1 lineto
60646.2 31698.5 lineto
60646.2 31754.8 lineto
60702.4 31867.3 lineto
60814.9 31923.5 lineto
60983.6 31923.5 lineto
61096.1 31867.3 lineto
stroke
newpath
61546.1 30686.2 moveto
61602.3 30742.4 lineto
61714.8 30911.1 lineto
61771 31023.6 lineto
61827.3 31192.4 lineto
61883.5 31473.6 lineto
61883.5 31698.5 lineto
61827.3 31979.8 lineto
61771 32148.5 lineto
61714.8 32261 lineto
61602.3 32429.7 lineto
61546.1 32485.9 lineto
stroke
newpath
34689.4 30306 moveto
34689.4 29916.7 lineto
stroke
newpath
34494.8 30111.4 moveto
34884.1 30111.4 lineto
stroke
0 0 0 setrgbcolor
0 0 0 setrgbcolor
newpath
36236.7 30758.2 moveto
36349.2 30758.2 lineto
36461.7 30701.9 lineto
36517.9 30645.7 lineto
36574.2 30533.2 lineto
36630.4 30308.2 lineto
36630.4 30027 lineto
36574.2 29802 lineto
36517.9 29689.5 lineto
36461.7 29633.3 lineto
36349.2 29577.1 lineto
36236.7 29577.1 lineto
36124.2 29633.3 lineto
36068 29689.5 lineto
36011.7 29802 lineto
35955.5 30027 lineto
35955.5 30308.2 lineto
36011.7 30533.2 lineto
36068 30645.7 lineto
36124.2 30701.9 lineto
36236.7 30758.2 lineto
stroke
newpath
37136.6 29689.5 moveto
37192.9 29633.3 lineto
37136.6 29577.1 lineto
37080.4 29633.3 lineto
37136.6 29689.5 lineto
37136.6 29577.1 lineto
stroke
newpath
37586.6 30758.2 moveto
38374 30758.2 lineto
37867.8 29577.1 lineto
stroke
newpath
38711.4 30758.2 moveto
39498.8 30758.2 lineto
38992.6 29577.1 lineto
stroke
newpath
39948.8 29577.1 moveto
39948.8 30364.5 lineto
stroke
newpath
39948.8 30252 moveto
40005 30308.2 lineto
40117.5 30364.5 lineto
40286.2 30364.5 lineto
40398.7 30308.2 lineto
40454.9 30195.7 lineto
40454.9 29577.1 lineto
stroke
newpath
40454.9 30195.7 moveto
40511.2 30308.2 lineto
40623.7 30364.5 lineto
40792.4 30364.5 lineto
40904.9 30308.2 lineto
40961.1 30195.7 lineto
40961.1 29577.1 lineto
stroke
newpath
41523.6 29577.1 moveto
41523.6 30364.5 lineto
stroke
newpath
41523.6 30252 moveto
41579.8 30308.2 lineto
41692.3 30364.5 lineto
41861 30364.5 lineto
41973.5 30308.2 lineto
42029.7 30195.7 lineto
42029.7 29577.1 lineto
stroke
newpath
42029.7 30195.7 moveto
42086 30308.2 lineto
42198.5 30364.5 lineto
42367.2 30364.5 lineto
42479.7 30308.2 lineto
42535.9 30195.7 lineto
42535.9 29577.1 lineto
stroke
newpath
44841.9 30814.4 moveto
43829.5 29295.8 lineto
stroke
newpath
46360.5 30758.2 moveto
46472.9 30758.2 lineto
46585.4 30701.9 lineto
46641.7 30645.7 lineto
46697.9 30533.2 lineto
46754.2 30308.2 lineto
46754.2 30027 lineto
46697.9 29802 lineto
46641.7 29689.5 lineto
46585.4 29633.3 lineto
46472.9 29577.1 lineto
46360.5 29577.1 lineto
46248 29633.3 lineto
46191.7 29689.5 lineto
46135.5 29802 lineto
46079.2 30027 lineto
46079.2 30308.2 lineto
46135.5 30533.2 lineto
46191.7 30645.7 lineto
46248 30701.9 lineto
46360.5 30758.2 lineto
stroke
newpath
47260.3 29689.5 moveto
47316.6 29633.3 lineto
47260.3 29577.1 lineto
47204.1 29633.3 lineto
47260.3 29689.5 lineto
47260.3 29577.1 lineto
stroke
newpath
48047.7 30758.2 moveto
48160.2 30758.2 lineto
48272.7 30701.9 lineto
48329 30645.7 lineto
48385.2 30533.2 lineto
48441.4 30308.2 lineto
48441.4 30027 lineto
48385.2 29802 lineto
48329 29689.5 lineto
48272.7 29633.3 lineto
48160.2 29577.1 lineto
48047.7 29577.1 lineto
47935.3 29633.3 lineto
47879 29689.5 lineto
47822.8 29802 lineto
47766.5 30027 lineto
47766.5 30308.2 lineto
47822.8 30533.2 lineto
47879 30645.7 lineto
47935.3 30701.9 lineto
48047.7 30758.2 lineto
stroke
newpath
48835.1 30758.2 moveto
49566.3 30758.2 lineto
49172.6 30308.2 lineto
49341.3 30308.2 lineto
49453.8 30252 lineto
49510.1 30195.7 lineto
49566.3 30083.3 lineto
49566.3 29802 lineto
49510.1 29689.5 lineto
49453.8 29633.3 lineto
49341.3 29577.1 lineto
49003.9 29577.1 lineto
48891.4 29633.3 lineto
48835.1 29689.5 lineto
stroke
newpath
50297.5 30758.2 moveto
50409.9 30758.2 lineto
50522.4 30701.9 lineto
50578.7 30645.7 lineto
50634.9 30533.2 lineto
50691.2 30308.2 lineto
50691.2 30027 lineto
50634.9 29802 lineto
50578.7 29689.5 lineto
50522.4 29633.3 lineto
50409.9 29577.1 lineto
50297.5 29577.1 lineto
50185 29633.3 lineto
50128.7 29689.5 lineto
50072.5 29802 lineto
50016.2 30027 lineto
50016.2 30308.2 lineto
50072.5 30533.2 lineto
50128.7 30645.7 lineto
50185 30701.9 lineto
50297.5 30758.2 lineto
stroke
newpath
51141.1 30758.2 moveto
51141.1 30533.2 lineto
stroke
newpath
51591.1 30758.2 moveto
51591.1 30533.2 lineto
stroke
newpath
53334.6 29127.1 moveto
53278.3 29183.4 lineto
53165.9 29352.1 lineto
53109.6 29464.6 lineto
53053.4 29633.3 lineto
52997.1 29914.5 lineto
52997.1 30139.5 lineto
53053.4 30420.7 lineto
53109.6 30589.4 lineto
53165.9 30701.9 lineto
53278.3 30870.7 lineto
53334.6 30926.9 lineto
stroke
newpath
54403.2 29577.1 moveto
53728.3 29577.1 lineto
stroke
newpath
54065.7 29577.1 moveto
54065.7 30758.2 lineto
53953.3 30589.4 lineto
53840.8 30477 lineto
53728.3 30420.7 lineto
stroke
newpath
55078.1 30252 moveto
54965.6 30308.2 lineto
54909.4 30364.5 lineto
54853.1 30477 lineto
54853.1 30533.2 lineto
54909.4 30645.7 lineto
54965.6 30701.9 lineto
55078.1 30758.2 lineto
55303.1 30758.2 lineto
55415.6 30701.9 lineto
55471.8 30645.7 lineto
55528.1 30533.2 lineto
55528.1 30477 lineto
55471.8 30364.5 lineto
55415.6 30308.2 lineto
55303.1 30252 lineto
55078.1 30252 lineto
54965.6 30195.7 lineto
54909.4 30139.5 lineto
54853.1 30027 lineto
54853.1 29802 lineto
54909.4 29689.5 lineto
54965.6 29633.3 lineto
55078.1 29577.1 lineto
55303.1 29577.1 lineto
55415.6 29633.3 lineto
55471.8 29689.5 lineto
55528.1 29802 lineto
55528.1 30027 lineto
55471.8 30139.5 lineto
55415.6 30195.7 lineto
55303.1 30252 lineto
stroke
newpath
56934.1 29577.1 moveto
56934.1 30758.2 lineto
stroke
newpath
57440.3 29577.1 moveto
57440.3 30195.7 lineto
57384.1 30308.2 lineto
57271.6 30364.5 lineto
57102.9 30364.5 lineto
56990.4 30308.2 lineto
56934.1 30252 lineto
stroke
newpath
58171.5 29577.1 moveto
58059 29633.3 lineto
58002.7 29689.5 lineto
57946.5 29802 lineto
57946.5 30139.5 lineto
58002.7 30252 lineto
58059 30308.2 lineto
58171.5 30364.5 lineto
58340.2 30364.5 lineto
58452.7 30308.2 lineto
58508.9 30252 lineto
58565.2 30139.5 lineto
58565.2 29802 lineto
58508.9 29689.5 lineto
58452.7 29633.3 lineto
58340.2 29577.1 lineto
58171.5 29577.1 lineto
stroke
newpath
59240.1 29577.1 moveto
59127.6 29633.3 lineto
59071.4 29745.8 lineto
59071.4 30758.2 lineto
stroke
newpath
60140 29633.3 moveto
60027.5 29577.1 lineto
59802.5 29577.1 lineto
59690 29633.3 lineto
59633.8 29745.8 lineto
59633.8 30195.7 lineto
59690 30308.2 lineto
59802.5 30364.5 lineto
60027.5 30364.5 lineto
60140 30308.2 lineto
60196.2 30195.7 lineto
60196.2 30083.3 lineto
59633.8 29970.8 lineto
stroke
newpath
60646.2 29633.3 moveto
60758.7 29577.1 lineto
60983.6 29577.1 lineto
61096.1 29633.3 lineto
61152.4 29745.8 lineto
61152.4 29802 lineto
61096.1 29914.5 lineto
60983.6 29970.8 lineto
60814.9 29970.8 lineto
60702.4 30027 lineto
60646.2 30139.5 lineto
60646.2 30195.7 lineto
60702.4 30308.2 lineto
60814.9 30364.5 lineto
60983.6 30364.5 lineto
61096.1 30308.2 lineto
stroke
newpath
61546.1 29127.1 moveto
61602.3 29183.4 lineto
61714.8 29352.1 lineto
61771 29464.6 lineto
61827.3 29633.3 lineto
61883.5 29914.5 lineto
61883.5 30139.5 lineto
61827.3 30420.7 lineto
61771 30589.4 lineto
61714.8 30701.9 lineto
61602.3 30870.7 lineto
61546.1 30926.9 lineto
stroke
newpath
34824.5 28408.4 moveto
34824.5 28696.2 lineto
34536.7 28696.2 lineto
34536.7 28408.4 lineto
34824.5 28408.4 lineto
poly0
0 0 0 setrgbcolor
0 0 0 setrgbcolor
newpath
36236.7 29199.1 moveto
36349.2 29199.1 lineto
36461.7 29142.9 lineto
36517.9 29086.6 lineto
36574.2 28974.1 lineto
36630.4 28749.2 lineto
36630.4 28468 lineto
36574.2 28243 lineto
36517.9 28130.5 lineto
36461.7 28074.3 lineto
36349.2 28018 lineto
36236.7 28018 lineto
36124.2 28074.3 lineto
36068 28130.5 lineto
36011.7 28243 lineto
35955.5 28468 lineto
35955.5 28749.2 lineto
36011.7 28974.1 lineto
36068 29086.6 lineto
36124.2 29142.9 lineto
36236.7 29199.1 lineto
stroke
newpath
37136.6 28130.5 moveto
37192.9 28074.3 lineto
37136.6 28018 lineto
37080.4 28074.3 lineto
37136.6 28130.5 lineto
37136.6 28018 lineto
stroke
newpath
37867.8 28692.9 moveto
37755.3 28749.2 lineto
37699 28805.4 lineto
37642.8 28917.9 lineto
37642.8 28974.1 lineto
37699 29086.6 lineto
37755.3 29142.9 lineto
37867.8 29199.1 lineto
38092.7 29199.1 lineto
38205.2 29142.9 lineto
38261.5 29086.6 lineto
38317.7 28974.1 lineto
38317.7 28917.9 lineto
38261.5 28805.4 lineto
38205.2 28749.2 lineto
38092.7 28692.9 lineto
37867.8 28692.9 lineto
37755.3 28636.7 lineto
37699 28580.4 lineto
37642.8 28468 lineto
37642.8 28243 lineto
37699 28130.5 lineto
37755.3 28074.3 lineto
37867.8 28018 lineto
38092.7 28018 lineto
38205.2 28074.3 lineto
38261.5 28130.5 lineto
38317.7 28243 lineto
38317.7 28468 lineto
38261.5 28580.4 lineto
38205.2 28636.7 lineto
38092.7 28692.9 lineto
stroke
newpath
39048.9 29199.1 moveto
39161.4 29199.1 lineto
39273.8 29142.9 lineto
39330.1 29086.6 lineto
39386.3 28974.1 lineto
39442.6 28749.2 lineto
39442.6 28468 lineto
39386.3 28243 lineto
39330.1 28130.5 lineto
39273.8 28074.3 lineto
39161.4 28018 lineto
39048.9 28018 lineto
38936.4 28074.3 lineto
38880.1 28130.5 lineto
38823.9 28243 lineto
38767.7 28468 lineto
38767.7 28749.2 lineto
38823.9 28974.1 lineto
38880.1 29086.6 lineto
38936.4 29142.9 lineto
39048.9 29199.1 lineto
stroke
newpath
39948.8 28018 moveto
39948.8 28805.4 lineto
stroke
newpath
39948.8 28692.9 moveto
40005 28749.2 lineto
40117.5 28805.4 lineto
40286.2 28805.4 lineto
40398.7 28749.2 lineto
40454.9 28636.7 lineto
40454.9 28018 lineto
stroke
newpath
40454.9 28636.7 moveto
40511.2 28749.2 lineto
40623.7 28805.4 lineto
40792.4 28805.4 lineto
40904.9 28749.2 lineto
40961.1 28636.7 lineto
40961.1 28018 lineto
stroke
newpath
41523.6 28018 moveto
41523.6 28805.4 lineto
stroke
newpath
41523.6 28692.9 moveto
41579.8 28749.2 lineto
41692.3 28805.4 lineto
41861 28805.4 lineto
41973.5 28749.2 lineto
42029.7 28636.7 lineto
42029.7 28018 lineto
stroke
newpath
42029.7 28636.7 moveto
42086 28749.2 lineto
42198.5 28805.4 lineto
42367.2 28805.4 lineto
42479.7 28749.2 lineto
42535.9 28636.7 lineto
42535.9 28018 lineto
stroke
newpath
44841.9 29255.4 moveto
43829.5 27736.8 lineto
stroke
newpath
46360.5 29199.1 moveto
46472.9 29199.1 lineto
46585.4 29142.9 lineto
46641.7 29086.6 lineto
46697.9 28974.1 lineto
46754.2 28749.2 lineto
46754.2 28468 lineto
46697.9 28243 lineto
46641.7 28130.5 lineto
46585.4 28074.3 lineto
46472.9 28018 lineto
46360.5 28018 lineto
46248 28074.3 lineto
46191.7 28130.5 lineto
46135.5 28243 lineto
46079.2 28468 lineto
46079.2 28749.2 lineto
46135.5 28974.1 lineto
46191.7 29086.6 lineto
46248 29142.9 lineto
46360.5 29199.1 lineto
stroke
newpath
47260.3 28130.5 moveto
47316.6 28074.3 lineto
47260.3 28018 lineto
47204.1 28074.3 lineto
47260.3 28130.5 lineto
47260.3 28018 lineto
stroke
newpath
48047.7 29199.1 moveto
48160.2 29199.1 lineto
48272.7 29142.9 lineto
48329 29086.6 lineto
48385.2 28974.1 lineto
48441.4 28749.2 lineto
48441.4 28468 lineto
48385.2 28243 lineto
48329 28130.5 lineto
48272.7 28074.3 lineto
48160.2 28018 lineto
48047.7 28018 lineto
47935.3 28074.3 lineto
47879 28130.5 lineto
47822.8 28243 lineto
47766.5 28468 lineto
47766.5 28749.2 lineto
47822.8 28974.1 lineto
47879 29086.6 lineto
47935.3 29142.9 lineto
48047.7 29199.1 lineto
stroke
newpath
48835.1 29199.1 moveto
49566.3 29199.1 lineto
49172.6 28749.2 lineto
49341.3 28749.2 lineto
49453.8 28692.9 lineto
49510.1 28636.7 lineto
49566.3 28524.2 lineto
49566.3 28243 lineto
49510.1 28130.5 lineto
49453.8 28074.3 lineto
49341.3 28018 lineto
49003.9 28018 lineto
48891.4 28074.3 lineto
48835.1 28130.5 lineto
stroke
newpath
50691.2 28018 moveto
50016.2 28018 lineto
stroke
newpath
50353.7 28018 moveto
50353.7 29199.1 lineto
50241.2 29030.4 lineto
50128.7 28917.9 lineto
50016.2 28861.7 lineto
stroke
newpath
51141.1 29199.1 moveto
51141.1 28974.1 lineto
stroke
newpath
51591.1 29199.1 moveto
51591.1 28974.1 lineto
stroke
newpath
53334.6 27568.1 moveto
53278.3 27624.3 lineto
53165.9 27793 lineto
53109.6 27905.5 lineto
53053.4 28074.3 lineto
52997.1 28355.5 lineto
52997.1 28580.4 lineto
53053.4 28861.7 lineto
53109.6 29030.4 lineto
53165.9 29142.9 lineto
53278.3 29311.6 lineto
53334.6 29367.8 lineto
stroke
newpath
54290.7 28805.4 moveto
54290.7 28018 lineto
stroke
newpath
54009.5 29255.4 moveto
53728.3 28411.7 lineto
54459.4 28411.7 lineto
stroke
newpath
55078.1 28692.9 moveto
54965.6 28749.2 lineto
54909.4 28805.4 lineto
54853.1 28917.9 lineto
54853.1 28974.1 lineto
54909.4 29086.6 lineto
54965.6 29142.9 lineto
55078.1 29199.1 lineto
55303.1 29199.1 lineto
55415.6 29142.9 lineto
55471.8 29086.6 lineto
55528.1 28974.1 lineto
55528.1 28917.9 lineto
55471.8 28805.4 lineto
55415.6 28749.2 lineto
55303.1 28692.9 lineto
55078.1 28692.9 lineto
54965.6 28636.7 lineto
54909.4 28580.4 lineto
54853.1 28468 lineto
54853.1 28243 lineto
54909.4 28130.5 lineto
54965.6 28074.3 lineto
55078.1 28018 lineto
55303.1 28018 lineto
55415.6 28074.3 lineto
55471.8 28130.5 lineto
55528.1 28243 lineto
55528.1 28468 lineto
55471.8 28580.4 lineto
55415.6 28636.7 lineto
55303.1 28692.9 lineto
stroke
newpath
56934.1 28018 moveto
56934.1 29199.1 lineto
stroke
newpath
57440.3 28018 moveto
57440.3 28636.7 lineto
57384.1 28749.2 lineto
57271.6 28805.4 lineto
57102.9 28805.4 lineto
56990.4 28749.2 lineto
56934.1 28692.9 lineto
stroke
newpath
58171.5 28018 moveto
58059 28074.3 lineto
58002.7 28130.5 lineto
57946.5 28243 lineto
57946.5 28580.4 lineto
58002.7 28692.9 lineto
58059 28749.2 lineto
58171.5 28805.4 lineto
58340.2 28805.4 lineto
58452.7 28749.2 lineto
58508.9 28692.9 lineto
58565.2 28580.4 lineto
58565.2 28243 lineto
58508.9 28130.5 lineto
58452.7 28074.3 lineto
58340.2 28018 lineto
58171.5 28018 lineto
stroke
newpath
59240.1 28018 moveto
59127.6 28074.3 lineto
59071.4 28186.7 lineto
59071.4 29199.1 lineto
stroke
newpath
60140 28074.3 moveto
60027.5 28018 lineto
59802.5 28018 lineto
59690 28074.3 lineto
59633.8 28186.7 lineto
59633.8 28636.7 lineto
59690 28749.2 lineto
59802.5 28805.4 lineto
60027.5 28805.4 lineto
60140 28749.2 lineto
60196.2 28636.7 lineto
60196.2 28524.2 lineto
59633.8 28411.7 lineto
stroke
newpath
60646.2 28074.3 moveto
60758.7 28018 lineto
60983.6 28018 lineto
61096.1 28074.3 lineto
61152.4 28186.7 lineto
61152.4 28243 lineto
61096.1 28355.5 lineto
60983.6 28411.7 lineto
60814.9 28411.7 lineto
60702.4 28468 lineto
60646.2 28580.4 lineto
60646.2 28636.7 lineto
60702.4 28749.2 lineto
60814.9 28805.4 lineto
60983.6 28805.4 lineto
61096.1 28749.2 lineto
stroke
newpath
62558.4 28468 moveto
63458.3 28468 lineto
stroke
newpath
63008.4 28018 moveto
63008.4 28917.9 lineto
stroke
newpath
64808.1 29199.1 moveto
65539.3 29199.1 lineto
65145.6 28749.2 lineto
65314.3 28749.2 lineto
65426.8 28692.9 lineto
65483.1 28636.7 lineto
65539.3 28524.2 lineto
65539.3 28243 lineto
65483.1 28130.5 lineto
65426.8 28074.3 lineto
65314.3 28018 lineto
64976.9 28018 lineto
64864.4 28074.3 lineto
64808.1 28130.5 lineto
stroke
newpath
66889.1 28074.3 moveto
67001.6 28018 lineto
67226.6 28018 lineto
67339.1 28074.3 lineto
67395.3 28186.7 lineto
67395.3 28243 lineto
67339.1 28355.5 lineto
67226.6 28411.7 lineto
67057.9 28411.7 lineto
66945.4 28468 lineto
66889.1 28580.4 lineto
66889.1 28636.7 lineto
66945.4 28749.2 lineto
67057.9 28805.4 lineto
67226.6 28805.4 lineto
67339.1 28749.2 lineto
stroke
newpath
68070.2 28018 moveto
67957.8 28074.3 lineto
67901.5 28186.7 lineto
67901.5 29199.1 lineto
stroke
newpath
68688.9 28018 moveto
68576.4 28074.3 lineto
68520.2 28130.5 lineto
68463.9 28243 lineto
68463.9 28580.4 lineto
68520.2 28692.9 lineto
68576.4 28749.2 lineto
68688.9 28805.4 lineto
68857.6 28805.4 lineto
68970.1 28749.2 lineto
69026.4 28692.9 lineto
69082.6 28580.4 lineto
69082.6 28243 lineto
69026.4 28130.5 lineto
68970.1 28074.3 lineto
68857.6 28018 lineto
68688.9 28018 lineto
stroke
newpath
69420.1 28805.4 moveto
69870 28805.4 lineto
stroke
newpath
69588.8 29199.1 moveto
69588.8 28186.7 lineto
69645 28074.3 lineto
69757.5 28018 lineto
69870 28018 lineto
stroke
newpath
70207.5 28074.3 moveto
70320 28018 lineto
70544.9 28018 lineto
70657.4 28074.3 lineto
70713.7 28186.7 lineto
70713.7 28243 lineto
70657.4 28355.5 lineto
70544.9 28411.7 lineto
70376.2 28411.7 lineto
70263.7 28468 lineto
70207.5 28580.4 lineto
70207.5 28636.7 lineto
70263.7 28749.2 lineto
70376.2 28805.4 lineto
70544.9 28805.4 lineto
70657.4 28749.2 lineto
stroke
newpath
71107.4 27568.1 moveto
71163.6 27624.3 lineto
71276.1 27793 lineto
71332.3 27905.5 lineto
71388.6 28074.3 lineto
71444.8 28355.5 lineto
71444.8 28580.4 lineto
71388.6 28861.7 lineto
71332.3 29030.4 lineto
71276.1 29142.9 lineto
71163.6 29311.6 lineto
71107.4 29367.8 lineto
stroke
newpath
34629.7 26738.9 moveto
34884.1 26993.3 lineto
34629.7 27247.6 lineto
34375.4 26993.3 lineto
34629.7 26738.9 lineto
poly0
0 0 0 setrgbcolor
0 0 0 setrgbcolor
newpath
36630.4 26459 moveto
35955.5 26459 lineto
stroke
newpath
36293 26459 moveto
36293 27640.1 lineto
36180.5 27471.3 lineto
36068 27358.8 lineto
35955.5 27302.6 lineto
stroke
newpath
37136.6 26571.4 moveto
37192.9 26515.2 lineto
37136.6 26459 lineto
37080.4 26515.2 lineto
37136.6 26571.4 lineto
37136.6 26459 lineto
stroke
newpath
37924 27640.1 moveto
38036.5 27640.1 lineto
38149 27583.8 lineto
38205.2 27527.6 lineto
38261.5 27415.1 lineto
38317.7 27190.1 lineto
38317.7 26908.9 lineto
38261.5 26683.9 lineto
38205.2 26571.4 lineto
38149 26515.2 lineto
38036.5 26459 lineto
37924 26459 lineto
37811.5 26515.2 lineto
37755.3 26571.4 lineto
37699 26683.9 lineto
37642.8 26908.9 lineto
37642.8 27190.1 lineto
37699 27415.1 lineto
37755.3 27527.6 lineto
37811.5 27583.8 lineto
37924 27640.1 lineto
stroke
newpath
39048.9 27640.1 moveto
39161.4 27640.1 lineto
39273.8 27583.8 lineto
39330.1 27527.6 lineto
39386.3 27415.1 lineto
39442.6 27190.1 lineto
39442.6 26908.9 lineto
39386.3 26683.9 lineto
39330.1 26571.4 lineto
39273.8 26515.2 lineto
39161.4 26459 lineto
39048.9 26459 lineto
38936.4 26515.2 lineto
38880.1 26571.4 lineto
38823.9 26683.9 lineto
38767.7 26908.9 lineto
38767.7 27190.1 lineto
38823.9 27415.1 lineto
38880.1 27527.6 lineto
38936.4 27583.8 lineto
39048.9 27640.1 lineto
stroke
newpath
39948.8 26459 moveto
39948.8 27246.4 lineto
stroke
newpath
39948.8 27133.9 moveto
40005 27190.1 lineto
40117.5 27246.4 lineto
40286.2 27246.4 lineto
40398.7 27190.1 lineto
40454.9 27077.6 lineto
40454.9 26459 lineto
stroke
newpath
40454.9 27077.6 moveto
40511.2 27190.1 lineto
40623.7 27246.4 lineto
40792.4 27246.4 lineto
40904.9 27190.1 lineto
40961.1 27077.6 lineto
40961.1 26459 lineto
stroke
newpath
41523.6 26459 moveto
41523.6 27246.4 lineto
stroke
newpath
41523.6 27133.9 moveto
41579.8 27190.1 lineto
41692.3 27246.4 lineto
41861 27246.4 lineto
41973.5 27190.1 lineto
42029.7 27077.6 lineto
42029.7 26459 lineto
stroke
newpath
42029.7 27077.6 moveto
42086 27190.1 lineto
42198.5 27246.4 lineto
42367.2 27246.4 lineto
42479.7 27190.1 lineto
42535.9 27077.6 lineto
42535.9 26459 lineto
stroke
newpath
44841.9 27696.3 moveto
43829.5 26177.7 lineto
stroke
newpath
46360.5 27640.1 moveto
46472.9 27640.1 lineto
46585.4 27583.8 lineto
46641.7 27527.6 lineto
46697.9 27415.1 lineto
46754.2 27190.1 lineto
46754.2 26908.9 lineto
46697.9 26683.9 lineto
46641.7 26571.4 lineto
46585.4 26515.2 lineto
46472.9 26459 lineto
46360.5 26459 lineto
46248 26515.2 lineto
46191.7 26571.4 lineto
46135.5 26683.9 lineto
46079.2 26908.9 lineto
46079.2 27190.1 lineto
46135.5 27415.1 lineto
46191.7 27527.6 lineto
46248 27583.8 lineto
46360.5 27640.1 lineto
stroke
newpath
47260.3 26571.4 moveto
47316.6 26515.2 lineto
47260.3 26459 lineto
47204.1 26515.2 lineto
47260.3 26571.4 lineto
47260.3 26459 lineto
stroke
newpath
48047.7 27640.1 moveto
48160.2 27640.1 lineto
48272.7 27583.8 lineto
48329 27527.6 lineto
48385.2 27415.1 lineto
48441.4 27190.1 lineto
48441.4 26908.9 lineto
48385.2 26683.9 lineto
48329 26571.4 lineto
48272.7 26515.2 lineto
48160.2 26459 lineto
48047.7 26459 lineto
47935.3 26515.2 lineto
47879 26571.4 lineto
47822.8 26683.9 lineto
47766.5 26908.9 lineto
47766.5 27190.1 lineto
47822.8 27415.1 lineto
47879 27527.6 lineto
47935.3 27583.8 lineto
48047.7 27640.1 lineto
stroke
newpath
48835.1 27640.1 moveto
49566.3 27640.1 lineto
49172.6 27190.1 lineto
49341.3 27190.1 lineto
49453.8 27133.9 lineto
49510.1 27077.6 lineto
49566.3 26965.1 lineto
49566.3 26683.9 lineto
49510.1 26571.4 lineto
49453.8 26515.2 lineto
49341.3 26459 lineto
49003.9 26459 lineto
48891.4 26515.2 lineto
48835.1 26571.4 lineto
stroke
newpath
50128.7 26459 moveto
50353.7 26459 lineto
50466.2 26515.2 lineto
50522.4 26571.4 lineto
50634.9 26740.2 lineto
50691.2 26965.1 lineto
50691.2 27415.1 lineto
50634.9 27527.6 lineto
50578.7 27583.8 lineto
50466.2 27640.1 lineto
50241.2 27640.1 lineto
50128.7 27583.8 lineto
50072.5 27527.6 lineto
50016.2 27415.1 lineto
50016.2 27133.9 lineto
50072.5 27021.4 lineto
50128.7 26965.1 lineto
50241.2 26908.9 lineto
50466.2 26908.9 lineto
50578.7 26965.1 lineto
50634.9 27021.4 lineto
50691.2 27133.9 lineto
stroke
newpath
51141.1 27640.1 moveto
51141.1 27415.1 lineto
stroke
newpath
51591.1 27640.1 moveto
51591.1 27415.1 lineto
stroke
newpath
53334.6 26009 moveto
53278.3 26065.3 lineto
53165.9 26234 lineto
53109.6 26346.5 lineto
53053.4 26515.2 lineto
52997.1 26796.4 lineto
52997.1 27021.4 lineto
53053.4 27302.6 lineto
53109.6 27471.3 lineto
53165.9 27583.8 lineto
53278.3 27752.5 lineto
53334.6 27808.8 lineto
stroke
newpath
54290.7 27640.1 moveto
54065.7 27640.1 lineto
53953.3 27583.8 lineto
53897 27527.6 lineto
53784.5 27358.8 lineto
53728.3 27133.9 lineto
53728.3 26683.9 lineto
53784.5 26571.4 lineto
53840.8 26515.2 lineto
53953.3 26459 lineto
54178.2 26459 lineto
54290.7 26515.2 lineto
54347 26571.4 lineto
54403.2 26683.9 lineto
54403.2 26965.1 lineto
54347 27077.6 lineto
54290.7 27133.9 lineto
54178.2 27190.1 lineto
53953.3 27190.1 lineto
53840.8 27133.9 lineto
53784.5 27077.6 lineto
53728.3 26965.1 lineto
stroke
newpath
55809.3 26459 moveto
55809.3 27640.1 lineto
stroke
newpath
56315.5 26459 moveto
56315.5 27077.6 lineto
56259.2 27190.1 lineto
56146.7 27246.4 lineto
55978 27246.4 lineto
55865.5 27190.1 lineto
55809.3 27133.9 lineto
stroke
newpath
57046.6 26459 moveto
56934.1 26515.2 lineto
56877.9 26571.4 lineto
56821.6 26683.9 lineto
56821.6 27021.4 lineto
56877.9 27133.9 lineto
56934.1 27190.1 lineto
57046.6 27246.4 lineto
57215.3 27246.4 lineto
57327.8 27190.1 lineto
57384.1 27133.9 lineto
57440.3 27021.4 lineto
57440.3 26683.9 lineto
57384.1 26571.4 lineto
57327.8 26515.2 lineto
57215.3 26459 lineto
57046.6 26459 lineto
stroke
newpath
58115.2 26459 moveto
58002.7 26515.2 lineto
57946.5 26627.7 lineto
57946.5 27640.1 lineto
stroke
newpath
59015.1 26515.2 moveto
58902.6 26459 lineto
58677.7 26459 lineto
58565.2 26515.2 lineto
58508.9 26627.7 lineto
58508.9 27077.6 lineto
58565.2 27190.1 lineto
58677.7 27246.4 lineto
58902.6 27246.4 lineto
59015.1 27190.1 lineto
59071.4 27077.6 lineto
59071.4 26965.1 lineto
58508.9 26852.7 lineto
stroke
newpath
59521.3 26515.2 moveto
59633.8 26459 lineto
59858.8 26459 lineto
59971.3 26515.2 lineto
60027.5 26627.7 lineto
60027.5 26683.9 lineto
59971.3 26796.4 lineto
59858.8 26852.7 lineto
59690 26852.7 lineto
59577.6 26908.9 lineto
59521.3 27021.4 lineto
59521.3 27077.6 lineto
59577.6 27190.1 lineto
59690 27246.4 lineto
59858.8 27246.4 lineto
59971.3 27190.1 lineto
stroke
newpath
60421.2 26009 moveto
60477.4 26065.3 lineto
60589.9 26234 lineto
60646.2 26346.5 lineto
60702.4 26515.2 lineto
60758.7 26796.4 lineto
60758.7 27021.4 lineto
60702.4 27302.6 lineto
60646.2 27471.3 lineto
60589.9 27583.8 lineto
60477.4 27752.5 lineto
60421.2 27808.8 lineto
stroke
newpath
34367.2 25692.6 moveto
34884.1 25175.8 lineto
stroke
newpath
34884.1 25692.6 moveto
34367.2 25175.8 lineto
stroke
34625.7 25434.2 258.421 cir0
0 0 0 setrgbcolor
0 0 0 setrgbcolor
newpath
36630.4 24899.9 moveto
35955.5 24899.9 lineto
stroke
newpath
36293 24899.9 moveto
36293 26081 lineto
36180.5 25912.3 lineto
36068 25799.8 lineto
35955.5 25743.5 lineto
stroke
newpath
37136.6 25012.4 moveto
37192.9 24956.1 lineto
37136.6 24899.9 lineto
37080.4 24956.1 lineto
37136.6 25012.4 lineto
37136.6 24899.9 lineto
stroke
newpath
37924 26081 moveto
38036.5 26081 lineto
38149 26024.8 lineto
38205.2 25968.5 lineto
38261.5 25856 lineto
38317.7 25631.1 lineto
38317.7 25349.8 lineto
38261.5 25124.9 lineto
38205.2 25012.4 lineto
38149 24956.1 lineto
38036.5 24899.9 lineto
37924 24899.9 lineto
37811.5 24956.1 lineto
37755.3 25012.4 lineto
37699 25124.9 lineto
37642.8 25349.8 lineto
37642.8 25631.1 lineto
37699 25856 lineto
37755.3 25968.5 lineto
37811.5 26024.8 lineto
37924 26081 lineto
stroke
newpath
38767.7 25968.5 moveto
38823.9 26024.8 lineto
38936.4 26081 lineto
39217.6 26081 lineto
39330.1 26024.8 lineto
39386.3 25968.5 lineto
39442.6 25856 lineto
39442.6 25743.5 lineto
39386.3 25574.8 lineto
38711.4 24899.9 lineto
39442.6 24899.9 lineto
stroke
newpath
39948.8 24899.9 moveto
39948.8 25687.3 lineto
stroke
newpath
39948.8 25574.8 moveto
40005 25631.1 lineto
40117.5 25687.3 lineto
40286.2 25687.3 lineto
40398.7 25631.1 lineto
40454.9 25518.6 lineto
40454.9 24899.9 lineto
stroke
newpath
40454.9 25518.6 moveto
40511.2 25631.1 lineto
40623.7 25687.3 lineto
40792.4 25687.3 lineto
40904.9 25631.1 lineto
40961.1 25518.6 lineto
40961.1 24899.9 lineto
stroke
newpath
41523.6 24899.9 moveto
41523.6 25687.3 lineto
stroke
newpath
41523.6 25574.8 moveto
41579.8 25631.1 lineto
41692.3 25687.3 lineto
41861 25687.3 lineto
41973.5 25631.1 lineto
42029.7 25518.6 lineto
42029.7 24899.9 lineto
stroke
newpath
42029.7 25518.6 moveto
42086 25631.1 lineto
42198.5 25687.3 lineto
42367.2 25687.3 lineto
42479.7 25631.1 lineto
42535.9 25518.6 lineto
42535.9 24899.9 lineto
stroke
newpath
44841.9 26137.2 moveto
43829.5 24618.7 lineto
stroke
newpath
46360.5 26081 moveto
46472.9 26081 lineto
46585.4 26024.8 lineto
46641.7 25968.5 lineto
46697.9 25856 lineto
46754.2 25631.1 lineto
46754.2 25349.8 lineto
46697.9 25124.9 lineto
46641.7 25012.4 lineto
46585.4 24956.1 lineto
46472.9 24899.9 lineto
46360.5 24899.9 lineto
46248 24956.1 lineto
46191.7 25012.4 lineto
46135.5 25124.9 lineto
46079.2 25349.8 lineto
46079.2 25631.1 lineto
46135.5 25856 lineto
46191.7 25968.5 lineto
46248 26024.8 lineto
46360.5 26081 lineto
stroke
newpath
47260.3 25012.4 moveto
47316.6 24956.1 lineto
47260.3 24899.9 lineto
47204.1 24956.1 lineto
47260.3 25012.4 lineto
47260.3 24899.9 lineto
stroke
newpath
48047.7 26081 moveto
48160.2 26081 lineto
48272.7 26024.8 lineto
48329 25968.5 lineto
48385.2 25856 lineto
48441.4 25631.1 lineto
48441.4 25349.8 lineto
48385.2 25124.9 lineto
48329 25012.4 lineto
48272.7 24956.1 lineto
48160.2 24899.9 lineto
48047.7 24899.9 lineto
47935.3 24956.1 lineto
47879 25012.4 lineto
47822.8 25124.9 lineto
47766.5 25349.8 lineto
47766.5 25631.1 lineto
47822.8 25856 lineto
47879 25968.5 lineto
47935.3 26024.8 lineto
48047.7 26081 lineto
stroke
newpath
49453.8 25687.3 moveto
49453.8 24899.9 lineto
stroke
newpath
49172.6 26137.2 moveto
48891.4 25293.6 lineto
49622.5 25293.6 lineto
stroke
newpath
50297.5 26081 moveto
50409.9 26081 lineto
50522.4 26024.8 lineto
50578.7 25968.5 lineto
50634.9 25856 lineto
50691.2 25631.1 lineto
50691.2 25349.8 lineto
50634.9 25124.9 lineto
50578.7 25012.4 lineto
50522.4 24956.1 lineto
50409.9 24899.9 lineto
50297.5 24899.9 lineto
50185 24956.1 lineto
50128.7 25012.4 lineto
50072.5 25124.9 lineto
50016.2 25349.8 lineto
50016.2 25631.1 lineto
50072.5 25856 lineto
50128.7 25968.5 lineto
50185 26024.8 lineto
50297.5 26081 lineto
stroke
newpath
51141.1 26081 moveto
51141.1 25856 lineto
stroke
newpath
51591.1 26081 moveto
51591.1 25856 lineto
stroke
newpath
53334.6 24450 moveto
53278.3 24506.2 lineto
53165.9 24674.9 lineto
53109.6 24787.4 lineto
53053.4 24956.1 lineto
52997.1 25237.4 lineto
52997.1 25462.3 lineto
53053.4 25743.5 lineto
53109.6 25912.3 lineto
53165.9 26024.8 lineto
53278.3 26193.5 lineto
53334.6 26249.7 lineto
stroke
newpath
54347 26081 moveto
53784.5 26081 lineto
53728.3 25518.6 lineto
53784.5 25574.8 lineto
53897 25631.1 lineto
54178.2 25631.1 lineto
54290.7 25574.8 lineto
54347 25518.6 lineto
54403.2 25406.1 lineto
54403.2 25124.9 lineto
54347 25012.4 lineto
54290.7 24956.1 lineto
54178.2 24899.9 lineto
53897 24899.9 lineto
53784.5 24956.1 lineto
53728.3 25012.4 lineto
stroke
newpath
54853.1 25968.5 moveto
54909.4 26024.8 lineto
55021.9 26081 lineto
55303.1 26081 lineto
55415.6 26024.8 lineto
55471.8 25968.5 lineto
55528.1 25856 lineto
55528.1 25743.5 lineto
55471.8 25574.8 lineto
54796.9 24899.9 lineto
55528.1 24899.9 lineto
stroke
newpath
56934.1 24899.9 moveto
56934.1 26081 lineto
stroke
newpath
57440.3 24899.9 moveto
57440.3 25518.6 lineto
57384.1 25631.1 lineto
57271.6 25687.3 lineto
57102.9 25687.3 lineto
56990.4 25631.1 lineto
56934.1 25574.8 lineto
stroke
newpath
58171.5 24899.9 moveto
58059 24956.1 lineto
58002.7 25012.4 lineto
57946.5 25124.9 lineto
57946.5 25462.3 lineto
58002.7 25574.8 lineto
58059 25631.1 lineto
58171.5 25687.3 lineto
58340.2 25687.3 lineto
58452.7 25631.1 lineto
58508.9 25574.8 lineto
58565.2 25462.3 lineto
58565.2 25124.9 lineto
58508.9 25012.4 lineto
58452.7 24956.1 lineto
58340.2 24899.9 lineto
58171.5 24899.9 lineto
stroke
newpath
59240.1 24899.9 moveto
59127.6 24956.1 lineto
59071.4 25068.6 lineto
59071.4 26081 lineto
stroke
newpath
60140 24956.1 moveto
60027.5 24899.9 lineto
59802.5 24899.9 lineto
59690 24956.1 lineto
59633.8 25068.6 lineto
59633.8 25518.6 lineto
59690 25631.1 lineto
59802.5 25687.3 lineto
60027.5 25687.3 lineto
60140 25631.1 lineto
60196.2 25518.6 lineto
60196.2 25406.1 lineto
59633.8 25293.6 lineto
stroke
newpath
60646.2 24956.1 moveto
60758.7 24899.9 lineto
60983.6 24899.9 lineto
61096.1 24956.1 lineto
61152.4 25068.6 lineto
61152.4 25124.9 lineto
61096.1 25237.4 lineto
60983.6 25293.6 lineto
60814.9 25293.6 lineto
60702.4 25349.8 lineto
60646.2 25462.3 lineto
60646.2 25518.6 lineto
60702.4 25631.1 lineto
60814.9 25687.3 lineto
60983.6 25687.3 lineto
61096.1 25631.1 lineto
stroke
newpath
61546.1 24450 moveto
61602.3 24506.2 lineto
61714.8 24674.9 lineto
61771 24787.4 lineto
61827.3 24956.1 lineto
61883.5 25237.4 lineto
61883.5 25462.3 lineto
61827.3 25743.5 lineto
61771 25912.3 lineto
61714.8 26024.8 lineto
61602.3 26193.5 lineto
61546.1 26249.7 lineto
stroke
newpath
34324.5 24154.9 moveto
34884.1 23595.4 lineto
stroke
newpath
34884.1 24154.9 moveto
34324.5 23595.4 lineto
stroke
newpath
34604.3 24154.9 moveto
34604.3 23595.4 lineto
stroke
newpath
34324.5 23875.2 moveto
34884.1 23875.2 lineto
stroke
0 0 0 setrgbcolor
0 0 0 setrgbcolor
newpath
36630.4 23340.8 moveto
35955.5 23340.8 lineto
stroke
newpath
36293 23340.8 moveto
36293 24521.9 lineto
36180.5 24353.2 lineto
36068 24240.7 lineto
35955.5 24184.5 lineto
stroke
newpath
37136.6 23453.3 moveto
37192.9 23397.1 lineto
37136.6 23340.8 lineto
37080.4 23397.1 lineto
37136.6 23453.3 lineto
37136.6 23340.8 lineto
stroke
newpath
38317.7 23340.8 moveto
37642.8 23340.8 lineto
stroke
newpath
37980.3 23340.8 moveto
37980.3 24521.9 lineto
37867.8 24353.2 lineto
37755.3 24240.7 lineto
37642.8 24184.5 lineto
stroke
newpath
39048.9 24521.9 moveto
39161.4 24521.9 lineto
39273.8 24465.7 lineto
39330.1 24409.5 lineto
39386.3 24297 lineto
39442.6 24072 lineto
39442.6 23790.8 lineto
39386.3 23565.8 lineto
39330.1 23453.3 lineto
39273.8 23397.1 lineto
39161.4 23340.8 lineto
39048.9 23340.8 lineto
38936.4 23397.1 lineto
38880.1 23453.3 lineto
38823.9 23565.8 lineto
38767.7 23790.8 lineto
38767.7 24072 lineto
38823.9 24297 lineto
38880.1 24409.5 lineto
38936.4 24465.7 lineto
39048.9 24521.9 lineto
stroke
newpath
39948.8 23340.8 moveto
39948.8 24128.2 lineto
stroke
newpath
39948.8 24015.8 moveto
40005 24072 lineto
40117.5 24128.2 lineto
40286.2 24128.2 lineto
40398.7 24072 lineto
40454.9 23959.5 lineto
40454.9 23340.8 lineto
stroke
newpath
40454.9 23959.5 moveto
40511.2 24072 lineto
40623.7 24128.2 lineto
40792.4 24128.2 lineto
40904.9 24072 lineto
40961.1 23959.5 lineto
40961.1 23340.8 lineto
stroke
newpath
41523.6 23340.8 moveto
41523.6 24128.2 lineto
stroke
newpath
41523.6 24015.8 moveto
41579.8 24072 lineto
41692.3 24128.2 lineto
41861 24128.2 lineto
41973.5 24072 lineto
42029.7 23959.5 lineto
42029.7 23340.8 lineto
stroke
newpath
42029.7 23959.5 moveto
42086 24072 lineto
42198.5 24128.2 lineto
42367.2 24128.2 lineto
42479.7 24072 lineto
42535.9 23959.5 lineto
42535.9 23340.8 lineto
stroke
newpath
44841.9 24578.2 moveto
43829.5 23059.6 lineto
stroke
newpath
46360.5 24521.9 moveto
46472.9 24521.9 lineto
46585.4 24465.7 lineto
46641.7 24409.5 lineto
46697.9 24297 lineto
46754.2 24072 lineto
46754.2 23790.8 lineto
46697.9 23565.8 lineto
46641.7 23453.3 lineto
46585.4 23397.1 lineto
46472.9 23340.8 lineto
46360.5 23340.8 lineto
46248 23397.1 lineto
46191.7 23453.3 lineto
46135.5 23565.8 lineto
46079.2 23790.8 lineto
46079.2 24072 lineto
46135.5 24297 lineto
46191.7 24409.5 lineto
46248 24465.7 lineto
46360.5 24521.9 lineto
stroke
newpath
47260.3 23453.3 moveto
47316.6 23397.1 lineto
47260.3 23340.8 lineto
47204.1 23397.1 lineto
47260.3 23453.3 lineto
47260.3 23340.8 lineto
stroke
newpath
48047.7 24521.9 moveto
48160.2 24521.9 lineto
48272.7 24465.7 lineto
48329 24409.5 lineto
48385.2 24297 lineto
48441.4 24072 lineto
48441.4 23790.8 lineto
48385.2 23565.8 lineto
48329 23453.3 lineto
48272.7 23397.1 lineto
48160.2 23340.8 lineto
48047.7 23340.8 lineto
47935.3 23397.1 lineto
47879 23453.3 lineto
47822.8 23565.8 lineto
47766.5 23790.8 lineto
47766.5 24072 lineto
47822.8 24297 lineto
47879 24409.5 lineto
47935.3 24465.7 lineto
48047.7 24521.9 lineto
stroke
newpath
49453.8 24128.2 moveto
49453.8 23340.8 lineto
stroke
newpath
49172.6 24578.2 moveto
48891.4 23734.5 lineto
49622.5 23734.5 lineto
stroke
newpath
49960 24521.9 moveto
50691.2 24521.9 lineto
50297.5 24072 lineto
50466.2 24072 lineto
50578.7 24015.8 lineto
50634.9 23959.5 lineto
50691.2 23847 lineto
50691.2 23565.8 lineto
50634.9 23453.3 lineto
50578.7 23397.1 lineto
50466.2 23340.8 lineto
50128.7 23340.8 lineto
50016.2 23397.1 lineto
49960 23453.3 lineto
stroke
newpath
51141.1 24521.9 moveto
51141.1 24297 lineto
stroke
newpath
51591.1 24521.9 moveto
51591.1 24297 lineto
stroke
newpath
53334.6 22890.9 moveto
53278.3 22947.1 lineto
53165.9 23115.9 lineto
53109.6 23228.4 lineto
53053.4 23397.1 lineto
52997.1 23678.3 lineto
52997.1 23903.3 lineto
53053.4 24184.5 lineto
53109.6 24353.2 lineto
53165.9 24465.7 lineto
53278.3 24634.4 lineto
53334.6 24690.7 lineto
stroke
newpath
54290.7 24521.9 moveto
54065.7 24521.9 lineto
53953.3 24465.7 lineto
53897 24409.5 lineto
53784.5 24240.7 lineto
53728.3 24015.8 lineto
53728.3 23565.8 lineto
53784.5 23453.3 lineto
53840.8 23397.1 lineto
53953.3 23340.8 lineto
54178.2 23340.8 lineto
54290.7 23397.1 lineto
54347 23453.3 lineto
54403.2 23565.8 lineto
54403.2 23847 lineto
54347 23959.5 lineto
54290.7 24015.8 lineto
54178.2 24072 lineto
53953.3 24072 lineto
53840.8 24015.8 lineto
53784.5 23959.5 lineto
53728.3 23847 lineto
stroke
newpath
55809.3 23340.8 moveto
55809.3 24521.9 lineto
stroke
newpath
56315.5 23340.8 moveto
56315.5 23959.5 lineto
56259.2 24072 lineto
56146.7 24128.2 lineto
55978 24128.2 lineto
55865.5 24072 lineto
55809.3 24015.8 lineto
stroke
newpath
57046.6 23340.8 moveto
56934.1 23397.1 lineto
56877.9 23453.3 lineto
56821.6 23565.8 lineto
56821.6 23903.3 lineto
56877.9 24015.8 lineto
56934.1 24072 lineto
57046.6 24128.2 lineto
57215.3 24128.2 lineto
57327.8 24072 lineto
57384.1 24015.8 lineto
57440.3 23903.3 lineto
57440.3 23565.8 lineto
57384.1 23453.3 lineto
57327.8 23397.1 lineto
57215.3 23340.8 lineto
57046.6 23340.8 lineto
stroke
newpath
58115.2 23340.8 moveto
58002.7 23397.1 lineto
57946.5 23509.6 lineto
57946.5 24521.9 lineto
stroke
newpath
59015.1 23397.1 moveto
58902.6 23340.8 lineto
58677.7 23340.8 lineto
58565.2 23397.1 lineto
58508.9 23509.6 lineto
58508.9 23959.5 lineto
58565.2 24072 lineto
58677.7 24128.2 lineto
58902.6 24128.2 lineto
59015.1 24072 lineto
59071.4 23959.5 lineto
59071.4 23847 lineto
58508.9 23734.5 lineto
stroke
newpath
59521.3 23397.1 moveto
59633.8 23340.8 lineto
59858.8 23340.8 lineto
59971.3 23397.1 lineto
60027.5 23509.6 lineto
60027.5 23565.8 lineto
59971.3 23678.3 lineto
59858.8 23734.5 lineto
59690 23734.5 lineto
59577.6 23790.8 lineto
59521.3 23903.3 lineto
59521.3 23959.5 lineto
59577.6 24072 lineto
59690 24128.2 lineto
59858.8 24128.2 lineto
59971.3 24072 lineto
stroke
newpath
60421.2 22890.9 moveto
60477.4 22947.1 lineto
60589.9 23115.9 lineto
60646.2 23228.4 lineto
60702.4 23397.1 lineto
60758.7 23678.3 lineto
60758.7 23903.3 lineto
60702.4 24184.5 lineto
60646.2 24353.2 lineto
60589.9 24465.7 lineto
60477.4 24634.4 lineto
60421.2 24690.7 lineto
stroke
newpath
34110.8 22702.7 moveto
34884.1 21929.5 lineto
stroke
newpath
34884.1 22702.7 moveto
34110.8 21929.5 lineto
stroke
newpath
34770.8 22042.7 moveto
34770.8 22589.5 lineto
34224.1 22589.5 lineto
34224.1 22042.7 lineto
34770.8 22042.7 lineto
poly0
0 0 0 setrgbcolor
0 0 0 setrgbcolor
newpath
36630.4 21781.8 moveto
35955.5 21781.8 lineto
stroke
newpath
36293 21781.8 moveto
36293 22962.9 lineto
36180.5 22794.2 lineto
36068 22681.7 lineto
35955.5 22625.4 lineto
stroke
newpath
37136.6 21894.3 moveto
37192.9 21838 lineto
37136.6 21781.8 lineto
37080.4 21838 lineto
37136.6 21894.3 lineto
37136.6 21781.8 lineto
stroke
newpath
38261.5 22962.9 moveto
37699 22962.9 lineto
37642.8 22400.5 lineto
37699 22456.7 lineto
37811.5 22512.9 lineto
38092.7 22512.9 lineto
38205.2 22456.7 lineto
38261.5 22400.5 lineto
38317.7 22288 lineto
38317.7 22006.8 lineto
38261.5 21894.3 lineto
38205.2 21838 lineto
38092.7 21781.8 lineto
37811.5 21781.8 lineto
37699 21838 lineto
37642.8 21894.3 lineto
stroke
newpath
38767.7 22850.4 moveto
38823.9 22906.6 lineto
38936.4 22962.9 lineto
39217.6 22962.9 lineto
39330.1 22906.6 lineto
39386.3 22850.4 lineto
39442.6 22737.9 lineto
39442.6 22625.4 lineto
39386.3 22456.7 lineto
38711.4 21781.8 lineto
39442.6 21781.8 lineto
stroke
newpath
39948.8 21781.8 moveto
39948.8 22569.2 lineto
stroke
newpath
39948.8 22456.7 moveto
40005 22512.9 lineto
40117.5 22569.2 lineto
40286.2 22569.2 lineto
40398.7 22512.9 lineto
40454.9 22400.5 lineto
40454.9 21781.8 lineto
stroke
newpath
40454.9 22400.5 moveto
40511.2 22512.9 lineto
40623.7 22569.2 lineto
40792.4 22569.2 lineto
40904.9 22512.9 lineto
40961.1 22400.5 lineto
40961.1 21781.8 lineto
stroke
newpath
41523.6 21781.8 moveto
41523.6 22569.2 lineto
stroke
newpath
41523.6 22456.7 moveto
41579.8 22512.9 lineto
41692.3 22569.2 lineto
41861 22569.2 lineto
41973.5 22512.9 lineto
42029.7 22400.5 lineto
42029.7 21781.8 lineto
stroke
newpath
42029.7 22400.5 moveto
42086 22512.9 lineto
42198.5 22569.2 lineto
42367.2 22569.2 lineto
42479.7 22512.9 lineto
42535.9 22400.5 lineto
42535.9 21781.8 lineto
stroke
newpath
44841.9 23019.1 moveto
43829.5 21500.6 lineto
stroke
newpath
46360.5 22962.9 moveto
46472.9 22962.9 lineto
46585.4 22906.6 lineto
46641.7 22850.4 lineto
46697.9 22737.9 lineto
46754.2 22512.9 lineto
46754.2 22231.7 lineto
46697.9 22006.8 lineto
46641.7 21894.3 lineto
46585.4 21838 lineto
46472.9 21781.8 lineto
46360.5 21781.8 lineto
46248 21838 lineto
46191.7 21894.3 lineto
46135.5 22006.8 lineto
46079.2 22231.7 lineto
46079.2 22512.9 lineto
46135.5 22737.9 lineto
46191.7 22850.4 lineto
46248 22906.6 lineto
46360.5 22962.9 lineto
stroke
newpath
47260.3 21894.3 moveto
47316.6 21838 lineto
47260.3 21781.8 lineto
47204.1 21838 lineto
47260.3 21894.3 lineto
47260.3 21781.8 lineto
stroke
newpath
48047.7 22962.9 moveto
48160.2 22962.9 lineto
48272.7 22906.6 lineto
48329 22850.4 lineto
48385.2 22737.9 lineto
48441.4 22512.9 lineto
48441.4 22231.7 lineto
48385.2 22006.8 lineto
48329 21894.3 lineto
48272.7 21838 lineto
48160.2 21781.8 lineto
48047.7 21781.8 lineto
47935.3 21838 lineto
47879 21894.3 lineto
47822.8 22006.8 lineto
47766.5 22231.7 lineto
47766.5 22512.9 lineto
47822.8 22737.9 lineto
47879 22850.4 lineto
47935.3 22906.6 lineto
48047.7 22962.9 lineto
stroke
newpath
49453.8 22962.9 moveto
49228.8 22962.9 lineto
49116.4 22906.6 lineto
49060.1 22850.4 lineto
48947.6 22681.7 lineto
48891.4 22456.7 lineto
48891.4 22006.8 lineto
48947.6 21894.3 lineto
49003.9 21838 lineto
49116.4 21781.8 lineto
49341.3 21781.8 lineto
49453.8 21838 lineto
49510.1 21894.3 lineto
49566.3 22006.8 lineto
49566.3 22288 lineto
49510.1 22400.5 lineto
49453.8 22456.7 lineto
49341.3 22512.9 lineto
49116.4 22512.9 lineto
49003.9 22456.7 lineto
48947.6 22400.5 lineto
48891.4 22288 lineto
stroke
newpath
50297.5 22962.9 moveto
50409.9 22962.9 lineto
50522.4 22906.6 lineto
50578.7 22850.4 lineto
50634.9 22737.9 lineto
50691.2 22512.9 lineto
50691.2 22231.7 lineto
50634.9 22006.8 lineto
50578.7 21894.3 lineto
50522.4 21838 lineto
50409.9 21781.8 lineto
50297.5 21781.8 lineto
50185 21838 lineto
50128.7 21894.3 lineto
50072.5 22006.8 lineto
50016.2 22231.7 lineto
50016.2 22512.9 lineto
50072.5 22737.9 lineto
50128.7 22850.4 lineto
50185 22906.6 lineto
50297.5 22962.9 lineto
stroke
newpath
51141.1 22962.9 moveto
51141.1 22737.9 lineto
stroke
newpath
51591.1 22962.9 moveto
51591.1 22737.9 lineto
stroke
newpath
53334.6 21331.8 moveto
53278.3 21388.1 lineto
53165.9 21556.8 lineto
53109.6 21669.3 lineto
53053.4 21838 lineto
52997.1 22119.2 lineto
52997.1 22344.2 lineto
53053.4 22625.4 lineto
53109.6 22794.2 lineto
53165.9 22906.6 lineto
53278.3 23075.4 lineto
53334.6 23131.6 lineto
stroke
newpath
53728.3 22850.4 moveto
53784.5 22906.6 lineto
53897 22962.9 lineto
54178.2 22962.9 lineto
54290.7 22906.6 lineto
54347 22850.4 lineto
54403.2 22737.9 lineto
54403.2 22625.4 lineto
54347 22456.7 lineto
53672 21781.8 lineto
54403.2 21781.8 lineto
stroke
newpath
55809.3 21781.8 moveto
55809.3 22962.9 lineto
stroke
newpath
56315.5 21781.8 moveto
56315.5 22400.5 lineto
56259.2 22512.9 lineto
56146.7 22569.2 lineto
55978 22569.2 lineto
55865.5 22512.9 lineto
55809.3 22456.7 lineto
stroke
newpath
57046.6 21781.8 moveto
56934.1 21838 lineto
56877.9 21894.3 lineto
56821.6 22006.8 lineto
56821.6 22344.2 lineto
56877.9 22456.7 lineto
56934.1 22512.9 lineto
57046.6 22569.2 lineto
57215.3 22569.2 lineto
57327.8 22512.9 lineto
57384.1 22456.7 lineto
57440.3 22344.2 lineto
57440.3 22006.8 lineto
57384.1 21894.3 lineto
57327.8 21838 lineto
57215.3 21781.8 lineto
57046.6 21781.8 lineto
stroke
newpath
58115.2 21781.8 moveto
58002.7 21838 lineto
57946.5 21950.5 lineto
57946.5 22962.9 lineto
stroke
newpath
59015.1 21838 moveto
58902.6 21781.8 lineto
58677.7 21781.8 lineto
58565.2 21838 lineto
58508.9 21950.5 lineto
58508.9 22400.5 lineto
58565.2 22512.9 lineto
58677.7 22569.2 lineto
58902.6 22569.2 lineto
59015.1 22512.9 lineto
59071.4 22400.5 lineto
59071.4 22288 lineto
58508.9 22175.5 lineto
stroke
newpath
59521.3 21838 moveto
59633.8 21781.8 lineto
59858.8 21781.8 lineto
59971.3 21838 lineto
60027.5 21950.5 lineto
60027.5 22006.8 lineto
59971.3 22119.2 lineto
59858.8 22175.5 lineto
59690 22175.5 lineto
59577.6 22231.7 lineto
59521.3 22344.2 lineto
59521.3 22400.5 lineto
59577.6 22512.9 lineto
59690 22569.2 lineto
59858.8 22569.2 lineto
59971.3 22512.9 lineto
stroke
newpath
60421.2 21331.8 moveto
60477.4 21388.1 lineto
60589.9 21556.8 lineto
60646.2 21669.3 lineto
60702.4 21838 lineto
60758.7 22119.2 lineto
60758.7 22344.2 lineto
60702.4 22625.4 lineto
60646.2 22794.2 lineto
60589.9 22906.6 lineto
60477.4 23075.4 lineto
60421.2 23131.6 lineto
stroke
showpage
grestore
%%EOF
