G04 #@! TF.GenerationSoftware,KiCad,Pcbnew,(5.1.5-0-10_14)*
G04 #@! TF.CreationDate,2020-09-21T09:54:51+02:00*
G04 #@! TF.ProjectId,BarduinoStepperBoard,42617264-7569-46e6-9f53-746570706572,rev?*
G04 #@! TF.SameCoordinates,Original*
G04 #@! TF.FileFunction,Legend,Bot*
G04 #@! TF.FilePolarity,Positive*
%FSLAX46Y46*%
G04 Gerber Fmt 4.6, Leading zero omitted, Abs format (unit mm)*
G04 Created by KiCad (PCBNEW (5.1.5-0-10_14)) date 2020-09-21 09:54:51*
%MOMM*%
%LPD*%
G04 APERTURE LIST*
%ADD10C,0.127000*%
%ADD11C,0.150000*%
%ADD12C,0.152400*%
G04 APERTURE END LIST*
D10*
X161786000Y-53718000D02*
X159754000Y-53718000D01*
X161786000Y-57782000D02*
X161786000Y-53718000D01*
X159754000Y-57782000D02*
X161786000Y-57782000D01*
X159754000Y-53718000D02*
X159754000Y-57782000D01*
D11*
X155500000Y-67500000D02*
X142500000Y-67500000D01*
X155500000Y-82740000D02*
X155500000Y-67500000D01*
X142500000Y-82740000D02*
X155500000Y-82740000D01*
X142500000Y-67500000D02*
X142500000Y-82740000D01*
D10*
X162295111Y-57782000D02*
X164327111Y-57782000D01*
X162295111Y-53718000D02*
X162295111Y-57782000D01*
X164327111Y-53718000D02*
X162295111Y-53718000D01*
X164327111Y-57782000D02*
X164327111Y-53718000D01*
X167377333Y-57782000D02*
X169409333Y-57782000D01*
X167377333Y-53718000D02*
X167377333Y-57782000D01*
X169409333Y-53718000D02*
X167377333Y-53718000D01*
X169409333Y-57782000D02*
X169409333Y-53718000D01*
X172459555Y-57782000D02*
X174491555Y-57782000D01*
X172459555Y-53718000D02*
X172459555Y-57782000D01*
X174491555Y-53718000D02*
X172459555Y-53718000D01*
X174491555Y-57782000D02*
X174491555Y-53718000D01*
X177541777Y-57782000D02*
X179573777Y-57782000D01*
X177541777Y-53718000D02*
X177541777Y-57782000D01*
X179573777Y-53718000D02*
X177541777Y-53718000D01*
X179573777Y-57782000D02*
X179573777Y-53718000D01*
X182624000Y-57782000D02*
X184656000Y-57782000D01*
X182624000Y-53718000D02*
X182624000Y-57782000D01*
X184656000Y-53718000D02*
X182624000Y-53718000D01*
X184656000Y-57782000D02*
X184656000Y-53718000D01*
X108334000Y-77972000D02*
X110366000Y-77972000D01*
X108334000Y-73908000D02*
X108334000Y-77972000D01*
X110366000Y-73908000D02*
X108334000Y-73908000D01*
X110366000Y-77972000D02*
X110366000Y-73908000D01*
X112736000Y-90228000D02*
X110704000Y-90228000D01*
X112736000Y-94292000D02*
X112736000Y-90228000D01*
X110704000Y-94292000D02*
X112736000Y-94292000D01*
X110704000Y-90228000D02*
X110704000Y-94292000D01*
X117764000Y-79532000D02*
X119796000Y-79532000D01*
X117764000Y-75468000D02*
X117764000Y-79532000D01*
X119796000Y-75468000D02*
X117764000Y-75468000D01*
X119796000Y-79532000D02*
X119796000Y-75468000D01*
X121264000Y-79572000D02*
X123296000Y-79572000D01*
X121264000Y-75508000D02*
X121264000Y-79572000D01*
X123296000Y-75508000D02*
X121264000Y-75508000D01*
X123296000Y-79572000D02*
X123296000Y-75508000D01*
X143234000Y-77072000D02*
X145266000Y-77072000D01*
X143234000Y-73008000D02*
X143234000Y-77072000D01*
X145266000Y-73008000D02*
X143234000Y-73008000D01*
X145266000Y-77072000D02*
X145266000Y-73008000D01*
X166868222Y-53718000D02*
X164836222Y-53718000D01*
X166868222Y-57782000D02*
X166868222Y-53718000D01*
X164836222Y-57782000D02*
X166868222Y-57782000D01*
X164836222Y-53718000D02*
X164836222Y-57782000D01*
X171950444Y-53718000D02*
X169918444Y-53718000D01*
X171950444Y-57782000D02*
X171950444Y-53718000D01*
X169918444Y-57782000D02*
X171950444Y-57782000D01*
X169918444Y-53718000D02*
X169918444Y-57782000D01*
X182114888Y-53718000D02*
X180082888Y-53718000D01*
X182114888Y-57782000D02*
X182114888Y-53718000D01*
X180082888Y-57782000D02*
X182114888Y-57782000D01*
X180082888Y-53718000D02*
X180082888Y-57782000D01*
X107004000Y-94252000D02*
X109036000Y-94252000D01*
X107004000Y-90188000D02*
X107004000Y-94252000D01*
X109036000Y-90188000D02*
X107004000Y-90188000D01*
X109036000Y-94252000D02*
X109036000Y-90188000D01*
X113794000Y-94292000D02*
X115826000Y-94292000D01*
X113794000Y-90228000D02*
X113794000Y-94292000D01*
X115826000Y-90228000D02*
X113794000Y-90228000D01*
X115826000Y-94292000D02*
X115826000Y-90228000D01*
X117564000Y-94402000D02*
X119596000Y-94402000D01*
X117564000Y-90338000D02*
X117564000Y-94402000D01*
X119596000Y-90338000D02*
X117564000Y-90338000D01*
X119596000Y-94402000D02*
X119596000Y-90338000D01*
X121544000Y-94272000D02*
X123576000Y-94272000D01*
X121544000Y-90208000D02*
X121544000Y-94272000D01*
X123576000Y-90208000D02*
X121544000Y-90208000D01*
X123576000Y-94272000D02*
X123576000Y-90208000D01*
X103874000Y-94232000D02*
X105906000Y-94232000D01*
X103874000Y-90168000D02*
X103874000Y-94232000D01*
X105906000Y-90168000D02*
X103874000Y-90168000D01*
X105906000Y-94232000D02*
X105906000Y-90168000D01*
X111044000Y-79582000D02*
X113076000Y-79582000D01*
X111044000Y-75518000D02*
X111044000Y-79582000D01*
X113076000Y-75518000D02*
X111044000Y-75518000D01*
X113076000Y-79582000D02*
X113076000Y-75518000D01*
X114384000Y-79612000D02*
X116416000Y-79612000D01*
X114384000Y-75548000D02*
X114384000Y-79612000D01*
X116416000Y-75548000D02*
X114384000Y-75548000D01*
X116416000Y-79612000D02*
X116416000Y-75548000D01*
X124564000Y-79572000D02*
X126596000Y-79572000D01*
X124564000Y-75508000D02*
X124564000Y-79572000D01*
X126596000Y-75508000D02*
X124564000Y-75508000D01*
X126596000Y-79572000D02*
X126596000Y-75508000D01*
X177032666Y-53718000D02*
X175000666Y-53718000D01*
X177032666Y-57782000D02*
X177032666Y-53718000D01*
X175000666Y-57782000D02*
X177032666Y-57782000D01*
X175000666Y-53718000D02*
X175000666Y-57782000D01*
X149354000Y-76912000D02*
X151386000Y-76912000D01*
X149354000Y-72848000D02*
X149354000Y-76912000D01*
X151386000Y-72848000D02*
X149354000Y-72848000D01*
X151386000Y-76912000D02*
X151386000Y-72848000D01*
D12*
X160551904Y-52440000D02*
X160170952Y-52173334D01*
X160551904Y-51982857D02*
X159751904Y-51982857D01*
X159751904Y-52287619D01*
X159790000Y-52363810D01*
X159828095Y-52401905D01*
X159904285Y-52440000D01*
X160018571Y-52440000D01*
X160094761Y-52401905D01*
X160132857Y-52363810D01*
X160170952Y-52287619D01*
X160170952Y-51982857D01*
X160551904Y-53201905D02*
X160551904Y-52744762D01*
X160551904Y-52973334D02*
X159751904Y-52973334D01*
X159866190Y-52897143D01*
X159942380Y-52820953D01*
X159980476Y-52744762D01*
X161817693Y-50763809D02*
X161817693Y-50306666D01*
X161817693Y-50535238D02*
X161017693Y-50535238D01*
X161131979Y-50459047D01*
X161208169Y-50382857D01*
X161246265Y-50306666D01*
X161017693Y-51259047D02*
X161017693Y-51335238D01*
X161055789Y-51411428D01*
X161093884Y-51449524D01*
X161170074Y-51487619D01*
X161322455Y-51525714D01*
X161512931Y-51525714D01*
X161665312Y-51487619D01*
X161741503Y-51449524D01*
X161779598Y-51411428D01*
X161817693Y-51335238D01*
X161817693Y-51259047D01*
X161779598Y-51182857D01*
X161741503Y-51144762D01*
X161665312Y-51106666D01*
X161512931Y-51068571D01*
X161322455Y-51068571D01*
X161170074Y-51106666D01*
X161093884Y-51144762D01*
X161055789Y-51182857D01*
X161017693Y-51259047D01*
X161017693Y-52020952D02*
X161017693Y-52097143D01*
X161055789Y-52173333D01*
X161093884Y-52211428D01*
X161170074Y-52249524D01*
X161322455Y-52287619D01*
X161512931Y-52287619D01*
X161665312Y-52249524D01*
X161741503Y-52211428D01*
X161779598Y-52173333D01*
X161817693Y-52097143D01*
X161817693Y-52020952D01*
X161779598Y-51944762D01*
X161741503Y-51906666D01*
X161665312Y-51868571D01*
X161512931Y-51830476D01*
X161322455Y-51830476D01*
X161170074Y-51868571D01*
X161093884Y-51906666D01*
X161055789Y-51944762D01*
X161017693Y-52020952D01*
X161817693Y-52592381D02*
X161817693Y-52782857D01*
X161665312Y-52782857D01*
X161627217Y-52706666D01*
X161551027Y-52630476D01*
X161436741Y-52592381D01*
X161246265Y-52592381D01*
X161131979Y-52630476D01*
X161055789Y-52706666D01*
X161017693Y-52820952D01*
X161017693Y-52973333D01*
X161055789Y-53087619D01*
X161131979Y-53163809D01*
X161246265Y-53201905D01*
X161436741Y-53201905D01*
X161551027Y-53163809D01*
X161627217Y-53087619D01*
X161665312Y-53011428D01*
X161817693Y-53011428D01*
X161817693Y-53201905D01*
D11*
X141222380Y-67338095D02*
X141222380Y-67909523D01*
X142222380Y-67623809D02*
X141222380Y-67623809D01*
X142222380Y-68766666D02*
X142222380Y-68195238D01*
X142222380Y-68480952D02*
X141222380Y-68480952D01*
X141365238Y-68385714D01*
X141460476Y-68290476D01*
X141508095Y-68195238D01*
D12*
X163007292Y-52440000D02*
X163045387Y-52401905D01*
X163083482Y-52287619D01*
X163083482Y-52211429D01*
X163045387Y-52097143D01*
X162969197Y-52020953D01*
X162893006Y-51982857D01*
X162740625Y-51944762D01*
X162626339Y-51944762D01*
X162473958Y-51982857D01*
X162397768Y-52020953D01*
X162321578Y-52097143D01*
X162283482Y-52211429D01*
X162283482Y-52287619D01*
X162321578Y-52401905D01*
X162359673Y-52440000D01*
X162550149Y-53125714D02*
X163083482Y-53125714D01*
X162245387Y-52935238D02*
X162816816Y-52744762D01*
X162816816Y-53240000D01*
X164349271Y-50268571D02*
X164349271Y-49811428D01*
X164349271Y-50040000D02*
X163549271Y-50040000D01*
X163663557Y-49963809D01*
X163739747Y-49887619D01*
X163777843Y-49811428D01*
X163549271Y-50763809D02*
X163549271Y-50840000D01*
X163587367Y-50916190D01*
X163625462Y-50954286D01*
X163701652Y-50992381D01*
X163854033Y-51030476D01*
X164044509Y-51030476D01*
X164196890Y-50992381D01*
X164273081Y-50954286D01*
X164311176Y-50916190D01*
X164349271Y-50840000D01*
X164349271Y-50763809D01*
X164311176Y-50687619D01*
X164273081Y-50649524D01*
X164196890Y-50611428D01*
X164044509Y-50573333D01*
X163854033Y-50573333D01*
X163701652Y-50611428D01*
X163625462Y-50649524D01*
X163587367Y-50687619D01*
X163549271Y-50763809D01*
X163549271Y-51525714D02*
X163549271Y-51601905D01*
X163587367Y-51678095D01*
X163625462Y-51716190D01*
X163701652Y-51754286D01*
X163854033Y-51792381D01*
X164044509Y-51792381D01*
X164196890Y-51754286D01*
X164273081Y-51716190D01*
X164311176Y-51678095D01*
X164349271Y-51601905D01*
X164349271Y-51525714D01*
X164311176Y-51449524D01*
X164273081Y-51411428D01*
X164196890Y-51373333D01*
X164044509Y-51335238D01*
X163854033Y-51335238D01*
X163701652Y-51373333D01*
X163625462Y-51411428D01*
X163587367Y-51449524D01*
X163549271Y-51525714D01*
X163815938Y-52135238D02*
X164349271Y-52135238D01*
X163892128Y-52135238D02*
X163854033Y-52173333D01*
X163815938Y-52249524D01*
X163815938Y-52363809D01*
X163854033Y-52440000D01*
X163930224Y-52478095D01*
X164349271Y-52478095D01*
X163930224Y-53125714D02*
X163930224Y-52859047D01*
X164349271Y-52859047D02*
X163549271Y-52859047D01*
X163549271Y-53240000D01*
X168070448Y-52440000D02*
X168108543Y-52401905D01*
X168146638Y-52287619D01*
X168146638Y-52211429D01*
X168108543Y-52097143D01*
X168032353Y-52020953D01*
X167956162Y-51982857D01*
X167803781Y-51944762D01*
X167689495Y-51944762D01*
X167537114Y-51982857D01*
X167460924Y-52020953D01*
X167384734Y-52097143D01*
X167346638Y-52211429D01*
X167346638Y-52287619D01*
X167384734Y-52401905D01*
X167422829Y-52440000D01*
X167346638Y-53163810D02*
X167346638Y-52782857D01*
X167727591Y-52744762D01*
X167689495Y-52782857D01*
X167651400Y-52859048D01*
X167651400Y-53049524D01*
X167689495Y-53125714D01*
X167727591Y-53163810D01*
X167803781Y-53201905D01*
X167994257Y-53201905D01*
X168070448Y-53163810D01*
X168108543Y-53125714D01*
X168146638Y-53049524D01*
X168146638Y-52859048D01*
X168108543Y-52782857D01*
X168070448Y-52744762D01*
X169412427Y-50268571D02*
X169412427Y-49811428D01*
X169412427Y-50040000D02*
X168612427Y-50040000D01*
X168726713Y-49963809D01*
X168802903Y-49887619D01*
X168840999Y-49811428D01*
X168612427Y-50763809D02*
X168612427Y-50840000D01*
X168650523Y-50916190D01*
X168688618Y-50954286D01*
X168764808Y-50992381D01*
X168917189Y-51030476D01*
X169107665Y-51030476D01*
X169260046Y-50992381D01*
X169336237Y-50954286D01*
X169374332Y-50916190D01*
X169412427Y-50840000D01*
X169412427Y-50763809D01*
X169374332Y-50687619D01*
X169336237Y-50649524D01*
X169260046Y-50611428D01*
X169107665Y-50573333D01*
X168917189Y-50573333D01*
X168764808Y-50611428D01*
X168688618Y-50649524D01*
X168650523Y-50687619D01*
X168612427Y-50763809D01*
X168612427Y-51525714D02*
X168612427Y-51601905D01*
X168650523Y-51678095D01*
X168688618Y-51716190D01*
X168764808Y-51754286D01*
X168917189Y-51792381D01*
X169107665Y-51792381D01*
X169260046Y-51754286D01*
X169336237Y-51716190D01*
X169374332Y-51678095D01*
X169412427Y-51601905D01*
X169412427Y-51525714D01*
X169374332Y-51449524D01*
X169336237Y-51411428D01*
X169260046Y-51373333D01*
X169107665Y-51335238D01*
X168917189Y-51335238D01*
X168764808Y-51373333D01*
X168688618Y-51411428D01*
X168650523Y-51449524D01*
X168612427Y-51525714D01*
X168879094Y-52135238D02*
X169412427Y-52135238D01*
X168955284Y-52135238D02*
X168917189Y-52173333D01*
X168879094Y-52249524D01*
X168879094Y-52363809D01*
X168917189Y-52440000D01*
X168993380Y-52478095D01*
X169412427Y-52478095D01*
X168993380Y-53125714D02*
X168993380Y-52859047D01*
X169412427Y-52859047D02*
X168612427Y-52859047D01*
X168612427Y-53240000D01*
X173133604Y-52440000D02*
X173171699Y-52401905D01*
X173209794Y-52287619D01*
X173209794Y-52211429D01*
X173171699Y-52097143D01*
X173095509Y-52020953D01*
X173019318Y-51982857D01*
X172866937Y-51944762D01*
X172752651Y-51944762D01*
X172600270Y-51982857D01*
X172524080Y-52020953D01*
X172447890Y-52097143D01*
X172409794Y-52211429D01*
X172409794Y-52287619D01*
X172447890Y-52401905D01*
X172485985Y-52440000D01*
X172409794Y-53125714D02*
X172409794Y-52973334D01*
X172447890Y-52897143D01*
X172485985Y-52859048D01*
X172600270Y-52782857D01*
X172752651Y-52744762D01*
X173057413Y-52744762D01*
X173133604Y-52782857D01*
X173171699Y-52820953D01*
X173209794Y-52897143D01*
X173209794Y-53049524D01*
X173171699Y-53125714D01*
X173133604Y-53163810D01*
X173057413Y-53201905D01*
X172866937Y-53201905D01*
X172790747Y-53163810D01*
X172752651Y-53125714D01*
X172714556Y-53049524D01*
X172714556Y-52897143D01*
X172752651Y-52820953D01*
X172790747Y-52782857D01*
X172866937Y-52744762D01*
X174475583Y-50268571D02*
X174475583Y-49811428D01*
X174475583Y-50040000D02*
X173675583Y-50040000D01*
X173789869Y-49963809D01*
X173866059Y-49887619D01*
X173904155Y-49811428D01*
X173675583Y-50763809D02*
X173675583Y-50840000D01*
X173713679Y-50916190D01*
X173751774Y-50954286D01*
X173827964Y-50992381D01*
X173980345Y-51030476D01*
X174170821Y-51030476D01*
X174323202Y-50992381D01*
X174399393Y-50954286D01*
X174437488Y-50916190D01*
X174475583Y-50840000D01*
X174475583Y-50763809D01*
X174437488Y-50687619D01*
X174399393Y-50649524D01*
X174323202Y-50611428D01*
X174170821Y-50573333D01*
X173980345Y-50573333D01*
X173827964Y-50611428D01*
X173751774Y-50649524D01*
X173713679Y-50687619D01*
X173675583Y-50763809D01*
X173675583Y-51525714D02*
X173675583Y-51601905D01*
X173713679Y-51678095D01*
X173751774Y-51716190D01*
X173827964Y-51754286D01*
X173980345Y-51792381D01*
X174170821Y-51792381D01*
X174323202Y-51754286D01*
X174399393Y-51716190D01*
X174437488Y-51678095D01*
X174475583Y-51601905D01*
X174475583Y-51525714D01*
X174437488Y-51449524D01*
X174399393Y-51411428D01*
X174323202Y-51373333D01*
X174170821Y-51335238D01*
X173980345Y-51335238D01*
X173827964Y-51373333D01*
X173751774Y-51411428D01*
X173713679Y-51449524D01*
X173675583Y-51525714D01*
X173942250Y-52135238D02*
X174475583Y-52135238D01*
X174018440Y-52135238D02*
X173980345Y-52173333D01*
X173942250Y-52249524D01*
X173942250Y-52363809D01*
X173980345Y-52440000D01*
X174056536Y-52478095D01*
X174475583Y-52478095D01*
X174056536Y-53125714D02*
X174056536Y-52859047D01*
X174475583Y-52859047D02*
X173675583Y-52859047D01*
X173675583Y-53240000D01*
X178196760Y-52440000D02*
X178234855Y-52401905D01*
X178272950Y-52287619D01*
X178272950Y-52211429D01*
X178234855Y-52097143D01*
X178158665Y-52020953D01*
X178082474Y-51982857D01*
X177930093Y-51944762D01*
X177815807Y-51944762D01*
X177663426Y-51982857D01*
X177587236Y-52020953D01*
X177511046Y-52097143D01*
X177472950Y-52211429D01*
X177472950Y-52287619D01*
X177511046Y-52401905D01*
X177549141Y-52440000D01*
X177472950Y-52706667D02*
X177472950Y-53240000D01*
X178272950Y-52897143D01*
X179538739Y-50268571D02*
X179538739Y-49811428D01*
X179538739Y-50040000D02*
X178738739Y-50040000D01*
X178853025Y-49963809D01*
X178929215Y-49887619D01*
X178967311Y-49811428D01*
X178738739Y-50763809D02*
X178738739Y-50840000D01*
X178776835Y-50916190D01*
X178814930Y-50954286D01*
X178891120Y-50992381D01*
X179043501Y-51030476D01*
X179233977Y-51030476D01*
X179386358Y-50992381D01*
X179462549Y-50954286D01*
X179500644Y-50916190D01*
X179538739Y-50840000D01*
X179538739Y-50763809D01*
X179500644Y-50687619D01*
X179462549Y-50649524D01*
X179386358Y-50611428D01*
X179233977Y-50573333D01*
X179043501Y-50573333D01*
X178891120Y-50611428D01*
X178814930Y-50649524D01*
X178776835Y-50687619D01*
X178738739Y-50763809D01*
X178738739Y-51525714D02*
X178738739Y-51601905D01*
X178776835Y-51678095D01*
X178814930Y-51716190D01*
X178891120Y-51754286D01*
X179043501Y-51792381D01*
X179233977Y-51792381D01*
X179386358Y-51754286D01*
X179462549Y-51716190D01*
X179500644Y-51678095D01*
X179538739Y-51601905D01*
X179538739Y-51525714D01*
X179500644Y-51449524D01*
X179462549Y-51411428D01*
X179386358Y-51373333D01*
X179233977Y-51335238D01*
X179043501Y-51335238D01*
X178891120Y-51373333D01*
X178814930Y-51411428D01*
X178776835Y-51449524D01*
X178738739Y-51525714D01*
X179005406Y-52135238D02*
X179538739Y-52135238D01*
X179081596Y-52135238D02*
X179043501Y-52173333D01*
X179005406Y-52249524D01*
X179005406Y-52363809D01*
X179043501Y-52440000D01*
X179119692Y-52478095D01*
X179538739Y-52478095D01*
X179119692Y-53125714D02*
X179119692Y-52859047D01*
X179538739Y-52859047D02*
X178738739Y-52859047D01*
X178738739Y-53240000D01*
X183259916Y-52440000D02*
X183298011Y-52401905D01*
X183336106Y-52287619D01*
X183336106Y-52211429D01*
X183298011Y-52097143D01*
X183221821Y-52020953D01*
X183145630Y-51982857D01*
X182993249Y-51944762D01*
X182878963Y-51944762D01*
X182726582Y-51982857D01*
X182650392Y-52020953D01*
X182574202Y-52097143D01*
X182536106Y-52211429D01*
X182536106Y-52287619D01*
X182574202Y-52401905D01*
X182612297Y-52440000D01*
X182878963Y-52897143D02*
X182840868Y-52820953D01*
X182802773Y-52782857D01*
X182726582Y-52744762D01*
X182688487Y-52744762D01*
X182612297Y-52782857D01*
X182574202Y-52820953D01*
X182536106Y-52897143D01*
X182536106Y-53049524D01*
X182574202Y-53125714D01*
X182612297Y-53163810D01*
X182688487Y-53201905D01*
X182726582Y-53201905D01*
X182802773Y-53163810D01*
X182840868Y-53125714D01*
X182878963Y-53049524D01*
X182878963Y-52897143D01*
X182917059Y-52820953D01*
X182955154Y-52782857D01*
X183031344Y-52744762D01*
X183183725Y-52744762D01*
X183259916Y-52782857D01*
X183298011Y-52820953D01*
X183336106Y-52897143D01*
X183336106Y-53049524D01*
X183298011Y-53125714D01*
X183259916Y-53163810D01*
X183183725Y-53201905D01*
X183031344Y-53201905D01*
X182955154Y-53163810D01*
X182917059Y-53125714D01*
X182878963Y-53049524D01*
X184601895Y-50268571D02*
X184601895Y-49811428D01*
X184601895Y-50040000D02*
X183801895Y-50040000D01*
X183916181Y-49963809D01*
X183992371Y-49887619D01*
X184030467Y-49811428D01*
X183801895Y-50763809D02*
X183801895Y-50840000D01*
X183839991Y-50916190D01*
X183878086Y-50954286D01*
X183954276Y-50992381D01*
X184106657Y-51030476D01*
X184297133Y-51030476D01*
X184449514Y-50992381D01*
X184525705Y-50954286D01*
X184563800Y-50916190D01*
X184601895Y-50840000D01*
X184601895Y-50763809D01*
X184563800Y-50687619D01*
X184525705Y-50649524D01*
X184449514Y-50611428D01*
X184297133Y-50573333D01*
X184106657Y-50573333D01*
X183954276Y-50611428D01*
X183878086Y-50649524D01*
X183839991Y-50687619D01*
X183801895Y-50763809D01*
X183801895Y-51525714D02*
X183801895Y-51601905D01*
X183839991Y-51678095D01*
X183878086Y-51716190D01*
X183954276Y-51754286D01*
X184106657Y-51792381D01*
X184297133Y-51792381D01*
X184449514Y-51754286D01*
X184525705Y-51716190D01*
X184563800Y-51678095D01*
X184601895Y-51601905D01*
X184601895Y-51525714D01*
X184563800Y-51449524D01*
X184525705Y-51411428D01*
X184449514Y-51373333D01*
X184297133Y-51335238D01*
X184106657Y-51335238D01*
X183954276Y-51373333D01*
X183878086Y-51411428D01*
X183839991Y-51449524D01*
X183801895Y-51525714D01*
X184068562Y-52135238D02*
X184601895Y-52135238D01*
X184144752Y-52135238D02*
X184106657Y-52173333D01*
X184068562Y-52249524D01*
X184068562Y-52363809D01*
X184106657Y-52440000D01*
X184182848Y-52478095D01*
X184601895Y-52478095D01*
X184182848Y-53125714D02*
X184182848Y-52859047D01*
X184601895Y-52859047D02*
X183801895Y-52859047D01*
X183801895Y-53240000D01*
X106082857Y-75700666D02*
X106131238Y-75652285D01*
X106179619Y-75507142D01*
X106179619Y-75410380D01*
X106131238Y-75265238D01*
X106034476Y-75168476D01*
X105937714Y-75120095D01*
X105744190Y-75071714D01*
X105599047Y-75071714D01*
X105405523Y-75120095D01*
X105308761Y-75168476D01*
X105212000Y-75265238D01*
X105163619Y-75410380D01*
X105163619Y-75507142D01*
X105212000Y-75652285D01*
X105260380Y-75700666D01*
X106179619Y-76184476D02*
X106179619Y-76378000D01*
X106131238Y-76474761D01*
X106082857Y-76523142D01*
X105937714Y-76619904D01*
X105744190Y-76668285D01*
X105357142Y-76668285D01*
X105260380Y-76619904D01*
X105212000Y-76571523D01*
X105163619Y-76474761D01*
X105163619Y-76281238D01*
X105212000Y-76184476D01*
X105260380Y-76136095D01*
X105357142Y-76087714D01*
X105599047Y-76087714D01*
X105695809Y-76136095D01*
X105744190Y-76184476D01*
X105792571Y-76281238D01*
X105792571Y-76474761D01*
X105744190Y-76571523D01*
X105695809Y-76619904D01*
X105599047Y-76668285D01*
X107669619Y-74407619D02*
X107669619Y-73827047D01*
X107669619Y-74117333D02*
X106653619Y-74117333D01*
X106798761Y-74020571D01*
X106895523Y-73923809D01*
X106943904Y-73827047D01*
X106653619Y-75036571D02*
X106653619Y-75133333D01*
X106702000Y-75230095D01*
X106750380Y-75278476D01*
X106847142Y-75326857D01*
X107040666Y-75375238D01*
X107282571Y-75375238D01*
X107476095Y-75326857D01*
X107572857Y-75278476D01*
X107621238Y-75230095D01*
X107669619Y-75133333D01*
X107669619Y-75036571D01*
X107621238Y-74939809D01*
X107572857Y-74891428D01*
X107476095Y-74843047D01*
X107282571Y-74794666D01*
X107040666Y-74794666D01*
X106847142Y-74843047D01*
X106750380Y-74891428D01*
X106702000Y-74939809D01*
X106653619Y-75036571D01*
X106653619Y-76004190D02*
X106653619Y-76100952D01*
X106702000Y-76197714D01*
X106750380Y-76246095D01*
X106847142Y-76294476D01*
X107040666Y-76342857D01*
X107282571Y-76342857D01*
X107476095Y-76294476D01*
X107572857Y-76246095D01*
X107621238Y-76197714D01*
X107669619Y-76100952D01*
X107669619Y-76004190D01*
X107621238Y-75907428D01*
X107572857Y-75859047D01*
X107476095Y-75810666D01*
X107282571Y-75762285D01*
X107040666Y-75762285D01*
X106847142Y-75810666D01*
X106750380Y-75859047D01*
X106702000Y-75907428D01*
X106653619Y-76004190D01*
X106992285Y-76778285D02*
X107669619Y-76778285D01*
X107089047Y-76778285D02*
X107040666Y-76826666D01*
X106992285Y-76923428D01*
X106992285Y-77068571D01*
X107040666Y-77165333D01*
X107137428Y-77213714D01*
X107669619Y-77213714D01*
X107137428Y-78036190D02*
X107137428Y-77697523D01*
X107669619Y-77697523D02*
X106653619Y-77697523D01*
X106653619Y-78181333D01*
X112767857Y-95910666D02*
X112816238Y-95862285D01*
X112864619Y-95717142D01*
X112864619Y-95620380D01*
X112816238Y-95475237D01*
X112719476Y-95378475D01*
X112622714Y-95330094D01*
X112429190Y-95281713D01*
X112284047Y-95281713D01*
X112090523Y-95330094D01*
X111993761Y-95378475D01*
X111897000Y-95475237D01*
X111848619Y-95620380D01*
X111848619Y-95717142D01*
X111897000Y-95862285D01*
X111945380Y-95910666D01*
X112864619Y-96878285D02*
X112864619Y-96297713D01*
X112864619Y-96587999D02*
X111848619Y-96587999D01*
X111993761Y-96491237D01*
X112090523Y-96394475D01*
X112138904Y-96297713D01*
X111848619Y-97507237D02*
X111848619Y-97603999D01*
X111897000Y-97700761D01*
X111945380Y-97749142D01*
X112042142Y-97797523D01*
X112235666Y-97845904D01*
X112477571Y-97845904D01*
X112671095Y-97797523D01*
X112767857Y-97749142D01*
X112816238Y-97700761D01*
X112864619Y-97603999D01*
X112864619Y-97507237D01*
X112816238Y-97410475D01*
X112767857Y-97362094D01*
X112671095Y-97313713D01*
X112477571Y-97265332D01*
X112235666Y-97265332D01*
X112042142Y-97313713D01*
X111945380Y-97362094D01*
X111897000Y-97410475D01*
X111848619Y-97507237D01*
X111414619Y-95862285D02*
X111414619Y-95281713D01*
X111414619Y-95571999D02*
X110398619Y-95571999D01*
X110543761Y-95475237D01*
X110640523Y-95378475D01*
X110688904Y-95281713D01*
X110398619Y-96491237D02*
X110398619Y-96587999D01*
X110447000Y-96684761D01*
X110495380Y-96733142D01*
X110592142Y-96781523D01*
X110785666Y-96829904D01*
X111027571Y-96829904D01*
X111221095Y-96781523D01*
X111317857Y-96733142D01*
X111366238Y-96684761D01*
X111414619Y-96587999D01*
X111414619Y-96491237D01*
X111366238Y-96394475D01*
X111317857Y-96346094D01*
X111221095Y-96297713D01*
X111027571Y-96249332D01*
X110785666Y-96249332D01*
X110592142Y-96297713D01*
X110495380Y-96346094D01*
X110447000Y-96394475D01*
X110398619Y-96491237D01*
X110398619Y-97458856D02*
X110398619Y-97555618D01*
X110447000Y-97652380D01*
X110495380Y-97700761D01*
X110592142Y-97749142D01*
X110785666Y-97797523D01*
X111027571Y-97797523D01*
X111221095Y-97749142D01*
X111317857Y-97700761D01*
X111366238Y-97652380D01*
X111414619Y-97555618D01*
X111414619Y-97458856D01*
X111366238Y-97362094D01*
X111317857Y-97313713D01*
X111221095Y-97265332D01*
X111027571Y-97216951D01*
X110785666Y-97216951D01*
X110592142Y-97265332D01*
X110495380Y-97313713D01*
X110447000Y-97362094D01*
X110398619Y-97458856D01*
X110737285Y-98232951D02*
X111414619Y-98232951D01*
X110834047Y-98232951D02*
X110785666Y-98281332D01*
X110737285Y-98378094D01*
X110737285Y-98523237D01*
X110785666Y-98619999D01*
X110882428Y-98668380D01*
X111414619Y-98668380D01*
X110882428Y-99490856D02*
X110882428Y-99152189D01*
X111414619Y-99152189D02*
X110398619Y-99152189D01*
X110398619Y-99635999D01*
X119932857Y-72751857D02*
X119981238Y-72703476D01*
X120029619Y-72558333D01*
X120029619Y-72461571D01*
X119981238Y-72316428D01*
X119884476Y-72219666D01*
X119787714Y-72171285D01*
X119594190Y-72122904D01*
X119449047Y-72122904D01*
X119255523Y-72171285D01*
X119158761Y-72219666D01*
X119062000Y-72316428D01*
X119013619Y-72461571D01*
X119013619Y-72558333D01*
X119062000Y-72703476D01*
X119110380Y-72751857D01*
X120029619Y-73719476D02*
X120029619Y-73138904D01*
X120029619Y-73429190D02*
X119013619Y-73429190D01*
X119158761Y-73332428D01*
X119255523Y-73235666D01*
X119303904Y-73138904D01*
X120029619Y-74687095D02*
X120029619Y-74106523D01*
X120029619Y-74396809D02*
X119013619Y-74396809D01*
X119158761Y-74300047D01*
X119255523Y-74203285D01*
X119303904Y-74106523D01*
X118509619Y-70962619D02*
X118509619Y-70382047D01*
X118509619Y-70672333D02*
X117493619Y-70672333D01*
X117638761Y-70575571D01*
X117735523Y-70478809D01*
X117783904Y-70382047D01*
X117493619Y-71591571D02*
X117493619Y-71688333D01*
X117542000Y-71785095D01*
X117590380Y-71833476D01*
X117687142Y-71881857D01*
X117880666Y-71930238D01*
X118122571Y-71930238D01*
X118316095Y-71881857D01*
X118412857Y-71833476D01*
X118461238Y-71785095D01*
X118509619Y-71688333D01*
X118509619Y-71591571D01*
X118461238Y-71494809D01*
X118412857Y-71446428D01*
X118316095Y-71398047D01*
X118122571Y-71349666D01*
X117880666Y-71349666D01*
X117687142Y-71398047D01*
X117590380Y-71446428D01*
X117542000Y-71494809D01*
X117493619Y-71591571D01*
X117493619Y-72559190D02*
X117493619Y-72655952D01*
X117542000Y-72752714D01*
X117590380Y-72801095D01*
X117687142Y-72849476D01*
X117880666Y-72897857D01*
X118122571Y-72897857D01*
X118316095Y-72849476D01*
X118412857Y-72801095D01*
X118461238Y-72752714D01*
X118509619Y-72655952D01*
X118509619Y-72559190D01*
X118461238Y-72462428D01*
X118412857Y-72414047D01*
X118316095Y-72365666D01*
X118122571Y-72317285D01*
X117880666Y-72317285D01*
X117687142Y-72365666D01*
X117590380Y-72414047D01*
X117542000Y-72462428D01*
X117493619Y-72559190D01*
X117832285Y-73333285D02*
X118509619Y-73333285D01*
X117929047Y-73333285D02*
X117880666Y-73381666D01*
X117832285Y-73478428D01*
X117832285Y-73623571D01*
X117880666Y-73720333D01*
X117977428Y-73768714D01*
X118509619Y-73768714D01*
X117977428Y-74591190D02*
X117977428Y-74252523D01*
X118509619Y-74252523D02*
X117493619Y-74252523D01*
X117493619Y-74736333D01*
X123302857Y-72876857D02*
X123351238Y-72828476D01*
X123399619Y-72683333D01*
X123399619Y-72586571D01*
X123351238Y-72441428D01*
X123254476Y-72344666D01*
X123157714Y-72296285D01*
X122964190Y-72247904D01*
X122819047Y-72247904D01*
X122625523Y-72296285D01*
X122528761Y-72344666D01*
X122432000Y-72441428D01*
X122383619Y-72586571D01*
X122383619Y-72683333D01*
X122432000Y-72828476D01*
X122480380Y-72876857D01*
X123399619Y-73844476D02*
X123399619Y-73263904D01*
X123399619Y-73554190D02*
X122383619Y-73554190D01*
X122528761Y-73457428D01*
X122625523Y-73360666D01*
X122673904Y-73263904D01*
X122480380Y-74231523D02*
X122432000Y-74279904D01*
X122383619Y-74376666D01*
X122383619Y-74618571D01*
X122432000Y-74715333D01*
X122480380Y-74763714D01*
X122577142Y-74812095D01*
X122673904Y-74812095D01*
X122819047Y-74763714D01*
X123399619Y-74183142D01*
X123399619Y-74812095D01*
X121989619Y-71017619D02*
X121989619Y-70437047D01*
X121989619Y-70727333D02*
X120973619Y-70727333D01*
X121118761Y-70630571D01*
X121215523Y-70533809D01*
X121263904Y-70437047D01*
X120973619Y-71646571D02*
X120973619Y-71743333D01*
X121022000Y-71840095D01*
X121070380Y-71888476D01*
X121167142Y-71936857D01*
X121360666Y-71985238D01*
X121602571Y-71985238D01*
X121796095Y-71936857D01*
X121892857Y-71888476D01*
X121941238Y-71840095D01*
X121989619Y-71743333D01*
X121989619Y-71646571D01*
X121941238Y-71549809D01*
X121892857Y-71501428D01*
X121796095Y-71453047D01*
X121602571Y-71404666D01*
X121360666Y-71404666D01*
X121167142Y-71453047D01*
X121070380Y-71501428D01*
X121022000Y-71549809D01*
X120973619Y-71646571D01*
X120973619Y-72614190D02*
X120973619Y-72710952D01*
X121022000Y-72807714D01*
X121070380Y-72856095D01*
X121167142Y-72904476D01*
X121360666Y-72952857D01*
X121602571Y-72952857D01*
X121796095Y-72904476D01*
X121892857Y-72856095D01*
X121941238Y-72807714D01*
X121989619Y-72710952D01*
X121989619Y-72614190D01*
X121941238Y-72517428D01*
X121892857Y-72469047D01*
X121796095Y-72420666D01*
X121602571Y-72372285D01*
X121360666Y-72372285D01*
X121167142Y-72420666D01*
X121070380Y-72469047D01*
X121022000Y-72517428D01*
X120973619Y-72614190D01*
X121312285Y-73388285D02*
X121989619Y-73388285D01*
X121409047Y-73388285D02*
X121360666Y-73436666D01*
X121312285Y-73533428D01*
X121312285Y-73678571D01*
X121360666Y-73775333D01*
X121457428Y-73823714D01*
X121989619Y-73823714D01*
X121457428Y-74646190D02*
X121457428Y-74307523D01*
X121989619Y-74307523D02*
X120973619Y-74307523D01*
X120973619Y-74791333D01*
X142495714Y-74395714D02*
X142533809Y-74357619D01*
X142571904Y-74243333D01*
X142571904Y-74167142D01*
X142533809Y-74052857D01*
X142457619Y-73976666D01*
X142381428Y-73938571D01*
X142229047Y-73900476D01*
X142114761Y-73900476D01*
X141962380Y-73938571D01*
X141886190Y-73976666D01*
X141810000Y-74052857D01*
X141771904Y-74167142D01*
X141771904Y-74243333D01*
X141810000Y-74357619D01*
X141848095Y-74395714D01*
X141848095Y-74700476D02*
X141810000Y-74738571D01*
X141771904Y-74814761D01*
X141771904Y-75005238D01*
X141810000Y-75081428D01*
X141848095Y-75119523D01*
X141924285Y-75157619D01*
X142000476Y-75157619D01*
X142114761Y-75119523D01*
X142571904Y-74662380D01*
X142571904Y-75157619D01*
X141771904Y-75652857D02*
X141771904Y-75729047D01*
X141810000Y-75805238D01*
X141848095Y-75843333D01*
X141924285Y-75881428D01*
X142076666Y-75919523D01*
X142267142Y-75919523D01*
X142419523Y-75881428D01*
X142495714Y-75843333D01*
X142533809Y-75805238D01*
X142571904Y-75729047D01*
X142571904Y-75652857D01*
X142533809Y-75576666D01*
X142495714Y-75538571D01*
X142419523Y-75500476D01*
X142267142Y-75462380D01*
X142076666Y-75462380D01*
X141924285Y-75500476D01*
X141848095Y-75538571D01*
X141810000Y-75576666D01*
X141771904Y-75652857D01*
X146691904Y-74312857D02*
X146691904Y-73855714D01*
X146691904Y-74084285D02*
X145891904Y-74084285D01*
X146006190Y-74008095D01*
X146082380Y-73931904D01*
X146120476Y-73855714D01*
X145891904Y-74808095D02*
X145891904Y-74884285D01*
X145930000Y-74960476D01*
X145968095Y-74998571D01*
X146044285Y-75036666D01*
X146196666Y-75074761D01*
X146387142Y-75074761D01*
X146539523Y-75036666D01*
X146615714Y-74998571D01*
X146653809Y-74960476D01*
X146691904Y-74884285D01*
X146691904Y-74808095D01*
X146653809Y-74731904D01*
X146615714Y-74693809D01*
X146539523Y-74655714D01*
X146387142Y-74617619D01*
X146196666Y-74617619D01*
X146044285Y-74655714D01*
X145968095Y-74693809D01*
X145930000Y-74731904D01*
X145891904Y-74808095D01*
X146158571Y-75760476D02*
X146691904Y-75760476D01*
X146158571Y-75417619D02*
X146577619Y-75417619D01*
X146653809Y-75455714D01*
X146691904Y-75531904D01*
X146691904Y-75646190D01*
X146653809Y-75722380D01*
X146615714Y-75760476D01*
X146272857Y-76408095D02*
X146272857Y-76141428D01*
X146691904Y-76141428D02*
X145891904Y-76141428D01*
X145891904Y-76522380D01*
X165615060Y-52440000D02*
X165234108Y-52173334D01*
X165615060Y-51982857D02*
X164815060Y-51982857D01*
X164815060Y-52287619D01*
X164853156Y-52363810D01*
X164891251Y-52401905D01*
X164967441Y-52440000D01*
X165081727Y-52440000D01*
X165157917Y-52401905D01*
X165196013Y-52363810D01*
X165234108Y-52287619D01*
X165234108Y-51982857D01*
X164891251Y-52744762D02*
X164853156Y-52782857D01*
X164815060Y-52859048D01*
X164815060Y-53049524D01*
X164853156Y-53125714D01*
X164891251Y-53163810D01*
X164967441Y-53201905D01*
X165043632Y-53201905D01*
X165157917Y-53163810D01*
X165615060Y-52706667D01*
X165615060Y-53201905D01*
X166880849Y-50763809D02*
X166880849Y-50306666D01*
X166880849Y-50535238D02*
X166080849Y-50535238D01*
X166195135Y-50459047D01*
X166271325Y-50382857D01*
X166309421Y-50306666D01*
X166080849Y-51259047D02*
X166080849Y-51335238D01*
X166118945Y-51411428D01*
X166157040Y-51449524D01*
X166233230Y-51487619D01*
X166385611Y-51525714D01*
X166576087Y-51525714D01*
X166728468Y-51487619D01*
X166804659Y-51449524D01*
X166842754Y-51411428D01*
X166880849Y-51335238D01*
X166880849Y-51259047D01*
X166842754Y-51182857D01*
X166804659Y-51144762D01*
X166728468Y-51106666D01*
X166576087Y-51068571D01*
X166385611Y-51068571D01*
X166233230Y-51106666D01*
X166157040Y-51144762D01*
X166118945Y-51182857D01*
X166080849Y-51259047D01*
X166080849Y-52020952D02*
X166080849Y-52097143D01*
X166118945Y-52173333D01*
X166157040Y-52211428D01*
X166233230Y-52249524D01*
X166385611Y-52287619D01*
X166576087Y-52287619D01*
X166728468Y-52249524D01*
X166804659Y-52211428D01*
X166842754Y-52173333D01*
X166880849Y-52097143D01*
X166880849Y-52020952D01*
X166842754Y-51944762D01*
X166804659Y-51906666D01*
X166728468Y-51868571D01*
X166576087Y-51830476D01*
X166385611Y-51830476D01*
X166233230Y-51868571D01*
X166157040Y-51906666D01*
X166118945Y-51944762D01*
X166080849Y-52020952D01*
X166880849Y-52592381D02*
X166880849Y-52782857D01*
X166728468Y-52782857D01*
X166690373Y-52706666D01*
X166614183Y-52630476D01*
X166499897Y-52592381D01*
X166309421Y-52592381D01*
X166195135Y-52630476D01*
X166118945Y-52706666D01*
X166080849Y-52820952D01*
X166080849Y-52973333D01*
X166118945Y-53087619D01*
X166195135Y-53163809D01*
X166309421Y-53201905D01*
X166499897Y-53201905D01*
X166614183Y-53163809D01*
X166690373Y-53087619D01*
X166728468Y-53011428D01*
X166880849Y-53011428D01*
X166880849Y-53201905D01*
X170678216Y-52440000D02*
X170297264Y-52173334D01*
X170678216Y-51982857D02*
X169878216Y-51982857D01*
X169878216Y-52287619D01*
X169916312Y-52363810D01*
X169954407Y-52401905D01*
X170030597Y-52440000D01*
X170144883Y-52440000D01*
X170221073Y-52401905D01*
X170259169Y-52363810D01*
X170297264Y-52287619D01*
X170297264Y-51982857D01*
X169878216Y-52706667D02*
X169878216Y-53201905D01*
X170182978Y-52935238D01*
X170182978Y-53049524D01*
X170221073Y-53125714D01*
X170259169Y-53163810D01*
X170335359Y-53201905D01*
X170525835Y-53201905D01*
X170602026Y-53163810D01*
X170640121Y-53125714D01*
X170678216Y-53049524D01*
X170678216Y-52820953D01*
X170640121Y-52744762D01*
X170602026Y-52706667D01*
X171944005Y-50763809D02*
X171944005Y-50306666D01*
X171944005Y-50535238D02*
X171144005Y-50535238D01*
X171258291Y-50459047D01*
X171334481Y-50382857D01*
X171372577Y-50306666D01*
X171144005Y-51259047D02*
X171144005Y-51335238D01*
X171182101Y-51411428D01*
X171220196Y-51449524D01*
X171296386Y-51487619D01*
X171448767Y-51525714D01*
X171639243Y-51525714D01*
X171791624Y-51487619D01*
X171867815Y-51449524D01*
X171905910Y-51411428D01*
X171944005Y-51335238D01*
X171944005Y-51259047D01*
X171905910Y-51182857D01*
X171867815Y-51144762D01*
X171791624Y-51106666D01*
X171639243Y-51068571D01*
X171448767Y-51068571D01*
X171296386Y-51106666D01*
X171220196Y-51144762D01*
X171182101Y-51182857D01*
X171144005Y-51259047D01*
X171144005Y-52020952D02*
X171144005Y-52097143D01*
X171182101Y-52173333D01*
X171220196Y-52211428D01*
X171296386Y-52249524D01*
X171448767Y-52287619D01*
X171639243Y-52287619D01*
X171791624Y-52249524D01*
X171867815Y-52211428D01*
X171905910Y-52173333D01*
X171944005Y-52097143D01*
X171944005Y-52020952D01*
X171905910Y-51944762D01*
X171867815Y-51906666D01*
X171791624Y-51868571D01*
X171639243Y-51830476D01*
X171448767Y-51830476D01*
X171296386Y-51868571D01*
X171220196Y-51906666D01*
X171182101Y-51944762D01*
X171144005Y-52020952D01*
X171944005Y-52592381D02*
X171944005Y-52782857D01*
X171791624Y-52782857D01*
X171753529Y-52706666D01*
X171677339Y-52630476D01*
X171563053Y-52592381D01*
X171372577Y-52592381D01*
X171258291Y-52630476D01*
X171182101Y-52706666D01*
X171144005Y-52820952D01*
X171144005Y-52973333D01*
X171182101Y-53087619D01*
X171258291Y-53163809D01*
X171372577Y-53201905D01*
X171563053Y-53201905D01*
X171677339Y-53163809D01*
X171753529Y-53087619D01*
X171791624Y-53011428D01*
X171944005Y-53011428D01*
X171944005Y-53201905D01*
X180804528Y-52440000D02*
X180423576Y-52173334D01*
X180804528Y-51982857D02*
X180004528Y-51982857D01*
X180004528Y-52287619D01*
X180042624Y-52363810D01*
X180080719Y-52401905D01*
X180156909Y-52440000D01*
X180271195Y-52440000D01*
X180347385Y-52401905D01*
X180385481Y-52363810D01*
X180423576Y-52287619D01*
X180423576Y-51982857D01*
X180271195Y-53125714D02*
X180804528Y-53125714D01*
X179966433Y-52935238D02*
X180537862Y-52744762D01*
X180537862Y-53240000D01*
X182070317Y-50763809D02*
X182070317Y-50306666D01*
X182070317Y-50535238D02*
X181270317Y-50535238D01*
X181384603Y-50459047D01*
X181460793Y-50382857D01*
X181498889Y-50306666D01*
X181270317Y-51259047D02*
X181270317Y-51335238D01*
X181308413Y-51411428D01*
X181346508Y-51449524D01*
X181422698Y-51487619D01*
X181575079Y-51525714D01*
X181765555Y-51525714D01*
X181917936Y-51487619D01*
X181994127Y-51449524D01*
X182032222Y-51411428D01*
X182070317Y-51335238D01*
X182070317Y-51259047D01*
X182032222Y-51182857D01*
X181994127Y-51144762D01*
X181917936Y-51106666D01*
X181765555Y-51068571D01*
X181575079Y-51068571D01*
X181422698Y-51106666D01*
X181346508Y-51144762D01*
X181308413Y-51182857D01*
X181270317Y-51259047D01*
X181270317Y-52020952D02*
X181270317Y-52097143D01*
X181308413Y-52173333D01*
X181346508Y-52211428D01*
X181422698Y-52249524D01*
X181575079Y-52287619D01*
X181765555Y-52287619D01*
X181917936Y-52249524D01*
X181994127Y-52211428D01*
X182032222Y-52173333D01*
X182070317Y-52097143D01*
X182070317Y-52020952D01*
X182032222Y-51944762D01*
X181994127Y-51906666D01*
X181917936Y-51868571D01*
X181765555Y-51830476D01*
X181575079Y-51830476D01*
X181422698Y-51868571D01*
X181346508Y-51906666D01*
X181308413Y-51944762D01*
X181270317Y-52020952D01*
X182070317Y-52592381D02*
X182070317Y-52782857D01*
X181917936Y-52782857D01*
X181879841Y-52706666D01*
X181803651Y-52630476D01*
X181689365Y-52592381D01*
X181498889Y-52592381D01*
X181384603Y-52630476D01*
X181308413Y-52706666D01*
X181270317Y-52820952D01*
X181270317Y-52973333D01*
X181308413Y-53087619D01*
X181384603Y-53163809D01*
X181498889Y-53201905D01*
X181689365Y-53201905D01*
X181803651Y-53163809D01*
X181879841Y-53087619D01*
X181917936Y-53011428D01*
X182070317Y-53011428D01*
X182070317Y-53201905D01*
X109359619Y-95910666D02*
X108875809Y-95572000D01*
X109359619Y-95330095D02*
X108343619Y-95330095D01*
X108343619Y-95717142D01*
X108392000Y-95813904D01*
X108440380Y-95862285D01*
X108537142Y-95910666D01*
X108682285Y-95910666D01*
X108779047Y-95862285D01*
X108827428Y-95813904D01*
X108875809Y-95717142D01*
X108875809Y-95330095D01*
X108343619Y-96829904D02*
X108343619Y-96346095D01*
X108827428Y-96297714D01*
X108779047Y-96346095D01*
X108730666Y-96442857D01*
X108730666Y-96684761D01*
X108779047Y-96781523D01*
X108827428Y-96829904D01*
X108924190Y-96878285D01*
X109166095Y-96878285D01*
X109262857Y-96829904D01*
X109311238Y-96781523D01*
X109359619Y-96684761D01*
X109359619Y-96442857D01*
X109311238Y-96346095D01*
X109262857Y-96297714D01*
X107919619Y-95862285D02*
X107919619Y-95281713D01*
X107919619Y-95571999D02*
X106903619Y-95571999D01*
X107048761Y-95475237D01*
X107145523Y-95378475D01*
X107193904Y-95281713D01*
X106903619Y-96491237D02*
X106903619Y-96587999D01*
X106952000Y-96684761D01*
X107000380Y-96733142D01*
X107097142Y-96781523D01*
X107290666Y-96829904D01*
X107532571Y-96829904D01*
X107726095Y-96781523D01*
X107822857Y-96733142D01*
X107871238Y-96684761D01*
X107919619Y-96587999D01*
X107919619Y-96491237D01*
X107871238Y-96394475D01*
X107822857Y-96346094D01*
X107726095Y-96297713D01*
X107532571Y-96249332D01*
X107290666Y-96249332D01*
X107097142Y-96297713D01*
X107000380Y-96346094D01*
X106952000Y-96394475D01*
X106903619Y-96491237D01*
X106903619Y-97458856D02*
X106903619Y-97555618D01*
X106952000Y-97652380D01*
X107000380Y-97700761D01*
X107097142Y-97749142D01*
X107290666Y-97797523D01*
X107532571Y-97797523D01*
X107726095Y-97749142D01*
X107822857Y-97700761D01*
X107871238Y-97652380D01*
X107919619Y-97555618D01*
X107919619Y-97458856D01*
X107871238Y-97362094D01*
X107822857Y-97313713D01*
X107726095Y-97265332D01*
X107532571Y-97216951D01*
X107290666Y-97216951D01*
X107097142Y-97265332D01*
X107000380Y-97313713D01*
X106952000Y-97362094D01*
X106903619Y-97458856D01*
X107919619Y-98184570D02*
X107919619Y-98426475D01*
X107726095Y-98426475D01*
X107677714Y-98329713D01*
X107580952Y-98232951D01*
X107435809Y-98184570D01*
X107193904Y-98184570D01*
X107048761Y-98232951D01*
X106952000Y-98329713D01*
X106903619Y-98474856D01*
X106903619Y-98668380D01*
X106952000Y-98813523D01*
X107048761Y-98910285D01*
X107193904Y-98958666D01*
X107435809Y-98958666D01*
X107580952Y-98910285D01*
X107677714Y-98813523D01*
X107726095Y-98716761D01*
X107919619Y-98716761D01*
X107919619Y-98958666D01*
X115994619Y-95910666D02*
X115510809Y-95572000D01*
X115994619Y-95330095D02*
X114978619Y-95330095D01*
X114978619Y-95717142D01*
X115027000Y-95813904D01*
X115075380Y-95862285D01*
X115172142Y-95910666D01*
X115317285Y-95910666D01*
X115414047Y-95862285D01*
X115462428Y-95813904D01*
X115510809Y-95717142D01*
X115510809Y-95330095D01*
X114978619Y-96781523D02*
X114978619Y-96588000D01*
X115027000Y-96491238D01*
X115075380Y-96442857D01*
X115220523Y-96346095D01*
X115414047Y-96297714D01*
X115801095Y-96297714D01*
X115897857Y-96346095D01*
X115946238Y-96394476D01*
X115994619Y-96491238D01*
X115994619Y-96684761D01*
X115946238Y-96781523D01*
X115897857Y-96829904D01*
X115801095Y-96878285D01*
X115559190Y-96878285D01*
X115462428Y-96829904D01*
X115414047Y-96781523D01*
X115365666Y-96684761D01*
X115365666Y-96491238D01*
X115414047Y-96394476D01*
X115462428Y-96346095D01*
X115559190Y-96297714D01*
X114614619Y-95862285D02*
X114614619Y-95281713D01*
X114614619Y-95571999D02*
X113598619Y-95571999D01*
X113743761Y-95475237D01*
X113840523Y-95378475D01*
X113888904Y-95281713D01*
X113598619Y-96491237D02*
X113598619Y-96587999D01*
X113647000Y-96684761D01*
X113695380Y-96733142D01*
X113792142Y-96781523D01*
X113985666Y-96829904D01*
X114227571Y-96829904D01*
X114421095Y-96781523D01*
X114517857Y-96733142D01*
X114566238Y-96684761D01*
X114614619Y-96587999D01*
X114614619Y-96491237D01*
X114566238Y-96394475D01*
X114517857Y-96346094D01*
X114421095Y-96297713D01*
X114227571Y-96249332D01*
X113985666Y-96249332D01*
X113792142Y-96297713D01*
X113695380Y-96346094D01*
X113647000Y-96394475D01*
X113598619Y-96491237D01*
X113598619Y-97458856D02*
X113598619Y-97555618D01*
X113647000Y-97652380D01*
X113695380Y-97700761D01*
X113792142Y-97749142D01*
X113985666Y-97797523D01*
X114227571Y-97797523D01*
X114421095Y-97749142D01*
X114517857Y-97700761D01*
X114566238Y-97652380D01*
X114614619Y-97555618D01*
X114614619Y-97458856D01*
X114566238Y-97362094D01*
X114517857Y-97313713D01*
X114421095Y-97265332D01*
X114227571Y-97216951D01*
X113985666Y-97216951D01*
X113792142Y-97265332D01*
X113695380Y-97313713D01*
X113647000Y-97362094D01*
X113598619Y-97458856D01*
X114614619Y-98184570D02*
X114614619Y-98426475D01*
X114421095Y-98426475D01*
X114372714Y-98329713D01*
X114275952Y-98232951D01*
X114130809Y-98184570D01*
X113888904Y-98184570D01*
X113743761Y-98232951D01*
X113647000Y-98329713D01*
X113598619Y-98474856D01*
X113598619Y-98668380D01*
X113647000Y-98813523D01*
X113743761Y-98910285D01*
X113888904Y-98958666D01*
X114130809Y-98958666D01*
X114275952Y-98910285D01*
X114372714Y-98813523D01*
X114421095Y-98716761D01*
X114614619Y-98716761D01*
X114614619Y-98958666D01*
X119964619Y-95910666D02*
X119480809Y-95572000D01*
X119964619Y-95330095D02*
X118948619Y-95330095D01*
X118948619Y-95717142D01*
X118997000Y-95813904D01*
X119045380Y-95862285D01*
X119142142Y-95910666D01*
X119287285Y-95910666D01*
X119384047Y-95862285D01*
X119432428Y-95813904D01*
X119480809Y-95717142D01*
X119480809Y-95330095D01*
X118948619Y-96249333D02*
X118948619Y-96926666D01*
X119964619Y-96491238D01*
X118304619Y-95862285D02*
X118304619Y-95281713D01*
X118304619Y-95571999D02*
X117288619Y-95571999D01*
X117433761Y-95475237D01*
X117530523Y-95378475D01*
X117578904Y-95281713D01*
X117288619Y-96491237D02*
X117288619Y-96587999D01*
X117337000Y-96684761D01*
X117385380Y-96733142D01*
X117482142Y-96781523D01*
X117675666Y-96829904D01*
X117917571Y-96829904D01*
X118111095Y-96781523D01*
X118207857Y-96733142D01*
X118256238Y-96684761D01*
X118304619Y-96587999D01*
X118304619Y-96491237D01*
X118256238Y-96394475D01*
X118207857Y-96346094D01*
X118111095Y-96297713D01*
X117917571Y-96249332D01*
X117675666Y-96249332D01*
X117482142Y-96297713D01*
X117385380Y-96346094D01*
X117337000Y-96394475D01*
X117288619Y-96491237D01*
X117288619Y-97458856D02*
X117288619Y-97555618D01*
X117337000Y-97652380D01*
X117385380Y-97700761D01*
X117482142Y-97749142D01*
X117675666Y-97797523D01*
X117917571Y-97797523D01*
X118111095Y-97749142D01*
X118207857Y-97700761D01*
X118256238Y-97652380D01*
X118304619Y-97555618D01*
X118304619Y-97458856D01*
X118256238Y-97362094D01*
X118207857Y-97313713D01*
X118111095Y-97265332D01*
X117917571Y-97216951D01*
X117675666Y-97216951D01*
X117482142Y-97265332D01*
X117385380Y-97313713D01*
X117337000Y-97362094D01*
X117288619Y-97458856D01*
X118304619Y-98184570D02*
X118304619Y-98426475D01*
X118111095Y-98426475D01*
X118062714Y-98329713D01*
X117965952Y-98232951D01*
X117820809Y-98184570D01*
X117578904Y-98184570D01*
X117433761Y-98232951D01*
X117337000Y-98329713D01*
X117288619Y-98474856D01*
X117288619Y-98668380D01*
X117337000Y-98813523D01*
X117433761Y-98910285D01*
X117578904Y-98958666D01*
X117820809Y-98958666D01*
X117965952Y-98910285D01*
X118062714Y-98813523D01*
X118111095Y-98716761D01*
X118304619Y-98716761D01*
X118304619Y-98958666D01*
X123734120Y-95910666D02*
X123250310Y-95572000D01*
X123734120Y-95330095D02*
X122718120Y-95330095D01*
X122718120Y-95717142D01*
X122766501Y-95813904D01*
X122814881Y-95862285D01*
X122911643Y-95910666D01*
X123056786Y-95910666D01*
X123153548Y-95862285D01*
X123201929Y-95813904D01*
X123250310Y-95717142D01*
X123250310Y-95330095D01*
X123153548Y-96491238D02*
X123105167Y-96394476D01*
X123056786Y-96346095D01*
X122960024Y-96297714D01*
X122911643Y-96297714D01*
X122814881Y-96346095D01*
X122766501Y-96394476D01*
X122718120Y-96491238D01*
X122718120Y-96684761D01*
X122766501Y-96781523D01*
X122814881Y-96829904D01*
X122911643Y-96878285D01*
X122960024Y-96878285D01*
X123056786Y-96829904D01*
X123105167Y-96781523D01*
X123153548Y-96684761D01*
X123153548Y-96491238D01*
X123201929Y-96394476D01*
X123250310Y-96346095D01*
X123347072Y-96297714D01*
X123540596Y-96297714D01*
X123637358Y-96346095D01*
X123685739Y-96394476D01*
X123734120Y-96491238D01*
X123734120Y-96684761D01*
X123685739Y-96781523D01*
X123637358Y-96829904D01*
X123540596Y-96878285D01*
X123347072Y-96878285D01*
X123250310Y-96829904D01*
X123201929Y-96781523D01*
X123153548Y-96684761D01*
X122454120Y-95862285D02*
X122454120Y-95281713D01*
X122454120Y-95571999D02*
X121438120Y-95571999D01*
X121583262Y-95475237D01*
X121680024Y-95378475D01*
X121728405Y-95281713D01*
X121438120Y-96491237D02*
X121438120Y-96587999D01*
X121486501Y-96684761D01*
X121534881Y-96733142D01*
X121631643Y-96781523D01*
X121825167Y-96829904D01*
X122067072Y-96829904D01*
X122260596Y-96781523D01*
X122357358Y-96733142D01*
X122405739Y-96684761D01*
X122454120Y-96587999D01*
X122454120Y-96491237D01*
X122405739Y-96394475D01*
X122357358Y-96346094D01*
X122260596Y-96297713D01*
X122067072Y-96249332D01*
X121825167Y-96249332D01*
X121631643Y-96297713D01*
X121534881Y-96346094D01*
X121486501Y-96394475D01*
X121438120Y-96491237D01*
X121438120Y-97458856D02*
X121438120Y-97555618D01*
X121486501Y-97652380D01*
X121534881Y-97700761D01*
X121631643Y-97749142D01*
X121825167Y-97797523D01*
X122067072Y-97797523D01*
X122260596Y-97749142D01*
X122357358Y-97700761D01*
X122405739Y-97652380D01*
X122454120Y-97555618D01*
X122454120Y-97458856D01*
X122405739Y-97362094D01*
X122357358Y-97313713D01*
X122260596Y-97265332D01*
X122067072Y-97216951D01*
X121825167Y-97216951D01*
X121631643Y-97265332D01*
X121534881Y-97313713D01*
X121486501Y-97362094D01*
X121438120Y-97458856D01*
X122454120Y-98184570D02*
X122454120Y-98426475D01*
X122260596Y-98426475D01*
X122212215Y-98329713D01*
X122115453Y-98232951D01*
X121970310Y-98184570D01*
X121728405Y-98184570D01*
X121583262Y-98232951D01*
X121486501Y-98329713D01*
X121438120Y-98474856D01*
X121438120Y-98668380D01*
X121486501Y-98813523D01*
X121583262Y-98910285D01*
X121728405Y-98958666D01*
X121970310Y-98958666D01*
X122115453Y-98910285D01*
X122212215Y-98813523D01*
X122260596Y-98716761D01*
X122454120Y-98716761D01*
X122454120Y-98958666D01*
X106004120Y-95910666D02*
X105520310Y-95572000D01*
X106004120Y-95330095D02*
X104988120Y-95330095D01*
X104988120Y-95717142D01*
X105036501Y-95813904D01*
X105084881Y-95862285D01*
X105181643Y-95910666D01*
X105326786Y-95910666D01*
X105423548Y-95862285D01*
X105471929Y-95813904D01*
X105520310Y-95717142D01*
X105520310Y-95330095D01*
X106004120Y-96394476D02*
X106004120Y-96588000D01*
X105955739Y-96684761D01*
X105907358Y-96733142D01*
X105762215Y-96829904D01*
X105568691Y-96878285D01*
X105181643Y-96878285D01*
X105084881Y-96829904D01*
X105036501Y-96781523D01*
X104988120Y-96684761D01*
X104988120Y-96491238D01*
X105036501Y-96394476D01*
X105084881Y-96346095D01*
X105181643Y-96297714D01*
X105423548Y-96297714D01*
X105520310Y-96346095D01*
X105568691Y-96394476D01*
X105617072Y-96491238D01*
X105617072Y-96684761D01*
X105568691Y-96781523D01*
X105520310Y-96829904D01*
X105423548Y-96878285D01*
X104644120Y-95862285D02*
X104644120Y-95281714D01*
X104644120Y-95571999D02*
X103628120Y-95571999D01*
X103773262Y-95475238D01*
X103870024Y-95378476D01*
X103918405Y-95281714D01*
X103628120Y-96491238D02*
X103628120Y-96587999D01*
X103676501Y-96684761D01*
X103724881Y-96733142D01*
X103821643Y-96781523D01*
X104015167Y-96829904D01*
X104257072Y-96829904D01*
X104450596Y-96781523D01*
X104547358Y-96733142D01*
X104595739Y-96684761D01*
X104644120Y-96587999D01*
X104644120Y-96491238D01*
X104595739Y-96394476D01*
X104547358Y-96346095D01*
X104450596Y-96297714D01*
X104257072Y-96249333D01*
X104015167Y-96249333D01*
X103821643Y-96297714D01*
X103724881Y-96346095D01*
X103676501Y-96394476D01*
X103628120Y-96491238D01*
X104644120Y-97265333D02*
X103628120Y-97265333D01*
X104257072Y-97362095D02*
X104644120Y-97652380D01*
X103966786Y-97652380D02*
X104353834Y-97265333D01*
X104644120Y-98039428D02*
X104644120Y-98281333D01*
X104450596Y-98281333D01*
X104402215Y-98184571D01*
X104305453Y-98087809D01*
X104160310Y-98039428D01*
X103918405Y-98039428D01*
X103773262Y-98087809D01*
X103676501Y-98184571D01*
X103628120Y-98329714D01*
X103628120Y-98523238D01*
X103676501Y-98668380D01*
X103773262Y-98765142D01*
X103918405Y-98813523D01*
X104160310Y-98813523D01*
X104305453Y-98765142D01*
X104402215Y-98668380D01*
X104450596Y-98571619D01*
X104644120Y-98571619D01*
X104644120Y-98813523D01*
X113379619Y-72536857D02*
X112895809Y-72198190D01*
X113379619Y-71956285D02*
X112363619Y-71956285D01*
X112363619Y-72343333D01*
X112412000Y-72440095D01*
X112460380Y-72488476D01*
X112557142Y-72536857D01*
X112702285Y-72536857D01*
X112799047Y-72488476D01*
X112847428Y-72440095D01*
X112895809Y-72343333D01*
X112895809Y-71956285D01*
X113379619Y-73504476D02*
X113379619Y-72923904D01*
X113379619Y-73214190D02*
X112363619Y-73214190D01*
X112508761Y-73117428D01*
X112605523Y-73020666D01*
X112653904Y-72923904D01*
X112363619Y-74133428D02*
X112363619Y-74230190D01*
X112412000Y-74326952D01*
X112460380Y-74375333D01*
X112557142Y-74423714D01*
X112750666Y-74472095D01*
X112992571Y-74472095D01*
X113186095Y-74423714D01*
X113282857Y-74375333D01*
X113331238Y-74326952D01*
X113379619Y-74230190D01*
X113379619Y-74133428D01*
X113331238Y-74036666D01*
X113282857Y-73988285D01*
X113186095Y-73939904D01*
X112992571Y-73891523D01*
X112750666Y-73891523D01*
X112557142Y-73939904D01*
X112460380Y-73988285D01*
X112412000Y-74036666D01*
X112363619Y-74133428D01*
X111709619Y-71644666D02*
X111709619Y-71064095D01*
X111709619Y-71354380D02*
X110693619Y-71354380D01*
X110838761Y-71257619D01*
X110935523Y-71160857D01*
X110983904Y-71064095D01*
X110693619Y-72273619D02*
X110693619Y-72370380D01*
X110742000Y-72467142D01*
X110790380Y-72515523D01*
X110887142Y-72563904D01*
X111080666Y-72612285D01*
X111322571Y-72612285D01*
X111516095Y-72563904D01*
X111612857Y-72515523D01*
X111661238Y-72467142D01*
X111709619Y-72370380D01*
X111709619Y-72273619D01*
X111661238Y-72176857D01*
X111612857Y-72128476D01*
X111516095Y-72080095D01*
X111322571Y-72031714D01*
X111080666Y-72031714D01*
X110887142Y-72080095D01*
X110790380Y-72128476D01*
X110742000Y-72176857D01*
X110693619Y-72273619D01*
X111709619Y-73047714D02*
X110693619Y-73047714D01*
X111322571Y-73144476D02*
X111709619Y-73434761D01*
X111032285Y-73434761D02*
X111419333Y-73047714D01*
X111709619Y-73821809D02*
X111709619Y-74063714D01*
X111516095Y-74063714D01*
X111467714Y-73966952D01*
X111370952Y-73870190D01*
X111225809Y-73821809D01*
X110983904Y-73821809D01*
X110838761Y-73870190D01*
X110742000Y-73966952D01*
X110693619Y-74112095D01*
X110693619Y-74305619D01*
X110742000Y-74450761D01*
X110838761Y-74547523D01*
X110983904Y-74595904D01*
X111225809Y-74595904D01*
X111370952Y-74547523D01*
X111467714Y-74450761D01*
X111516095Y-74354000D01*
X111709619Y-74354000D01*
X111709619Y-74595904D01*
X116529619Y-72906857D02*
X116045809Y-72568190D01*
X116529619Y-72326285D02*
X115513619Y-72326285D01*
X115513619Y-72713333D01*
X115562000Y-72810095D01*
X115610380Y-72858476D01*
X115707142Y-72906857D01*
X115852285Y-72906857D01*
X115949047Y-72858476D01*
X115997428Y-72810095D01*
X116045809Y-72713333D01*
X116045809Y-72326285D01*
X116529619Y-73874476D02*
X116529619Y-73293904D01*
X116529619Y-73584190D02*
X115513619Y-73584190D01*
X115658761Y-73487428D01*
X115755523Y-73390666D01*
X115803904Y-73293904D01*
X116529619Y-74842095D02*
X116529619Y-74261523D01*
X116529619Y-74551809D02*
X115513619Y-74551809D01*
X115658761Y-74455047D01*
X115755523Y-74358285D01*
X115803904Y-74261523D01*
X115229619Y-71764666D02*
X115229619Y-71184095D01*
X115229619Y-71474380D02*
X114213619Y-71474380D01*
X114358761Y-71377619D01*
X114455523Y-71280857D01*
X114503904Y-71184095D01*
X114213619Y-72393619D02*
X114213619Y-72490380D01*
X114262000Y-72587142D01*
X114310380Y-72635523D01*
X114407142Y-72683904D01*
X114600666Y-72732285D01*
X114842571Y-72732285D01*
X115036095Y-72683904D01*
X115132857Y-72635523D01*
X115181238Y-72587142D01*
X115229619Y-72490380D01*
X115229619Y-72393619D01*
X115181238Y-72296857D01*
X115132857Y-72248476D01*
X115036095Y-72200095D01*
X114842571Y-72151714D01*
X114600666Y-72151714D01*
X114407142Y-72200095D01*
X114310380Y-72248476D01*
X114262000Y-72296857D01*
X114213619Y-72393619D01*
X115229619Y-73167714D02*
X114213619Y-73167714D01*
X114842571Y-73264476D02*
X115229619Y-73554761D01*
X114552285Y-73554761D02*
X114939333Y-73167714D01*
X115229619Y-73941809D02*
X115229619Y-74183714D01*
X115036095Y-74183714D01*
X114987714Y-74086952D01*
X114890952Y-73990190D01*
X114745809Y-73941809D01*
X114503904Y-73941809D01*
X114358761Y-73990190D01*
X114262000Y-74086952D01*
X114213619Y-74232095D01*
X114213619Y-74425619D01*
X114262000Y-74570761D01*
X114358761Y-74667523D01*
X114503904Y-74715904D01*
X114745809Y-74715904D01*
X114890952Y-74667523D01*
X114987714Y-74570761D01*
X115036095Y-74474000D01*
X115229619Y-74474000D01*
X115229619Y-74715904D01*
X126769619Y-72796857D02*
X126285809Y-72458190D01*
X126769619Y-72216285D02*
X125753619Y-72216285D01*
X125753619Y-72603333D01*
X125802000Y-72700095D01*
X125850380Y-72748476D01*
X125947142Y-72796857D01*
X126092285Y-72796857D01*
X126189047Y-72748476D01*
X126237428Y-72700095D01*
X126285809Y-72603333D01*
X126285809Y-72216285D01*
X126769619Y-73764476D02*
X126769619Y-73183904D01*
X126769619Y-73474190D02*
X125753619Y-73474190D01*
X125898761Y-73377428D01*
X125995523Y-73280666D01*
X126043904Y-73183904D01*
X125850380Y-74151523D02*
X125802000Y-74199904D01*
X125753619Y-74296666D01*
X125753619Y-74538571D01*
X125802000Y-74635333D01*
X125850380Y-74683714D01*
X125947142Y-74732095D01*
X126043904Y-74732095D01*
X126189047Y-74683714D01*
X126769619Y-74103142D01*
X126769619Y-74732095D01*
X125319619Y-71724666D02*
X125319619Y-71144095D01*
X125319619Y-71434380D02*
X124303619Y-71434380D01*
X124448761Y-71337619D01*
X124545523Y-71240857D01*
X124593904Y-71144095D01*
X124303619Y-72353619D02*
X124303619Y-72450380D01*
X124352000Y-72547142D01*
X124400380Y-72595523D01*
X124497142Y-72643904D01*
X124690666Y-72692285D01*
X124932571Y-72692285D01*
X125126095Y-72643904D01*
X125222857Y-72595523D01*
X125271238Y-72547142D01*
X125319619Y-72450380D01*
X125319619Y-72353619D01*
X125271238Y-72256857D01*
X125222857Y-72208476D01*
X125126095Y-72160095D01*
X124932571Y-72111714D01*
X124690666Y-72111714D01*
X124497142Y-72160095D01*
X124400380Y-72208476D01*
X124352000Y-72256857D01*
X124303619Y-72353619D01*
X125319619Y-73127714D02*
X124303619Y-73127714D01*
X124932571Y-73224476D02*
X125319619Y-73514761D01*
X124642285Y-73514761D02*
X125029333Y-73127714D01*
X125319619Y-73901809D02*
X125319619Y-74143714D01*
X125126095Y-74143714D01*
X125077714Y-74046952D01*
X124980952Y-73950190D01*
X124835809Y-73901809D01*
X124593904Y-73901809D01*
X124448761Y-73950190D01*
X124352000Y-74046952D01*
X124303619Y-74192095D01*
X124303619Y-74385619D01*
X124352000Y-74530761D01*
X124448761Y-74627523D01*
X124593904Y-74675904D01*
X124835809Y-74675904D01*
X124980952Y-74627523D01*
X125077714Y-74530761D01*
X125126095Y-74434000D01*
X125319619Y-74434000D01*
X125319619Y-74675904D01*
X175741372Y-51678095D02*
X175360420Y-51411428D01*
X175741372Y-51220952D02*
X174941372Y-51220952D01*
X174941372Y-51525714D01*
X174979468Y-51601904D01*
X175017563Y-51640000D01*
X175093753Y-51678095D01*
X175208039Y-51678095D01*
X175284229Y-51640000D01*
X175322325Y-51601904D01*
X175360420Y-51525714D01*
X175360420Y-51220952D01*
X175741372Y-52440000D02*
X175741372Y-51982857D01*
X175741372Y-52211428D02*
X174941372Y-52211428D01*
X175055658Y-52135238D01*
X175131848Y-52059047D01*
X175169944Y-51982857D01*
X174941372Y-53163809D02*
X174941372Y-52782857D01*
X175322325Y-52744761D01*
X175284229Y-52782857D01*
X175246134Y-52859047D01*
X175246134Y-53049523D01*
X175284229Y-53125714D01*
X175322325Y-53163809D01*
X175398515Y-53201904D01*
X175588991Y-53201904D01*
X175665182Y-53163809D01*
X175703277Y-53125714D01*
X175741372Y-53049523D01*
X175741372Y-52859047D01*
X175703277Y-52782857D01*
X175665182Y-52744761D01*
X177007161Y-50763809D02*
X177007161Y-50306666D01*
X177007161Y-50535238D02*
X176207161Y-50535238D01*
X176321447Y-50459047D01*
X176397637Y-50382857D01*
X176435733Y-50306666D01*
X176207161Y-51259047D02*
X176207161Y-51335238D01*
X176245257Y-51411428D01*
X176283352Y-51449524D01*
X176359542Y-51487619D01*
X176511923Y-51525714D01*
X176702399Y-51525714D01*
X176854780Y-51487619D01*
X176930971Y-51449524D01*
X176969066Y-51411428D01*
X177007161Y-51335238D01*
X177007161Y-51259047D01*
X176969066Y-51182857D01*
X176930971Y-51144762D01*
X176854780Y-51106666D01*
X176702399Y-51068571D01*
X176511923Y-51068571D01*
X176359542Y-51106666D01*
X176283352Y-51144762D01*
X176245257Y-51182857D01*
X176207161Y-51259047D01*
X176207161Y-52020952D02*
X176207161Y-52097143D01*
X176245257Y-52173333D01*
X176283352Y-52211428D01*
X176359542Y-52249524D01*
X176511923Y-52287619D01*
X176702399Y-52287619D01*
X176854780Y-52249524D01*
X176930971Y-52211428D01*
X176969066Y-52173333D01*
X177007161Y-52097143D01*
X177007161Y-52020952D01*
X176969066Y-51944762D01*
X176930971Y-51906666D01*
X176854780Y-51868571D01*
X176702399Y-51830476D01*
X176511923Y-51830476D01*
X176359542Y-51868571D01*
X176283352Y-51906666D01*
X176245257Y-51944762D01*
X176207161Y-52020952D01*
X177007161Y-52592381D02*
X177007161Y-52782857D01*
X176854780Y-52782857D01*
X176816685Y-52706666D01*
X176740495Y-52630476D01*
X176626209Y-52592381D01*
X176435733Y-52592381D01*
X176321447Y-52630476D01*
X176245257Y-52706666D01*
X176207161Y-52820952D01*
X176207161Y-52973333D01*
X176245257Y-53087619D01*
X176321447Y-53163809D01*
X176435733Y-53201905D01*
X176626209Y-53201905D01*
X176740495Y-53163809D01*
X176816685Y-53087619D01*
X176854780Y-53011428D01*
X177007161Y-53011428D01*
X177007161Y-53201905D01*
X149005714Y-74395714D02*
X149043809Y-74357619D01*
X149081904Y-74243333D01*
X149081904Y-74167142D01*
X149043809Y-74052857D01*
X148967619Y-73976666D01*
X148891428Y-73938571D01*
X148739047Y-73900476D01*
X148624761Y-73900476D01*
X148472380Y-73938571D01*
X148396190Y-73976666D01*
X148320000Y-74052857D01*
X148281904Y-74167142D01*
X148281904Y-74243333D01*
X148320000Y-74357619D01*
X148358095Y-74395714D01*
X149081904Y-75157619D02*
X149081904Y-74700476D01*
X149081904Y-74929047D02*
X148281904Y-74929047D01*
X148396190Y-74852857D01*
X148472380Y-74776666D01*
X148510476Y-74700476D01*
X148548571Y-75843333D02*
X149081904Y-75843333D01*
X148243809Y-75652857D02*
X148815238Y-75462380D01*
X148815238Y-75957619D01*
X152711904Y-73751904D02*
X152711904Y-73294761D01*
X152711904Y-73523333D02*
X151911904Y-73523333D01*
X152026190Y-73447142D01*
X152102380Y-73370952D01*
X152140476Y-73294761D01*
X151911904Y-74247142D02*
X151911904Y-74323333D01*
X151950000Y-74399523D01*
X151988095Y-74437619D01*
X152064285Y-74475714D01*
X152216666Y-74513809D01*
X152407142Y-74513809D01*
X152559523Y-74475714D01*
X152635714Y-74437619D01*
X152673809Y-74399523D01*
X152711904Y-74323333D01*
X152711904Y-74247142D01*
X152673809Y-74170952D01*
X152635714Y-74132857D01*
X152559523Y-74094761D01*
X152407142Y-74056666D01*
X152216666Y-74056666D01*
X152064285Y-74094761D01*
X151988095Y-74132857D01*
X151950000Y-74170952D01*
X151911904Y-74247142D01*
X151911904Y-75009047D02*
X151911904Y-75085238D01*
X151950000Y-75161428D01*
X151988095Y-75199523D01*
X152064285Y-75237619D01*
X152216666Y-75275714D01*
X152407142Y-75275714D01*
X152559523Y-75237619D01*
X152635714Y-75199523D01*
X152673809Y-75161428D01*
X152711904Y-75085238D01*
X152711904Y-75009047D01*
X152673809Y-74932857D01*
X152635714Y-74894761D01*
X152559523Y-74856666D01*
X152407142Y-74818571D01*
X152216666Y-74818571D01*
X152064285Y-74856666D01*
X151988095Y-74894761D01*
X151950000Y-74932857D01*
X151911904Y-75009047D01*
X152178571Y-75618571D02*
X152711904Y-75618571D01*
X152254761Y-75618571D02*
X152216666Y-75656666D01*
X152178571Y-75732857D01*
X152178571Y-75847142D01*
X152216666Y-75923333D01*
X152292857Y-75961428D01*
X152711904Y-75961428D01*
X152292857Y-76609047D02*
X152292857Y-76342380D01*
X152711904Y-76342380D02*
X151911904Y-76342380D01*
X151911904Y-76723333D01*
M02*
