(module TXS0102 (layer F.Cu) (tedit 5EC25BB0)
  (fp_text reference REF** (at 7.62 5.58) (layer F.SilkS)
    (effects (font (size 1 1) (thickness 0.15)))
  )
  (fp_text value TXS0102 (at 7.62 4.58) (layer F.Fab)
    (effects (font (size 1 1) (thickness 0.15)))
  )
  (fp_line (start 0 0) (end 15.24 0) (layer F.SilkS) (width 0.15))
  (fp_line (start 15.24 0) (end 15.24 13) (layer F.SilkS) (width 0.15))
  (fp_line (start 15.24 13) (end 0 13) (layer F.SilkS) (width 0.15))
  (fp_line (start 0 13) (end 0 0) (layer F.SilkS) (width 0.15))
  (pad 1 thru_hole custom (at 1.27 1.27) (size 2.54 1.524) (drill 0.7652) (layers *.Cu *.Mask)
    (zone_connect 0)
    (options (clearance outline) (anchor rect))
    (primitives
    ))
  (pad 2 thru_hole custom (at 1.27 3.81) (size 2.54 1.524) (drill 0.7652) (layers *.Cu *.Mask)
    (zone_connect 0)
    (options (clearance outline) (anchor rect))
    (primitives
    ))
  (pad 3 thru_hole custom (at 1.27 6.35) (size 2.54 1.524) (drill 0.7652) (layers *.Cu *.Mask)
    (zone_connect 0)
    (options (clearance outline) (anchor rect))
    (primitives
    ))
  (pad 4 thru_hole custom (at 1.27 8.89) (size 2.54 1.524) (drill 0.7652) (layers *.Cu *.Mask)
    (zone_connect 0)
    (options (clearance outline) (anchor rect))
    (primitives
    ))
  (pad 6 thru_hole custom (at 13.97 1.27) (size 2.54 1.524) (drill 0.7652) (layers *.Cu *.Mask)
    (zone_connect 0)
    (options (clearance outline) (anchor rect))
    (primitives
    ))
  (pad 7 thru_hole custom (at 13.97 3.81) (size 2.54 1.524) (drill 0.7652) (layers *.Cu *.Mask)
    (zone_connect 0)
    (options (clearance outline) (anchor rect))
    (primitives
    ))
  (pad 8 thru_hole custom (at 13.97 6.35) (size 2.54 1.524) (drill 0.7652) (layers *.Cu *.Mask)
    (zone_connect 0)
    (options (clearance outline) (anchor rect))
    (primitives
    ))
  (pad 9 thru_hole custom (at 13.97 8.89) (size 2.54 1.524) (drill 0.7652) (layers *.Cu *.Mask)
    (zone_connect 0)
    (options (clearance outline) (anchor rect))
    (primitives
    ))
  (pad 5 thru_hole custom (at 1.27 11.43) (size 2.54 1.524) (drill 0.7652) (layers *.Cu *.Mask)
    (zone_connect 0)
    (options (clearance outline) (anchor rect))
    (primitives
    ))
  (pad 10 thru_hole custom (at 13.97 11.43) (size 2.54 1.524) (drill 0.7652) (layers *.Cu *.Mask)
    (zone_connect 0)
    (options (clearance outline) (anchor rect))
    (primitives
    ))
)
