EESchema Schematic File Version 4
EELAYER 30 0
EELAYER END
$Descr A3 16535 11693
encoding utf-8
Sheet 1 1
Title ""
Date ""
Rev ""
Comp ""
Comment1 ""
Comment2 ""
Comment3 ""
Comment4 ""
$EndDescr
Text Notes 15350 2000 0    50   ~ 0
X-axis
Text Notes 15400 4950 0    50   ~ 0
Y-axis
Text Notes 15550 7950 0    50   ~ 0
Z-axis
Text GLabel 13000 1850 0    50   Input ~ 0
Step_Enable
Text GLabel 13000 1950 0    50   Input ~ 0
X_Step
Text GLabel 13000 2050 0    50   Input ~ 0
X_Dir
Text GLabel 14950 1150 2    50   Input ~ 0
VMOT
$Comp
L Device:CP C1
U 1 1 5E98B88F
P 14650 1400
F 0 "C1" H 14768 1446 50  0000 L CNN
F 1 "CP" H 14768 1355 50  0000 L CNN
F 2 "Capacitor_SMD:C_Elec_8x5.4" H 14688 1250 50  0001 C CNN
F 3 "https://products.nichicon.co.jp/en/pdf/XJA043/e-uwx.pdf" H 14768 1309 50  0001 L CNN
	1    14650 1400
	1    0    0    -1  
$EndComp
Wire Wire Line
	14650 1150 14650 1250
Wire Wire Line
	13800 1150 14650 1150
Wire Wire Line
	14650 1150 14950 1150
Connection ~ 14650 1150
$Comp
L Connector_Generic:Conn_02x03_Odd_Even JP1
U 1 1 5E9CE555
P 12800 2350
F 0 "JP1" H 12850 2150 50  0000 C CNN
F 1 "Conn_02x03" H 12850 2050 50  0000 C CNN
F 2 "fab:fab-2X03SMD" H 12800 2350 50  0001 C CNN
F 3 "~" H 12800 2350 50  0001 C CNN
	1    12800 2350
	1    0    0    -1  
$EndComp
Text GLabel 12300 2250 0    50   Input ~ 0
3V3
Wire Wire Line
	12300 2250 12450 2250
Wire Wire Line
	12450 2250 12450 2350
Wire Wire Line
	12450 2350 12600 2350
Connection ~ 12450 2250
Wire Wire Line
	12450 2250 12600 2250
Wire Wire Line
	12450 2350 12450 2450
Wire Wire Line
	12450 2450 12600 2450
Connection ~ 12450 2350
$Comp
L Connector:Conn_01x08_Male J4
U 1 1 5EA2B712
P 4500 7200
F 0 "J4" H 4450 7550 50  0000 C CNN
F 1 "Conn_01x08_Male" V 4400 7150 50  0000 C CNN
F 2 "fab:fab-1X08" H 4500 7200 50  0001 C CNN
F 3 "~" H 4500 7200 50  0001 C CNN
	1    4500 7200
	1    0    0    -1  
$EndComp
Text GLabel 5150 7300 2    50   Input ~ 0
Mist
Text GLabel 5150 7500 2    50   Input ~ 0
Flood
Text GLabel 5150 7600 2    50   Input ~ 0
GND
Wire Wire Line
	4700 7100 5150 7100
Wire Wire Line
	4700 7200 4950 7200
Wire Wire Line
	4950 7200 4950 7400
Wire Wire Line
	4950 7600 5150 7600
Wire Wire Line
	4700 7400 4950 7400
Connection ~ 4950 7400
Wire Wire Line
	4950 7400 4950 7600
Wire Wire Line
	4700 7600 4950 7600
Connection ~ 4950 7600
Wire Wire Line
	4700 7500 5150 7500
Wire Wire Line
	4700 7300 5150 7300
$Comp
L Connector:Conn_01x10_Male J5
U 1 1 5EA6F1FC
P 1750 9350
F 0 "J5" H 1858 9831 50  0000 C CNN
F 1 "Conn_01x10_Male" H 1858 9740 50  0000 C CNN
F 2 "fab:fab-1X10" H 1750 9350 50  0001 C CNN
F 3 "~" H 1750 9350 50  0001 C CNN
	1    1750 9350
	1    0    0    -1  
$EndComp
Text GLabel 3850 8950 2    50   Input ~ 0
X_Limit
Text GLabel 3850 9150 2    50   Input ~ 0
Y_Limit
Text GLabel 3850 9350 2    50   Input ~ 0
Z_Limit_-
Text GLabel 3950 9750 2    50   Input ~ 0
Probe
Text GLabel 3950 10300 2    50   Input ~ 0
GND
Wire Wire Line
	1950 8950 2400 8950
$Comp
L fab:RES-US1206FAB R1
U 1 1 5EA913A4
P 2600 8950
F 0 "R1" H 2600 9000 45  0000 C CNN
F 1 "100Ω" H 2600 8900 45  0000 C CNN
F 2 "fab:fab-R1206FAB" H 2630 9100 20  0001 C CNN
F 3 "" H 2600 8950 50  0001 C CNN
	1    2600 8950
	1    0    0    -1  
$EndComp
$Comp
L fab:RES-US1206FAB R2
U 1 1 5EA91F01
P 2600 9150
F 0 "R2" H 2600 9200 45  0000 C CNN
F 1 "100Ω" H 2600 9100 45  0000 C CNN
F 2 "fab:fab-R1206FAB" H 2630 9300 20  0001 C CNN
F 3 "" H 2600 9150 50  0001 C CNN
	1    2600 9150
	1    0    0    -1  
$EndComp
$Comp
L fab:RES-US1206FAB R3
U 1 1 5EA9268B
P 2600 9350
F 0 "R3" H 2600 9400 45  0000 C CNN
F 1 "100Ω" H 2600 9300 45  0000 C CNN
F 2 "fab:fab-R1206FAB" H 2630 9500 20  0001 C CNN
F 3 "" H 2600 9350 50  0001 C CNN
	1    2600 9350
	1    0    0    -1  
$EndComp
$Comp
L fab:RES-US1206FAB R4
U 1 1 5EA92E84
P 2600 9750
F 0 "R4" H 2600 9800 45  0000 C CNN
F 1 "100Ω" H 2600 9700 45  0000 C CNN
F 2 "fab:fab-R1206FAB" H 2630 9900 20  0001 C CNN
F 3 "" H 2600 9750 50  0001 C CNN
	1    2600 9750
	1    0    0    -1  
$EndComp
Wire Wire Line
	2800 8950 2900 8950
Wire Wire Line
	2800 9150 3150 9150
Wire Wire Line
	2800 9350 3400 9350
Wire Wire Line
	2200 10300 2900 10300
$Comp
L fab:CAP-US1206FAB C4
U 1 1 5EAF505A
P 2900 10000
F 0 "C4" V 2850 9900 45  0000 L CNN
F 1 "100nF" H 2850 9900 45  0000 L CNN
F 2 "fab:fab-C1206FAB" H 2930 10150 20  0001 C CNN
F 3 "" H 2900 10000 50  0001 C CNN
	1    2900 10000
	0    1    1    0   
$EndComp
$Comp
L fab:CAP-US1206FAB C5
U 1 1 5EAF600A
P 3150 10000
F 0 "C5" V 3100 9900 45  0000 L CNN
F 1 "100nF" H 3100 9900 45  0000 L CNN
F 2 "fab:fab-C1206FAB" H 3180 10150 20  0001 C CNN
F 3 "" H 3150 10000 50  0001 C CNN
	1    3150 10000
	0    1    1    0   
$EndComp
$Comp
L fab:CAP-US1206FAB C6
U 1 1 5EAF6571
P 3400 10000
F 0 "C6" V 3350 9900 45  0000 L CNN
F 1 "100nF" H 3350 9900 45  0000 L CNN
F 2 "fab:fab-C1206FAB" H 3430 10150 20  0001 C CNN
F 3 "" H 3400 10000 50  0001 C CNN
	1    3400 10000
	0    1    1    0   
$EndComp
$Comp
L fab:CAP-US1206FAB C8
U 1 1 5EAF6A36
P 3850 10000
F 0 "C8" V 3800 9900 45  0000 L CNN
F 1 "100nF" H 3800 9900 45  0000 L CNN
F 2 "fab:fab-C1206FAB" H 3880 10150 20  0001 C CNN
F 3 "" H 3850 10000 50  0001 C CNN
	1    3850 10000
	0    1    1    0   
$EndComp
Wire Wire Line
	2900 10200 2900 10300
Connection ~ 2900 10300
Wire Wire Line
	2900 10300 3150 10300
Wire Wire Line
	3150 10200 3150 10300
Connection ~ 3150 10300
Wire Wire Line
	3150 10300 3400 10300
Wire Wire Line
	3400 10200 3400 10300
Wire Wire Line
	3600 10300 3850 10300
Wire Wire Line
	3850 10200 3850 10300
Connection ~ 3850 10300
Wire Wire Line
	3850 10300 3950 10300
Connection ~ 3400 9350
Connection ~ 3150 9150
Connection ~ 2900 8950
$Comp
L Connector:Conn_01x08_Male J6
U 1 1 5EB87E78
P 4550 9300
F 0 "J6" H 4658 9781 50  0000 C CNN
F 1 "Conn_01x08_Male" H 4658 9690 50  0000 C CNN
F 2 "fab:fab-1X08" H 4550 9300 50  0001 C CNN
F 3 "~" H 4550 9300 50  0001 C CNN
	1    4550 9300
	1    0    0    -1  
$EndComp
Text GLabel 6550 9200 2    50   Input ~ 0
Door
Text GLabel 6550 9400 2    50   Input ~ 0
Start
Text GLabel 6550 9000 2    50   Input ~ 0
Hold
Text GLabel 6550 10150 2    50   Input ~ 0
GND
Wire Wire Line
	4750 9000 5200 9000
Wire Wire Line
	4750 9200 5200 9200
Wire Wire Line
	4750 9300 5000 9300
Wire Wire Line
	5000 9300 5000 9500
Wire Wire Line
	4750 9500 5000 9500
Connection ~ 5000 9500
Wire Wire Line
	5000 9500 5000 9700
Wire Wire Line
	4750 9700 5000 9700
Connection ~ 5000 9700
Wire Wire Line
	4750 9600 5200 9600
Wire Wire Line
	4750 9400 5200 9400
Wire Wire Line
	4750 9100 5000 9100
Wire Wire Line
	5000 9100 5000 9300
Connection ~ 5000 9300
$Comp
L fab:RES-US1206FAB R5
U 1 1 5EB87E91
P 5400 9000
F 0 "R5" H 5400 9050 45  0000 C CNN
F 1 "100Ω" H 5400 8950 45  0000 C CNN
F 2 "fab:fab-R1206FAB" H 5430 9150 20  0001 C CNN
F 3 "" H 5400 9000 50  0001 C CNN
	1    5400 9000
	1    0    0    -1  
$EndComp
$Comp
L fab:RES-US1206FAB R6
U 1 1 5EB87E97
P 5400 9200
F 0 "R6" H 5400 9250 45  0000 C CNN
F 1 "100Ω" H 5400 9150 45  0000 C CNN
F 2 "fab:fab-R1206FAB" H 5430 9350 20  0001 C CNN
F 3 "" H 5400 9200 50  0001 C CNN
	1    5400 9200
	1    0    0    -1  
$EndComp
$Comp
L fab:RES-US1206FAB R7
U 1 1 5EB87E9D
P 5400 9400
F 0 "R7" H 5400 9450 45  0000 C CNN
F 1 "100Ω" H 5400 9350 45  0000 C CNN
F 2 "fab:fab-R1206FAB" H 5430 9550 20  0001 C CNN
F 3 "" H 5400 9400 50  0001 C CNN
	1    5400 9400
	1    0    0    -1  
$EndComp
$Comp
L fab:RES-US1206FAB R8
U 1 1 5EB87EA3
P 5400 9600
F 0 "R8" H 5400 9650 45  0000 C CNN
F 1 "100Ω" H 5400 9550 45  0000 C CNN
F 2 "fab:fab-R1206FAB" H 5430 9750 20  0001 C CNN
F 3 "" H 5400 9600 50  0001 C CNN
	1    5400 9600
	1    0    0    -1  
$EndComp
Wire Wire Line
	5600 9000 5700 9000
Wire Wire Line
	5600 9200 5950 9200
Wire Wire Line
	5600 9400 6200 9400
Wire Wire Line
	5600 9600 6450 9600
Wire Wire Line
	5000 10150 5700 10150
Wire Wire Line
	5000 9700 5000 10150
$Comp
L fab:CAP-US1206FAB C11
U 1 1 5EB87EBB
P 6200 9850
F 0 "C11" V 6150 9750 45  0000 L CNN
F 1 "100nF" H 6150 9750 45  0000 L CNN
F 2 "fab:fab-C1206FAB" H 6230 10000 20  0001 C CNN
F 3 "" H 6200 9850 50  0001 C CNN
	1    6200 9850
	0    1    1    0   
$EndComp
$Comp
L fab:CAP-US1206FAB C12
U 1 1 5EB87EC1
P 6450 9850
F 0 "C12" V 6400 9750 45  0000 L CNN
F 1 "100nF" H 6400 9750 45  0000 L CNN
F 2 "fab:fab-C1206FAB" H 6480 10000 20  0001 C CNN
F 3 "" H 6450 9850 50  0001 C CNN
	1    6450 9850
	0    1    1    0   
$EndComp
Wire Wire Line
	5700 10050 5700 10150
Connection ~ 5700 10150
Wire Wire Line
	5700 10150 5950 10150
Wire Wire Line
	5950 10050 5950 10150
Connection ~ 5950 10150
Wire Wire Line
	5950 10150 6200 10150
Wire Wire Line
	6200 10050 6200 10150
Connection ~ 6200 10150
Wire Wire Line
	6200 10150 6450 10150
Wire Wire Line
	6450 10050 6450 10150
Connection ~ 6450 10150
Wire Wire Line
	6450 10150 6550 10150
Wire Wire Line
	6450 9750 6450 9600
Connection ~ 6450 9600
Wire Wire Line
	6450 9600 6550 9600
Wire Wire Line
	6200 9750 6200 9400
Connection ~ 6200 9400
Wire Wire Line
	6200 9400 6550 9400
Wire Wire Line
	5950 9750 5950 9200
Connection ~ 5950 9200
Wire Wire Line
	5950 9200 6550 9200
Wire Wire Line
	5700 9750 5700 9000
Connection ~ 5700 9000
Wire Wire Line
	5700 9000 6550 9000
$Comp
L fab:RES-US1206FAB R9
U 1 1 5EBE5215
P 5700 8700
F 0 "R9" H 5700 8800 45  0000 C CNN
F 1 "10kΩ" H 5700 8650 45  0000 C CNN
F 2 "fab:fab-R1206FAB" H 5730 8850 20  0001 C CNN
F 3 "" H 5700 8700 50  0001 C CNN
	1    5700 8700
	0    -1   -1   0   
$EndComp
$Comp
L fab:RES-US1206FAB R10
U 1 1 5EBE62F1
P 5950 8700
F 0 "R10" H 5950 8800 45  0000 C CNN
F 1 "10kΩ" H 5950 8650 45  0000 C CNN
F 2 "fab:fab-R1206FAB" H 5980 8850 20  0001 C CNN
F 3 "" H 5950 8700 50  0001 C CNN
	1    5950 8700
	0    -1   -1   0   
$EndComp
$Comp
L fab:RES-US1206FAB R11
U 1 1 5EBE68BF
P 6200 8700
F 0 "R11" H 6200 8800 45  0000 C CNN
F 1 "10kΩ" H 6200 8650 45  0000 C CNN
F 2 "fab:fab-R1206FAB" H 6230 8850 20  0001 C CNN
F 3 "" H 6200 8700 50  0001 C CNN
	1    6200 8700
	0    -1   -1   0   
$EndComp
$Comp
L fab:RES-US1206FAB R12
U 1 1 5EBE6ED7
P 6450 8700
F 0 "R12" H 6450 8800 45  0000 C CNN
F 1 "10kΩ" H 6450 8650 45  0000 C CNN
F 2 "fab:fab-R1206FAB" H 6480 8850 20  0001 C CNN
F 3 "" H 6450 8700 50  0001 C CNN
	1    6450 8700
	0    -1   -1   0   
$EndComp
Wire Wire Line
	5700 8900 5700 9000
Wire Wire Line
	5950 8900 5950 9200
Wire Wire Line
	6200 8900 6200 9400
Wire Wire Line
	6450 8900 6450 9600
Text GLabel 5600 8300 0    50   Input ~ 0
3V3
Wire Wire Line
	5600 8300 5700 8300
Wire Wire Line
	5700 8300 5700 8500
Wire Wire Line
	5700 8300 5950 8300
Wire Wire Line
	5950 8300 5950 8500
Connection ~ 5700 8300
Wire Wire Line
	5950 8300 6200 8300
Wire Wire Line
	6200 8300 6200 8500
Connection ~ 5950 8300
Wire Wire Line
	6200 8300 6450 8300
Wire Wire Line
	6450 8300 6450 8500
Connection ~ 6200 8300
Text GLabel 6550 9600 2    50   Input ~ 0
Grbl_Reset
$Comp
L fab:CAP-US1206FAB C9
U 1 1 5EB87EAF
P 5700 9850
F 0 "C9" V 5650 9750 45  0000 L CNN
F 1 "100nF" H 5650 9750 45  0000 L CNN
F 2 "fab:fab-C1206FAB" H 5730 10000 20  0001 C CNN
F 3 "" H 5700 9850 50  0001 C CNN
	1    5700 9850
	0    1    1    0   
$EndComp
$Comp
L fab:CAP-US1206FAB C10
U 1 1 5EB87EB5
P 5950 9850
F 0 "C10" V 5900 9750 45  0000 L CNN
F 1 "100nF" H 5900 9750 45  0000 L CNN
F 2 "fab:fab-C1206FAB" H 5980 10000 20  0001 C CNN
F 3 "" H 5950 9850 50  0001 C CNN
	1    5950 9850
	0    1    1    0   
$EndComp
Text Notes 4100 6650 0    50   ~ 0
Outputs
Text Notes 4250 8250 0    50   ~ 0
Inputs\n
Text GLabel 8250 9250 0    50   Input ~ 0
GND
Wire Wire Line
	8250 9600 8400 9600
Wire Wire Line
	8250 9250 8400 9250
Text GLabel 10000 9250 2    50   Input ~ 0
GND
Text GLabel 9900 9600 2    50   Input ~ 0
5V
Wire Wire Line
	10000 9250 9850 9250
$Comp
L Connector:Conn_01x04_Male J8
U 1 1 5ECF2C08
P 8600 10250
F 0 "J8" H 8708 10531 50  0000 C CNN
F 1 "Conn_01x04_Male" H 8708 10440 50  0000 C CNN
F 2 "fab:fab-1X04" H 8600 10250 50  0001 C CNN
F 3 "~" H 8600 10250 50  0001 C CNN
	1    8600 10250
	1    0    0    -1  
$EndComp
Text GLabel 9050 10150 2    50   Input ~ 0
VMOT
Wire Wire Line
	9050 10150 8800 10150
Text GLabel 9050 10250 2    50   Input ~ 0
5V
Wire Wire Line
	9050 10250 8800 10250
Text GLabel 9050 10350 2    50   Input ~ 0
3V3
Wire Wire Line
	8800 10350 9050 10350
Text GLabel 9050 10450 2    50   Input ~ 0
GND
Wire Wire Line
	9050 10450 8800 10450
Text Notes 9650 8200 0    50   ~ 0
Power\n
Text Notes 8250 10350 0    50   ~ 0
Test
Text GLabel 13400 2900 0    50   Input ~ 0
GND
Wire Wire Line
	13400 2900 13600 2900
Wire Wire Line
	13600 2900 13600 2750
Wire Wire Line
	13600 2900 13800 2900
Wire Wire Line
	13800 2900 13800 2750
Connection ~ 13600 2900
Wire Wire Line
	13800 2900 14650 2900
Wire Wire Line
	14650 1550 14650 2900
Connection ~ 13800 2900
Wire Wire Line
	13800 1250 13800 1150
$Comp
L Connector:Conn_01x04_Male X_AXIS1
U 1 1 5EE00348
P 14500 2050
F 0 "X_AXIS1" H 14472 1932 50  0000 R CNN
F 1 "Conn_01x04_Male" H 14450 2050 50  0000 R CNN
F 2 "fab:fab-1X04" H 14500 2050 50  0001 C CNN
F 3 "~" H 14500 2050 50  0001 C CNN
	1    14500 2050
	-1   0    0    1   
$EndComp
Wire Wire Line
	14300 1850 14100 1850
Wire Wire Line
	14100 1950 14300 1950
Wire Wire Line
	14100 2050 14300 2050
Wire Wire Line
	14100 2150 14300 2150
Wire Wire Line
	13000 1850 13200 1850
Wire Wire Line
	13000 1950 13200 1950
Wire Wire Line
	13000 2050 13200 2050
Wire Wire Line
	13100 2250 13200 2250
Wire Wire Line
	13100 2350 13200 2350
Wire Wire Line
	13100 2450 13200 2450
Text GLabel 13050 1250 0    50   Input ~ 0
3V3
Wire Wire Line
	13050 1250 13600 1250
$Comp
L Driver_Motor:Pololu_Breakout_A4988 A1
U 1 1 5ECA0E81
P 13600 1950
F 0 "A1" H 13650 2831 50  0000 C CNN
F 1 "Pololu_Breakout_A4988" H 13650 2740 50  0000 C CNN
F 2 "Module:Pololu_Breakout-16_15.2x20.3mm" H 13875 1200 50  0001 L CNN
F 3 "https://www.pololu.com/product/2980/pictures" H 13700 1650 50  0001 C CNN
	1    13600 1950
	1    0    0    -1  
$EndComp
Wire Wire Line
	13200 1550 13050 1550
Wire Wire Line
	13050 1550 13050 1650
Wire Wire Line
	13050 1650 13200 1650
Text GLabel 13050 4800 0    50   Input ~ 0
Step_Enable
Text GLabel 13050 4900 0    50   Input ~ 0
Y_Step
Text GLabel 13050 5000 0    50   Input ~ 0
Y_Dir
Text GLabel 15000 4100 2    50   Input ~ 0
VMOT
$Comp
L Device:CP C2
U 1 1 5EFB620C
P 14700 4350
F 0 "C2" H 14818 4396 50  0000 L CNN
F 1 "CP" H 14818 4305 50  0000 L CNN
F 2 "Capacitor_SMD:C_Elec_8x5.4" H 14738 4200 50  0001 C CNN
F 3 "https://products.nichicon.co.jp/en/pdf/XJA043/e-uwx.pdf" H 14818 4259 50  0001 L CNN
	1    14700 4350
	1    0    0    -1  
$EndComp
Wire Wire Line
	14700 4100 14700 4200
Wire Wire Line
	13850 4100 14700 4100
Wire Wire Line
	14700 4100 15000 4100
Connection ~ 14700 4100
$Comp
L Connector_Generic:Conn_02x03_Odd_Even JP2
U 1 1 5EFB6216
P 12850 5300
F 0 "JP2" H 12900 5100 50  0000 C CNN
F 1 "Conn_02x03" H 12900 5000 50  0000 C CNN
F 2 "fab:fab-2X03SMD" H 12850 5300 50  0001 C CNN
F 3 "~" H 12850 5300 50  0001 C CNN
	1    12850 5300
	1    0    0    -1  
$EndComp
Text GLabel 12350 5200 0    50   Input ~ 0
3V3
Wire Wire Line
	12350 5200 12500 5200
Wire Wire Line
	12500 5200 12500 5300
Wire Wire Line
	12500 5300 12650 5300
Connection ~ 12500 5200
Wire Wire Line
	12500 5200 12650 5200
Wire Wire Line
	12500 5300 12500 5400
Wire Wire Line
	12500 5400 12650 5400
Connection ~ 12500 5300
Text GLabel 13450 5850 0    50   Input ~ 0
GND
Wire Wire Line
	13450 5850 13650 5850
Wire Wire Line
	13650 5850 13650 5700
Wire Wire Line
	13650 5850 13850 5850
Wire Wire Line
	13850 5850 13850 5700
Connection ~ 13650 5850
Wire Wire Line
	13850 5850 14700 5850
Wire Wire Line
	14700 4500 14700 5850
Connection ~ 13850 5850
Wire Wire Line
	13850 4200 13850 4100
$Comp
L Connector:Conn_01x04_Male Y_AXIS1
U 1 1 5EFB622F
P 14550 5000
F 0 "Y_AXIS1" H 14522 4882 50  0000 R CNN
F 1 "Conn_01x04_Male" H 14500 5000 50  0000 R CNN
F 2 "fab:fab-1X04" H 14550 5000 50  0001 C CNN
F 3 "~" H 14550 5000 50  0001 C CNN
	1    14550 5000
	-1   0    0    1   
$EndComp
Wire Wire Line
	14350 4800 14150 4800
Wire Wire Line
	14150 4900 14350 4900
Wire Wire Line
	14150 5000 14350 5000
Wire Wire Line
	14150 5100 14350 5100
Wire Wire Line
	13050 4800 13250 4800
Wire Wire Line
	13050 4900 13250 4900
Wire Wire Line
	13050 5000 13250 5000
Wire Wire Line
	13150 5200 13250 5200
Wire Wire Line
	13150 5300 13250 5300
Wire Wire Line
	13150 5400 13250 5400
Text GLabel 13100 4200 0    50   Input ~ 0
3V3
Wire Wire Line
	13100 4200 13650 4200
$Comp
L Driver_Motor:Pololu_Breakout_A4988 A2
U 1 1 5EFB6241
P 13650 4900
F 0 "A2" H 13700 5781 50  0000 C CNN
F 1 "Pololu_Breakout_A4988" H 13700 5690 50  0000 C CNN
F 2 "Module:Pololu_Breakout-16_15.2x20.3mm" H 13925 4150 50  0001 L CNN
F 3 "https://www.pololu.com/product/2980/pictures" H 13750 4600 50  0001 C CNN
	1    13650 4900
	1    0    0    -1  
$EndComp
Wire Wire Line
	13250 4500 13100 4500
Wire Wire Line
	13100 4500 13100 4600
Wire Wire Line
	13100 4600 13250 4600
Text GLabel 13100 7800 0    50   Input ~ 0
Step_Enable
Text GLabel 13100 7900 0    50   Input ~ 0
Z_Step
Text GLabel 13100 8000 0    50   Input ~ 0
Z_Dir
Text GLabel 15050 7100 2    50   Input ~ 0
VMOT
$Comp
L Device:CP C3
U 1 1 5EFC3F66
P 14750 7350
F 0 "C3" H 14868 7396 50  0000 L CNN
F 1 "CP" H 14868 7305 50  0000 L CNN
F 2 "Capacitor_SMD:C_Elec_8x5.4" H 14788 7200 50  0001 C CNN
F 3 "https://products.nichicon.co.jp/en/pdf/XJA043/e-uwx.pdf" H 14868 7259 50  0001 L CNN
	1    14750 7350
	1    0    0    -1  
$EndComp
Wire Wire Line
	14750 7100 14750 7200
Wire Wire Line
	13900 7100 14750 7100
Wire Wire Line
	14750 7100 15050 7100
Connection ~ 14750 7100
$Comp
L Connector_Generic:Conn_02x03_Odd_Even JP3
U 1 1 5EFC3F70
P 12900 8300
F 0 "JP3" H 12950 8100 50  0000 C CNN
F 1 "Conn_02x03" H 12950 8000 50  0000 C CNN
F 2 "fab:fab-2X03SMD" H 12900 8300 50  0001 C CNN
F 3 "~" H 12900 8300 50  0001 C CNN
	1    12900 8300
	1    0    0    -1  
$EndComp
Text GLabel 12400 8200 0    50   Input ~ 0
3V3
Wire Wire Line
	12400 8200 12550 8200
Wire Wire Line
	12550 8200 12550 8300
Wire Wire Line
	12550 8300 12700 8300
Connection ~ 12550 8200
Wire Wire Line
	12550 8200 12700 8200
Wire Wire Line
	12550 8300 12550 8400
Wire Wire Line
	12550 8400 12700 8400
Connection ~ 12550 8300
Text GLabel 13500 8850 0    50   Input ~ 0
GND
Wire Wire Line
	13500 8850 13700 8850
Wire Wire Line
	13700 8850 13700 8700
Wire Wire Line
	13700 8850 13900 8850
Wire Wire Line
	13900 8850 13900 8700
Connection ~ 13700 8850
Wire Wire Line
	13900 8850 14750 8850
Wire Wire Line
	14750 7500 14750 8850
Connection ~ 13900 8850
Wire Wire Line
	13900 7200 13900 7100
$Comp
L Connector:Conn_01x04_Male Z_AXIS1
U 1 1 5EFC3F89
P 14600 8000
F 0 "Z_AXIS1" H 14572 7882 50  0000 R CNN
F 1 "Conn_01x04_Male" H 14550 8000 50  0000 R CNN
F 2 "fab:fab-1X04" H 14600 8000 50  0001 C CNN
F 3 "~" H 14600 8000 50  0001 C CNN
	1    14600 8000
	-1   0    0    1   
$EndComp
Wire Wire Line
	14400 7800 14200 7800
Wire Wire Line
	14200 7900 14400 7900
Wire Wire Line
	14200 8000 14400 8000
Wire Wire Line
	14200 8100 14400 8100
Wire Wire Line
	13100 7800 13300 7800
Wire Wire Line
	13100 7900 13300 7900
Wire Wire Line
	13100 8000 13300 8000
Wire Wire Line
	13200 8200 13300 8200
Wire Wire Line
	13200 8300 13300 8300
Wire Wire Line
	13200 8400 13300 8400
Text GLabel 13150 7200 0    50   Input ~ 0
3V3
Wire Wire Line
	13150 7200 13700 7200
$Comp
L Driver_Motor:Pololu_Breakout_A4988 A3
U 1 1 5EFC3F9B
P 13700 7900
F 0 "A3" H 13750 8781 50  0000 C CNN
F 1 "Pololu_Breakout_A4988" H 13750 8690 50  0000 C CNN
F 2 "Module:Pololu_Breakout-16_15.2x20.3mm" H 13975 7150 50  0001 L CNN
F 3 "https://www.pololu.com/product/2980/pictures" H 13800 7600 50  0001 C CNN
	1    13700 7900
	1    0    0    -1  
$EndComp
Wire Wire Line
	13300 7500 13150 7500
Wire Wire Line
	13150 7500 13150 7600
Wire Wire Line
	13150 7600 13300 7600
Wire Notes Line
	7150 8050 7150 10600
Wire Notes Line
	7150 10600 1300 10600
Wire Notes Line
	1300 10600 1300 8050
Wire Notes Line
	1300 8050 7150 8050
Wire Notes Line
	11600 8050 11600 10600
Wire Notes Line
	7850 8050 7850 10600
Wire Notes Line
	1300 6500 7150 6500
Wire Notes Line
	1300 7900 7150 7900
Text GLabel 10400 3500 2    50   Input ~ 0
Spindle_PWM_5V
Wire Wire Line
	8650 3500 8750 3500
Text GLabel 8500 3300 0    50   Input ~ 0
Spindle_Ena
Wire Wire Line
	8500 3300 8950 3300
Text GLabel 8200 3200 0    50   Input ~ 0
GND
Wire Wire Line
	8200 3200 9000 3200
Text GLabel 10700 3200 2    50   Input ~ 0
GND
Wire Wire Line
	9950 3200 10100 3200
Wire Wire Line
	9950 3300 10100 3300
Wire Wire Line
	10100 3300 10100 3200
Text GLabel 10400 3400 2    50   Input ~ 0
5V
Wire Wire Line
	8200 3400 9000 3400
NoConn ~ 9000 3600
NoConn ~ 9950 3600
Text GLabel 8650 3500 0    50   Input ~ 0
Spindle_PWM_3V
Text GLabel 8200 3400 0    50   Input ~ 0
3V3
Text Notes 9250 2900 0    50   ~ 0
Level Shifter\n
$Comp
L fab:RES-US1206FAB R13
U 1 1 5F1A6450
P 8950 3800
F 0 "R13" H 8950 3650 45  0000 C CNN
F 1 "10kΩ" H 8950 3750 45  0000 C CNN
F 2 "fab:fab-R1206FAB" H 8980 3950 20  0001 C CNN
F 3 "" H 8950 3800 50  0001 C CNN
	1    8950 3800
	0    -1   -1   0   
$EndComp
$Comp
L fab:RES-US1206FAB R14
U 1 1 5F1A80A8
P 8750 3700
F 0 "R14" H 8750 3800 45  0000 C CNN
F 1 "10kΩ" H 8750 3650 45  0000 C CNN
F 2 "fab:fab-R1206FAB" H 8780 3850 20  0001 C CNN
F 3 "" H 8750 3700 50  0001 C CNN
	1    8750 3700
	0    -1   -1   0   
$EndComp
Wire Wire Line
	9950 3400 10400 3400
Wire Wire Line
	10100 3200 10700 3200
Connection ~ 10100 3200
Wire Wire Line
	8950 3300 8950 3600
Connection ~ 8950 3300
Wire Wire Line
	8950 3300 9000 3300
Text GLabel 8600 4000 0    50   Input ~ 0
GND
Wire Wire Line
	8600 4000 8750 4000
Text GLabel 8200 7450 0    50   Input ~ 0
MOSI
Text GLabel 8200 7350 0    50   Input ~ 0
SCK
Text GLabel 8150 6850 0    50   Input ~ 0
MISO
Text GLabel 11300 7650 2    50   Input ~ 0
GND
Wire Wire Line
	11300 7650 11100 7650
Wire Wire Line
	8200 7350 8400 7350
Wire Wire Line
	8200 7450 8400 7450
Wire Wire Line
	8150 6850 8400 6850
NoConn ~ 8400 6950
NoConn ~ 8400 7050
Text GLabel 11250 6650 2    50   Input ~ 0
3V3
Wire Wire Line
	11250 6650 11000 6650
Wire Wire Line
	8200 7150 8400 7150
Wire Wire Line
	11000 7450 11100 7450
Wire Wire Line
	11100 7450 11100 7650
Connection ~ 11100 7650
Wire Wire Line
	11100 7650 11000 7650
$Comp
L 1140084168:1140084168 J20
U 1 1 5F309D1F
P 9700 7150
F 0 "J20" H 9700 7915 50  0000 C CNN
F 1 "1140084168" H 9700 7824 50  0000 C CNN
F 2 "1140084168:AMPHENOL_1140084168" H 9700 7150 50  0001 L BNN
F 3 "Manufacturer recommendations" H 9700 7150 50  0001 L BNN
F 4 "1.68mm" H 9700 7150 50  0001 L BNN "Field4"
F 5 "Amphenol" H 9700 7150 50  0001 L BNN "Field5"
F 6 "A" H 9700 7150 50  0001 L BNN "Field6"
	1    9700 7150
	1    0    0    -1  
$EndComp
Text GLabel 8200 7150 0    50   Input ~ 0
CS
$Comp
L buck_mp1584en:BUCK_MP1584EN U1
U 1 1 5F3E45EB
P 9000 9450
F 0 "U1" H 8900 9875 50  0000 C CNN
F 1 "BUCK_MP1584EN" H 8900 9784 50  0000 C CNN
F 2 "MP1584:BUCK_MP1584EN" H 9000 9450 50  0001 C CNN
F 3 "https://www.haoyuelectronics.com/Attachment/MP1584/MP1584.pdf" H 9000 9450 50  0001 C CNN
	1    9000 9450
	1    0    0    -1  
$EndComp
$Comp
L txs0102:TXS0102 T1
U 1 1 5F3E50F3
P 9300 3400
F 0 "T1" H 9475 3825 50  0000 C CNN
F 1 "TXS0102" H 9475 3734 50  0000 C CNN
F 2 "TXS0102:TXS0102" H 9300 3400 50  0001 C CNN
F 3 "https://www.ti.com/lit/ds/symlink/txs0102.pdf" H 9300 3400 50  0001 C CNN
	1    9300 3400
	1    0    0    -1  
$EndComp
Text Notes 9600 6250 0    50   ~ 0
SD Card\n
Text GLabel 3850 9550 2    50   Input ~ 0
Z_Limit_+
$Comp
L fab:RES-US1206FAB R15
U 1 1 5E991A59
P 2600 9550
F 0 "R15" H 2600 9600 45  0000 C CNN
F 1 "100Ω" H 2600 9500 45  0000 C CNN
F 2 "fab:fab-R1206FAB" H 2630 9700 20  0001 C CNN
F 3 "" H 2600 9550 50  0001 C CNN
	1    2600 9550
	1    0    0    -1  
$EndComp
Wire Wire Line
	2800 9550 3600 9550
Connection ~ 3600 9550
Wire Wire Line
	3400 10300 3600 10300
Connection ~ 3400 10300
Connection ~ 3600 10300
$Comp
L fab:CAP-US1206FAB C7
U 1 1 5E9D8BB9
P 3600 10000
F 0 "C7" V 3550 9900 45  0000 L CNN
F 1 "100nF" H 3550 9900 45  0000 L CNN
F 2 "fab:fab-C1206FAB" H 3630 10150 20  0001 C CNN
F 3 "" H 3600 10000 50  0001 C CNN
	1    3600 10000
	0    1    1    0   
$EndComp
Wire Wire Line
	3600 10200 3600 10300
Wire Notes Line
	11600 4150 11600 2750
Wire Notes Line
	11600 2750 7850 2750
Wire Notes Line
	7850 2750 7850 4150
Wire Notes Line
	7850 4150 11600 4150
Wire Notes Line
	7150 6500 7150 7900
Wire Notes Line
	1300 6500 1300 7900
Wire Notes Line
	7850 7900 11600 7900
Wire Notes Line
	11600 7900 11600 6050
Wire Notes Line
	11600 6050 7850 6050
Wire Notes Line
	7850 6050 7850 7900
Text GLabel 2700 4150 0    50   Input ~ 0
Step_Enable
Wire Wire Line
	3800 5650 3950 5650
Wire Wire Line
	3950 5650 3950 5400
Text GLabel 6200 4150 2    50   Input ~ 0
MISO
Text GLabel 6200 4250 2    50   Input ~ 0
SCK
Text GLabel 6250 4350 2    50   Input ~ 0
CS
Text GLabel 6250 4450 2    50   Input ~ 0
X_Limit
Text GLabel 6250 4550 2    50   Input ~ 0
Y_Limit
Text GLabel 6250 4650 2    50   Input ~ 0
Z_Limit_+
Wire Wire Line
	4900 5650 4750 5650
Wire Wire Line
	4750 5650 4750 5400
Text GLabel 2700 4250 0    50   Input ~ 0
Y_Dir
Wire Wire Line
	4650 5400 4650 5800
Text GLabel 3800 5650 0    50   Input ~ 0
Z_Limit_-
Wire Notes Line
	7850 8050 11600 8050
Wire Notes Line
	7850 10600 11600 10600
Text GLabel 10550 9100 0    50   Input ~ 0
5V
Text GLabel 10550 9750 0    50   Input ~ 0
GND
$Comp
L fab:RES-US1206FAB R21
U 1 1 5EC1ABE0
P 11050 9450
F 0 "R21" H 10850 9500 45  0000 L CNN
F 1 "220Ω" H 10900 9550 45  0000 L CNN
F 2 "fab:fab-R1206FAB" H 11080 9600 20  0001 C CNN
F 3 "" H 11050 9450 50  0001 C CNN
	1    11050 9450
	0    1    1    0   
$EndComp
Wire Wire Line
	10550 9100 10750 9100
Wire Wire Line
	10750 9100 10750 9250
Wire Wire Line
	10750 9550 10750 9700
Wire Wire Line
	10750 9700 10950 9700
Wire Wire Line
	10950 9700 10950 9150
Wire Wire Line
	10950 9150 11050 9150
Wire Wire Line
	11050 9150 11050 9250
Wire Wire Line
	10550 9750 11050 9750
Wire Wire Line
	11050 9750 11050 9650
$Comp
L fab:LEDFAB1206 PWR1
U 1 1 5EC18DDE
P 10750 9450
F 0 "PWR1" V 10650 9550 45  0000 L CNN
F 1 "RED" V 10550 9400 45  0000 L CNN
F 2 "fab:fab-LED1206FAB" H 10780 9600 20  0001 C CNN
F 3 "" H 10750 9450 50  0001 C CNN
	1    10750 9450
	1    0    0    -1  
$EndComp
$Comp
L fab:CAP-US1206FAB C20
U 1 1 5EC75751
P 11350 9350
F 0 "C20" H 11200 9400 45  0000 L CNN
F 1 "10uF" H 11150 9500 45  0000 L CNN
F 2 "fab:fab-C1206FAB" H 11380 9500 20  0001 C CNN
F 3 "" H 11350 9350 50  0001 C CNN
	1    11350 9350
	0    1    1    0   
$EndComp
Wire Wire Line
	10750 9100 11350 9100
Wire Wire Line
	11350 9100 11350 9250
Connection ~ 10750 9100
Wire Wire Line
	11050 9750 11350 9750
Wire Wire Line
	11350 9750 11350 9550
Connection ~ 11050 9750
Text Notes 9550 4450 0    50   ~ 0
MOSFET
Text GLabel 2550 7250 0    50   Input ~ 0
Mosfet_PWM_5V
$Comp
L Connector:Conn_01x02_Male J9
U 1 1 5ED24120
P 8150 5100
F 0 "J9" V 8200 4900 50  0000 C CNN
F 1 "Conn_01x02_Male" V 8100 5050 50  0000 C CNN
F 2 "fab:fab-1X02" H 8150 5100 50  0001 C CNN
F 3 "~" H 8150 5100 50  0001 C CNN
	1    8150 5100
	1    0    0    -1  
$EndComp
Text GLabel 9000 5200 2    50   Input ~ 0
Splindle_M-
$Comp
L fab:NMOSFETTO252 T2
U 1 1 5ED6EDF6
P 10700 5250
F 0 "T2" H 10808 5292 45  0000 L CNN
F 1 "NMOSFETTO252" H 10808 5208 45  0000 L CNN
F 2 "fab:fab-TO252" H 10730 5400 20  0001 C CNN
F 3 "" H 10700 5250 50  0001 C CNN
	1    10700 5250
	1    0    0    -1  
$EndComp
Text GLabel 10200 5350 0    50   Input ~ 0
Mosfet_PWM_5V
Wire Wire Line
	10200 5350 10400 5350
Text GLabel 11000 5850 2    50   Input ~ 0
GND
Text GLabel 9000 4600 2    50   Input ~ 0
VMOT
Text GLabel 10550 4850 0    50   Input ~ 0
Splindle_M-
Wire Wire Line
	10550 4850 10700 4850
$Comp
L fab:RES-US1206FAB R22
U 1 1 5EE0804B
P 10400 5650
F 0 "R22" H 10350 5550 45  0000 L CNN
F 1 "10kΩ" H 10250 5750 45  0000 L CNN
F 2 "fab:fab-R1206FAB" H 10430 5800 20  0001 C CNN
F 3 "" H 10400 5650 50  0001 C CNN
	1    10400 5650
	0    1    1    0   
$EndComp
Wire Wire Line
	10400 5350 10400 5450
Connection ~ 10400 5350
Wire Wire Line
	10400 5350 10500 5350
Wire Wire Line
	10400 5850 10700 5850
Wire Wire Line
	10700 5450 10700 5850
Connection ~ 10700 5850
Wire Wire Line
	10700 5850 11000 5850
$Comp
L fab:RES-US1206FAB R23
U 1 1 5EE880A9
P 8800 5000
F 0 "R23" H 8550 5050 45  0000 L CNN
F 1 "10kΩ" H 8650 5100 45  0000 L CNN
F 2 "fab:fab-R1206FAB" H 8830 5150 20  0001 C CNN
F 3 "" H 8800 5000 50  0001 C CNN
	1    8800 5000
	0    1    1    0   
$EndComp
Wire Wire Line
	8350 5200 8800 5200
Connection ~ 8800 5200
Wire Wire Line
	8800 5200 9000 5200
Wire Wire Line
	9000 4600 8350 4600
Wire Wire Line
	8700 5150 8700 4700
Wire Wire Line
	8700 4700 8800 4700
Wire Wire Line
	8800 4700 8800 4800
Wire Wire Line
	10700 4850 10700 5050
Wire Notes Line
	11600 4250 7850 4250
Wire Notes Line
	7850 4250 7850 5950
Wire Notes Line
	7850 5950 11600 5950
Wire Notes Line
	11600 4250 11600 5950
Wire Wire Line
	8350 4600 8350 4750
Wire Wire Line
	8350 4750 8500 4750
Connection ~ 8350 4750
Wire Wire Line
	8350 4750 8350 5100
Wire Wire Line
	8500 5150 8700 5150
Wire Notes Line
	1300 6350 7150 6350
Wire Notes Line
	7150 6350 7150 850 
Wire Notes Line
	7150 850  1300 850 
Wire Notes Line
	1300 850  1300 6350
Text Notes 1550 1050 0    50   ~ 0
BARDUINO
Wire Wire Line
	9400 9600 9500 9600
$Comp
L fab:SLIDE-SWITCH S1
U 1 1 5EB9DFB9
P 2200 1850
F 0 "S1" H 2200 2129 45  0000 C CNN
F 1 "SLIDE-SWITCH" H 2200 2045 45  0000 C CNN
F 2 "fab:fab-AYZ0102AGRLC" H 2230 2000 20  0001 C CNN
F 3 "" H 2200 1850 50  0001 C CNN
	1    2200 1850
	1    0    0    -1  
$EndComp
Wire Wire Line
	1850 1850 2000 1850
Text GLabel 2600 1950 2    50   Input ~ 0
5VUP
Wire Wire Line
	2400 1950 2600 1950
Text GLabel 1850 1850 0    50   Input ~ 0
5V
$Comp
L Barduino:BarduinoUSB U2
U 1 1 5E9A23DD
P 4400 3450
F 0 "U2" H 4400 5887 60  0000 C CNN
F 1 "BarduinoUSB" H 4400 5781 60  0000 C CNN
F 2 "Barduino:BarduinoMicroUSB" H 4750 5850 60  0001 C CNN
F 3 "" H 3950 4950 60  0001 C CNN
	1    4400 3450
	1    0    0    -1  
$EndComp
Text GLabel 2700 3350 0    50   Input ~ 0
5VUP
Wire Wire Line
	2700 3350 2950 3350
Text GLabel 2700 3450 0    50   Input ~ 0
3V3
Wire Wire Line
	2700 3450 2950 3450
Wire Wire Line
	2700 4550 2950 4550
Wire Wire Line
	2700 4450 2950 4450
Wire Wire Line
	2700 4350 2950 4350
Wire Wire Line
	2700 4250 2950 4250
Wire Wire Line
	2700 4150 2950 4150
Wire Wire Line
	2700 4050 2950 4050
Wire Wire Line
	2700 3950 2950 3950
Wire Wire Line
	2700 3850 2950 3850
Wire Wire Line
	2700 3750 2950 3750
Wire Wire Line
	2700 3650 2950 3650
Wire Wire Line
	2700 3550 2950 3550
Text GLabel 2700 4550 0    50   Input ~ 0
X_Step
Text GLabel 2700 4450 0    50   Input ~ 0
X_Dir
Text GLabel 2700 4050 0    50   Input ~ 0
Z_Step
Text GLabel 2700 4350 0    50   Input ~ 0
Y_Step
Text GLabel 4900 5900 2    50   Input ~ 0
Flood
Text GLabel 2700 3950 0    50   Input ~ 0
Z_Dir
Text GLabel 4900 5800 2    50   Input ~ 0
Probe
Text GLabel 2700 3650 0    50   Input ~ 0
Door
Text GLabel 2700 3850 0    50   Input ~ 0
Grbl_Reset
Text GLabel 2700 3750 0    50   Input ~ 0
Start
Text GLabel 2700 3550 0    50   Input ~ 0
Hold
Text GLabel 6150 3550 2    50   Input ~ 0
GND
Wire Wire Line
	6150 3550 5850 3550
Text GLabel 6150 3650 2    50   Input ~ 0
MOSI
Wire Wire Line
	6150 3650 5850 3650
Text GLabel 6150 3750 2    50   Input ~ 0
Spindle_Ena
NoConn ~ 5850 3850
NoConn ~ 5850 3950
Text GLabel 6200 4050 2    50   Input ~ 0
Mist
Wire Wire Line
	6200 4050 5850 4050
Wire Wire Line
	6200 4150 5850 4150
Wire Wire Line
	5850 4250 6200 4250
Wire Wire Line
	6250 4350 5850 4350
Wire Wire Line
	5850 4450 6250 4450
Wire Wire Line
	6250 4550 5850 4550
Wire Wire Line
	5850 4650 6250 4650
NoConn ~ 4150 5400
NoConn ~ 4250 5400
NoConn ~ 4350 5400
NoConn ~ 4450 5400
Text GLabel 10900 8600 2    50   Input ~ 0
GND
Wire Wire Line
	2900 8950 3850 8950
Wire Wire Line
	3150 9150 3850 9150
Wire Wire Line
	3600 9550 3600 9900
Wire Wire Line
	3400 9350 3850 9350
Wire Wire Line
	1950 9050 2200 9050
Wire Wire Line
	2200 9050 2200 9250
Wire Wire Line
	1950 9250 2200 9250
Connection ~ 2200 9250
Wire Wire Line
	2200 9250 2200 9450
Wire Wire Line
	1950 9450 2200 9450
Connection ~ 2200 9450
Wire Wire Line
	2200 9450 2200 9650
Wire Wire Line
	1950 9650 2200 9650
Connection ~ 2200 9650
Wire Wire Line
	2200 9650 2200 9850
Wire Wire Line
	1950 9850 2200 9850
Connection ~ 2200 9850
Wire Wire Line
	2200 9850 2200 10300
Wire Wire Line
	1950 9750 2400 9750
Wire Wire Line
	2800 9750 3850 9750
Wire Wire Line
	3400 9350 3400 9900
Wire Wire Line
	3150 9150 3150 9900
Wire Wire Line
	2900 8950 2900 9900
Wire Wire Line
	3600 9550 3850 9550
Wire Wire Line
	3950 9750 3850 9750
Connection ~ 3850 9750
Wire Wire Line
	3850 9750 3850 9900
Wire Wire Line
	2400 9550 1950 9550
Wire Wire Line
	1950 9350 2400 9350
Wire Wire Line
	1950 9150 2400 9150
Connection ~ 3150 7350
Wire Wire Line
	3150 7250 3150 7350
Wire Wire Line
	3200 7350 3150 7350
$Comp
L Connector_Generic:Conn_02x02_Odd_Even JP4
U 1 1 5ECDBB6C
P 2850 7250
F 0 "JP4" H 2900 7467 50  0000 C CNN
F 1 "JUMPMSFT" H 2900 7376 50  0000 C CNN
F 2 "fab:fab-2X02SMD" H 2850 7250 50  0001 C CNN
F 3 "~" H 2850 7250 50  0001 C CNN
	1    2850 7250
	1    0    0    -1  
$EndComp
Text GLabel 3200 7350 2    50   Input ~ 0
Spindle_PWM_5V
Wire Wire Line
	4700 7000 5150 7000
Text GLabel 5150 6900 2    50   Input ~ 0
Spindle_Ena
Wire Wire Line
	2550 7250 2650 7250
Wire Wire Line
	4700 6900 5150 6900
Text GLabel 2550 7350 0    50   Input ~ 0
Spindle_PWM_5VOUT
Wire Wire Line
	2550 7350 2650 7350
Text GLabel 5150 7100 2    50   Input ~ 0
Spindle_PWM_5VOUT
$Comp
L Connector:Barrel_Jack_Switch J1
U 1 1 5EC9B873
P 10350 8500
F 0 "J1" H 10407 8817 50  0000 C CNN
F 1 "Barrel_Jack_Switch" H 10407 8726 50  0000 C CNN
F 2 "Connector_BarrelJack:BarrelJack_Wuerth_6941xx301002" H 10400 8460 50  0001 C CNN
F 3 "~" H 10400 8460 50  0001 C CNN
	1    10350 8500
	1    0    0    -1  
$EndComp
Wire Wire Line
	10900 8400 10650 8400
Wire Wire Line
	10650 8500 10800 8500
Wire Wire Line
	10800 8500 10800 8600
Wire Wire Line
	10800 8600 10900 8600
Wire Wire Line
	10800 8600 10650 8600
Connection ~ 10800 8600
Wire Wire Line
	8500 5100 8500 5150
Wire Wire Line
	8500 4750 8500 4800
$Comp
L Diode:1N4004 D1
U 1 1 5ED84457
P 8500 4950
F 0 "D1" V 8300 4950 50  0000 L CNN
F 1 "1N4004" H 8350 5050 50  0000 L CNN
F 2 "Diode_THT:D_DO-41_SOD81_P10.16mm_Horizontal" H 8500 4775 50  0001 C CNN
F 3 "http://www.vishay.com/docs/88503/1n4001.pdf" H 8500 4950 50  0001 C CNN
	1    8500 4950
	0    1    1    0   
$EndComp
$Comp
L Diode:1N4004 D2
U 1 1 5ED864D0
P 9650 9600
F 0 "D2" H 9650 9500 50  0000 L CNN
F 1 "1N4004" H 9550 9700 50  0000 L CNN
F 2 "Diode_THT:D_DO-41_SOD81_P10.16mm_Horizontal" H 9650 9425 50  0001 C CNN
F 3 "http://www.vishay.com/docs/88503/1n4001.pdf" H 9650 9600 50  0001 C CNN
	1    9650 9600
	-1   0    0    1   
$EndComp
NoConn ~ 4050 5400
Wire Wire Line
	4550 5900 4550 5400
Text GLabel 4900 5650 2    50   Input ~ 0
Spindle_PWM_3V
Text GLabel 6400 7000 2    50   Input ~ 0
Spindle_PWM_3V
Wire Wire Line
	5850 3750 6150 3750
Wire Wire Line
	4650 5800 4900 5800
Wire Wire Line
	4550 5900 4900 5900
$Comp
L Logic_LevelTranslator:TXS0102DCT U3
U 1 1 5EF00895
P 9700 1750
F 0 "U3" H 9850 1250 50  0000 C CNN
F 1 "TXS0102DCT" H 10050 1150 50  0000 C CNN
F 2 "Package_SO:SSOP-8_2.95x2.8mm_P0.65mm" H 9700 1200 50  0001 C CNN
F 3 "http://www.ti.com/lit/gpn/txs0102" H 9700 1730 50  0001 C CNN
	1    9700 1750
	1    0    0    -1  
$EndComp
Wire Wire Line
	9600 1250 9600 1200
Text GLabel 8350 2550 0    50   Input ~ 0
GND
Wire Wire Line
	8350 2550 8450 2550
Wire Wire Line
	8450 2550 8450 2350
Wire Wire Line
	9700 2250 9700 2550
Connection ~ 8450 2550
Text GLabel 10500 1650 2    50   Input ~ 0
Spindle_PWM_5V
Wire Wire Line
	9150 1650 9300 1650
$Comp
L fab:CAP-US1206FAB C14
U 1 1 5EF0936B
P 8450 2150
F 0 "C14" V 8400 2050 45  0000 L CNN
F 1 "100nF" H 8400 2050 45  0000 L CNN
F 2 "fab:fab-C1206FAB" H 8480 2300 20  0001 C CNN
F 3 "" H 8450 2150 50  0001 C CNN
	1    8450 2150
	0    1    1    0   
$EndComp
Text GLabel 9150 1650 0    50   Input ~ 0
Spindle_PWM_3V
Text GLabel 11400 1200 2    50   Input ~ 0
5V
Text GLabel 8150 1200 0    50   Input ~ 0
3V3
Text GLabel 9150 2050 0    50   Input ~ 0
Spindle_Ena
Wire Wire Line
	9800 1200 11250 1200
Connection ~ 11250 1200
Wire Wire Line
	11250 1200 11400 1200
Wire Wire Line
	11250 2550 11250 2250
Connection ~ 9700 2550
NoConn ~ 10100 1850
NoConn ~ 9300 1850
Wire Wire Line
	10100 1650 10500 1650
Wire Wire Line
	9700 2550 11250 2550
Wire Wire Line
	9150 2050 9300 2050
Wire Wire Line
	8450 2550 9700 2550
Text Notes 8950 1000 0    50   ~ 0
Level Shifter (optional for no external pcb)\n
Wire Notes Line
	7850 850  11600 850 
Wire Notes Line
	11600 850  11600 2650
Wire Notes Line
	11600 2650 7850 2650
Wire Notes Line
	7850 2650 7850 850 
Wire Wire Line
	9800 1200 9800 1250
Wire Wire Line
	11250 1950 11250 1200
Wire Wire Line
	8150 1200 8450 1200
Wire Wire Line
	8450 2050 8450 1200
Connection ~ 8450 1200
Wire Wire Line
	8450 1200 9600 1200
$Comp
L fab:CAP-US1206FAB C13
U 1 1 5F0974E9
P 11250 2050
F 0 "C13" V 11200 1950 45  0000 L CNN
F 1 "100nF" H 11200 1950 45  0000 L CNN
F 2 "fab:fab-C1206FAB" H 11280 2200 20  0001 C CNN
F 3 "" H 11250 2050 50  0001 C CNN
	1    11250 2050
	0    1    1    0   
$EndComp
Text GLabel 1800 2250 0    50   Input ~ 0
5VUP
$Comp
L fab:LEDFAB1206 PWRUP1
U 1 1 5F5D9B72
P 2150 2600
F 0 "PWRUP1" V 2050 2700 45  0000 L CNN
F 1 "RED" V 1950 2550 45  0000 L CNN
F 2 "fab:fab-LED1206FAB" H 2180 2750 20  0001 C CNN
F 3 "" H 2150 2600 50  0001 C CNN
	1    2150 2600
	1    0    0    -1  
$EndComp
$Comp
L fab:RES-US1206FAB R25
U 1 1 5F5DB468
P 2400 2550
F 0 "R25" V 2200 2600 45  0000 L CNN
F 1 "1kΩ" H 2250 2650 45  0000 L CNN
F 2 "fab:fab-R1206FAB" H 2430 2700 20  0001 C CNN
F 3 "" H 2400 2550 50  0001 C CNN
	1    2400 2550
	0    1    1    0   
$EndComp
Text GLabel 1850 2800 0    50   Input ~ 0
GND
Wire Wire Line
	1800 2250 2150 2250
Wire Wire Line
	2150 2250 2150 2400
Wire Wire Line
	1850 2800 2400 2800
Wire Wire Line
	2400 2800 2400 2750
Wire Wire Line
	2150 2700 2150 2750
Wire Wire Line
	2150 2750 2300 2750
Wire Wire Line
	2300 2750 2300 2250
Wire Wire Line
	2300 2250 2400 2250
Wire Wire Line
	2400 2250 2400 2350
$Comp
L fab:CAP-US1206FAB C21
U 1 1 5EE592B0
P 9850 9500
F 0 "C21" H 9850 9350 45  0000 L CNN
F 1 "10uF" H 9850 9250 45  0000 L CNN
F 2 "fab:fab-C1206FAB" H 9880 9650 20  0001 C CNN
F 3 "" H 9850 9500 50  0001 C CNN
	1    9850 9500
	0    -1   -1   0   
$EndComp
Wire Wire Line
	9850 9300 9850 9250
Connection ~ 9850 9250
Wire Wire Line
	9850 9250 9400 9250
$Comp
L Connector:Screw_Terminal_01x02 J21
U 1 1 5EED8070
P 2900 7800
F 0 "J21" H 2818 7475 50  0000 C CNN
F 1 "Screw_Terminal_01x02" H 2818 7566 50  0000 C CNN
F 2 "TerminalBlock:TerminalBlock_bornier-2_P5.08mm" H 2900 7800 50  0001 C CNN
F 3 "~" H 2900 7800 50  0001 C CNN
	1    2900 7800
	-1   0    0    1   
$EndComp
Text GLabel 3400 7700 2    50   Input ~ 0
VMOT
Text GLabel 3400 7800 2    50   Input ~ 0
Splindle_M-
Wire Wire Line
	3400 7800 3100 7800
Wire Wire Line
	3100 7700 3400 7700
$Comp
L Connector:Conn_01x04_Male J7
U 1 1 5F0753C4
P 6050 7000
F 0 "J7" H 6200 7300 50  0000 C CNN
F 1 "Conn_01x04_Male" H 6150 7250 50  0000 C CNN
F 2 "fab:fab-1X04" H 6050 7000 50  0001 C CNN
F 3 "~" H 6050 7000 50  0001 C CNN
	1    6050 7000
	1    0    0    -1  
$EndComp
Text GLabel 5150 7000 2    50   Input ~ 0
Spindle_PWM_5VOUT
Text GLabel 6400 7100 2    50   Input ~ 0
Spindle_PWM_3V
Text GLabel 6400 7200 2    50   Input ~ 0
GND
Text GLabel 6400 6900 2    50   Input ~ 0
Spindle_Ena
Wire Wire Line
	6250 6900 6400 6900
Wire Wire Line
	6250 7000 6400 7000
Wire Wire Line
	6250 7100 6400 7100
Wire Wire Line
	6250 7200 6400 7200
Text GLabel 8700 8550 2    50   Input ~ 0
VMOT
Text GLabel 8250 9600 0    50   Input ~ 0
VIN
Text Notes 9850 10350 0    50   ~ 0
Test
Wire Wire Line
	10600 10450 10350 10450
Text GLabel 10600 10450 2    50   Input ~ 0
GND
Wire Wire Line
	10350 10350 10600 10350
Text GLabel 10600 10350 2    50   Input ~ 0
3V3
Wire Wire Line
	10600 10250 10350 10250
Text GLabel 10600 10250 2    50   Input ~ 0
5V
Wire Wire Line
	10600 10150 10350 10150
Text GLabel 10600 10150 2    50   Input ~ 0
VMOT
$Comp
L Connector:Conn_01x04_Male J10
U 1 1 5EEC43B5
P 10150 10250
F 0 "J10" H 10258 10531 50  0000 C CNN
F 1 "Conn_01x04_Male" H 10258 10440 50  0000 C CNN
F 2 "fab:fab-1X04" H 10150 10250 50  0001 C CNN
F 3 "~" H 10150 10250 50  0001 C CNN
	1    10150 10250
	1    0    0    -1  
$EndComp
Text GLabel 8300 8550 0    50   Input ~ 0
VIN
Text GLabel 10900 8400 2    50   Input ~ 0
VIN
$Comp
L Diode:1N4004 D3
U 1 1 5EF81757
P 8500 8550
F 0 "D3" H 8500 8450 50  0000 L CNN
F 1 "1N4004" H 8350 8650 50  0000 L CNN
F 2 "Diode_THT:D_DO-41_SOD81_P10.16mm_Horizontal" H 8500 8375 50  0001 C CNN
F 3 "http://www.vishay.com/docs/88503/1n4001.pdf" H 8500 8550 50  0001 C CNN
	1    8500 8550
	-1   0    0    1   
$EndComp
Wire Wire Line
	8300 8550 8350 8550
Wire Wire Line
	8650 8550 8700 8550
Wire Wire Line
	9800 9600 9850 9600
Connection ~ 9850 9600
Wire Wire Line
	9850 9600 9900 9600
Wire Wire Line
	10400 3500 9950 3500
Connection ~ 8750 3500
Wire Wire Line
	8750 3500 9000 3500
Wire Wire Line
	8750 3900 8750 4000
Connection ~ 8750 4000
Wire Wire Line
	8750 4000 8950 4000
$EndSCHEMATC
