EESchema Schematic File Version 4
EELAYER 30 0
EELAYER END
$Descr A4 11693 8268
encoding utf-8
Sheet 1 1
Title ""
Date ""
Rev ""
Comp ""
Comment1 ""
Comment2 ""
Comment3 ""
Comment4 ""
$EndDescr
$Comp
L fab:ESP32-WROOM U1
U 1 1 5E964A15
P 3650 2500
F 0 "U1" H 3625 3887 60  0000 C CNN
F 1 "ESP32-WROOM" H 3625 3781 60  0000 C CNN
F 2 "fab-ESP32-WROOM" H 4000 3850 60  0001 C CNN
F 3 "" H 3200 2950 60  0001 C CNN
	1    3650 2500
	1    0    0    -1  
$EndComp
$Comp
L fab:6MM_SWITCH6MM_SWITCH S2
U 1 1 5E966032
P 10150 5450
F 0 "S2" V 9821 5450 45  0000 C CNN
F 1 "RST" V 9905 5450 45  0000 C CNN
F 2 "fab-6MM_SWITCH" H 10180 5600 20  0001 C CNN
F 3 "" H 10150 5450 50  0001 C CNN
	1    10150 5450
	0    1    1    0   
$EndComp
$Comp
L Interface_USB:FT230XS U2
U 1 1 5E967429
P 9750 2400
F 0 "U2" H 9750 3281 50  0000 C CNN
F 1 "FT230XS" H 9750 3190 50  0000 C CNN
F 2 "Package_SO:SSOP-16_3.9x4.9mm_P0.635mm" H 10750 1800 50  0001 C CNN
F 3 "https://www.ftdichip.com/Support/Documents/DataSheets/ICs/DS_FT230X.pdf" H 9750 2400 50  0001 C CNN
	1    9750 2400
	1    0    0    -1  
$EndComp
Text GLabel 9450 3200 0    50   Input ~ 0
GND
Wire Wire Line
	9650 3100 9650 3200
Wire Wire Line
	9650 3200 9450 3200
Text GLabel 9400 1550 0    50   Input ~ 0
5V
Wire Wire Line
	9400 1550 9650 1550
Wire Wire Line
	9650 1550 9650 1700
Text GLabel 9000 2400 0    50   Input ~ 0
USBDP
Wire Wire Line
	9000 2400 9050 2400
Text GLabel 9000 2300 0    50   Input ~ 0
USBDM
Wire Wire Line
	9000 2300 9050 2300
Text GLabel 10650 2000 2    50   Input ~ 0
TX
Text GLabel 10650 2100 2    50   Input ~ 0
RX
Wire Wire Line
	10450 2000 10650 2000
Wire Wire Line
	10450 2100 10650 2100
$Comp
L fab:SLIDE-SWITCH S1
U 1 1 5E96C8E0
P 7850 5700
F 0 "S1" H 7850 5979 45  0000 C CNN
F 1 "PROG" H 7850 5895 45  0000 C CNN
F 2 "fab-AYZ0102AGRLC" H 7880 5850 20  0001 C CNN
F 3 "" H 7850 5700 50  0001 C CNN
	1    7850 5700
	1    0    0    -1  
$EndComp
Text GLabel 7400 5700 0    50   Input ~ 0
PROG
Wire Wire Line
	7400 5700 7650 5700
Text GLabel 8250 5600 2    50   Input ~ 0
GND
Wire Wire Line
	8250 5600 8050 5600
$Comp
L fab:PINHD-1x12-HEADER M6
U 1 1 5E970BEC
P 5600 2250
F 0 "M6" H 5600 2250 45  0001 C CNN
F 1 "PINHD-1x12-HEADER" H 5600 2250 45  0001 C CNN
F 2 "fab-1X12" H 5630 2400 20  0001 C CNN
F 3 "" H 5600 2250 50  0001 C CNN
	1    5600 2250
	1    0    0    -1  
$EndComp
Text GLabel 5450 3150 2    50   Input ~ 0
GND
Wire Wire Line
	4550 3050 4700 3050
Wire Wire Line
	4700 3050 4700 3150
Wire Wire Line
	4700 3150 5450 3150
Wire Wire Line
	4550 3150 4700 3150
Connection ~ 4700 3150
Text GLabel 2550 3700 0    50   Input ~ 0
GND
Wire Wire Line
	2550 3700 2650 3700
Wire Wire Line
	2650 3700 2650 3200
Wire Wire Line
	2650 3200 2700 3200
Wire Wire Line
	2650 3700 3200 3700
Wire Wire Line
	3200 3700 3200 3550
Connection ~ 2650 3700
Text GLabel 5450 2950 2    50   Input ~ 0
PROG
$Comp
L fab:VOLTAGE-REGULATOR-SOT223 U3
U 1 1 5E977E95
P 7900 2350
F 0 "U3" H 7900 2592 50  0000 C CNN
F 1 "REG" H 7900 2501 50  0000 C CNN
F 2 "fab-SOT223" H 7900 2550 50  0001 C CNN
F 3 "" H 8000 2100 50  0001 C CNN
	1    7900 2350
	1    0    0    -1  
$EndComp
Text GLabel 7500 2350 0    50   Input ~ 0
5V
Text GLabel 7550 2750 0    50   Input ~ 0
GND
Text GLabel 8300 2350 2    50   Input ~ 0
3V3
Wire Wire Line
	8300 2350 8200 2350
Wire Wire Line
	7900 2650 7900 2750
Wire Wire Line
	7900 2750 7550 2750
Wire Wire Line
	7500 2350 7600 2350
Text GLabel 2350 1700 0    50   Input ~ 0
3V3
Text GLabel 2350 1800 0    50   Input ~ 0
EN
$Comp
L fab:RES-US1206FAB R1
U 1 1 5E97CFAF
P 9400 5800
F 0 "R1" V 9358 5868 45  0000 L CNN
F 1 "10kΩ" V 9442 5868 45  0000 L CNN
F 2 "fab-R1206FAB" H 9430 5950 20  0001 C CNN
F 3 "" H 9400 5800 50  0001 C CNN
	1    9400 5800
	0    1    1    0   
$EndComp
Wire Wire Line
	9400 5600 9400 5550
Wire Wire Line
	9400 5550 9800 5550
Wire Wire Line
	9950 5450 9800 5450
Wire Wire Line
	9800 5450 9800 5550
Connection ~ 9800 5550
Wire Wire Line
	9800 5550 9950 5550
Text GLabel 9100 6050 0    50   Input ~ 0
3V3
Wire Wire Line
	9400 6000 9400 6050
Wire Wire Line
	9400 6050 9100 6050
Text GLabel 10650 5550 2    50   Input ~ 0
GND
Wire Wire Line
	10650 5550 10500 5550
Wire Wire Line
	10350 5450 10500 5450
Wire Wire Line
	10500 5450 10500 5550
Connection ~ 10500 5550
Wire Wire Line
	10500 5550 10350 5550
Text GLabel 9100 5550 0    50   Input ~ 0
EN
Wire Wire Line
	9100 5550 9400 5550
Connection ~ 9400 5550
Text Notes 8600 5000 0    50   ~ 0
PROG AND RESET
Wire Notes Line
	11000 4800 7000 4800
Wire Notes Line
	7000 4800 7000 6350
Wire Notes Line
	7000 6350 11000 6350
Wire Notes Line
	11000 6350 11000 4800
Wire Wire Line
	9050 2600 9000 2600
Wire Notes Line
	7000 4600 11000 4600
Text Notes 8750 1050 0    50   ~ 0
USB AND POWER
Text GLabel 7500 3750 0    50   Input ~ 0
D-
Text GLabel 7500 4300 0    50   Input ~ 0
GND
Text GLabel 8300 3750 0    50   Input ~ 0
D+
$Comp
L fab:CAP-US1206FAB C1
U 1 1 5E99AC8B
P 7850 4000
F 0 "C1" H 7850 3850 45  0000 L CNN
F 1 "10pF" H 7800 4150 45  0000 L CNN
F 2 "fab-C1206FAB" H 7880 4150 20  0001 C CNN
F 3 "" H 7850 4000 50  0001 C CNN
	1    7850 4000
	0    1    1    0   
$EndComp
$Comp
L fab:CAP-US1206FAB C2
U 1 1 5E99B6E3
P 8600 3950
F 0 "C2" H 8650 3800 45  0000 L CNN
F 1 "10pF" H 8600 4100 45  0000 L CNN
F 2 "fab-C1206FAB" H 8630 4100 20  0001 C CNN
F 3 "" H 8600 3950 50  0001 C CNN
	1    8600 3950
	0    1    1    0   
$EndComp
Wire Wire Line
	7500 4300 7850 4300
Wire Wire Line
	7850 4300 7850 4200
Wire Wire Line
	7850 4300 8600 4300
Wire Wire Line
	8600 4300 8600 4150
Connection ~ 7850 4300
Wire Wire Line
	7500 3750 7850 3750
Wire Wire Line
	7850 3750 7850 3900
Wire Wire Line
	8300 3750 8600 3750
Wire Wire Line
	8600 3750 8600 3850
Connection ~ 8600 4300
Text GLabel 9000 3750 0    50   Input ~ 0
5V
$Comp
L fab:CAP-US1206FAB C3
U 1 1 5E9A2281
P 9250 3950
F 0 "C3" H 9300 3800 45  0000 L CNN
F 1 "1uF" H 9250 4100 45  0000 L CNN
F 2 "fab-C1206FAB" H 9280 4100 20  0001 C CNN
F 3 "" H 9250 3950 50  0001 C CNN
	1    9250 3950
	0    1    1    0   
$EndComp
Wire Wire Line
	9000 3750 9250 3750
Wire Wire Line
	9250 3750 9250 3850
Wire Wire Line
	9250 4300 9250 4150
Wire Wire Line
	8600 4300 9250 4300
Text GLabel 7500 3050 0    50   Input ~ 0
D+
Text GLabel 7500 3400 0    50   Input ~ 0
D-
Text GLabel 8150 3050 2    50   Input ~ 0
USBDP
Text GLabel 8150 3400 2    50   Input ~ 0
USBDM
$Comp
L fab:RES-US1206FAB R3
U 1 1 5E9A8374
P 7800 3050
F 0 "R3" H 7800 2950 45  0000 C CNN
F 1 "49Ω" H 7800 3150 45  0000 C CNN
F 2 "fab-R1206FAB" H 7830 3200 20  0001 C CNN
F 3 "" H 7800 3050 50  0001 C CNN
	1    7800 3050
	-1   0    0    1   
$EndComp
$Comp
L fab:RES-US1206FAB R2
U 1 1 5E9A989B
P 7800 3400
F 0 "R2" H 7800 3300 45  0000 C CNN
F 1 "49Ω" H 7800 3500 45  0000 C CNN
F 2 "fab-R1206FAB" H 7830 3550 20  0001 C CNN
F 3 "" H 7800 3400 50  0001 C CNN
	1    7800 3400
	-1   0    0    1   
$EndComp
Wire Wire Line
	7500 3050 7600 3050
Wire Wire Line
	7500 3400 7600 3400
Wire Wire Line
	8000 3050 8150 3050
Wire Wire Line
	8000 3400 8150 3400
Text GLabel 9750 3750 0    50   Input ~ 0
3V3
$Comp
L fab:RES-US1206FAB R4
U 1 1 5E9C2417
P 9950 4000
F 0 "R4" H 9950 3900 45  0000 L CNN
F 1 "220Ω" H 9950 4100 45  0000 L CNN
F 2 "fab-R1206FAB" H 9980 4150 20  0001 C CNN
F 3 "" H 9950 4000 50  0001 C CNN
	1    9950 4000
	0    1    1    0   
$EndComp
$Comp
L fab:LEDFAB1206 M2
U 1 1 5E9C2E4F
P 10450 4050
F 0 "M2" V 10350 4150 45  0000 L CNN
F 1 "RED" V 10550 4050 45  0000 L CNN
F 2 "fab-LED1206FAB" H 10480 4200 20  0001 C CNN
F 3 "" H 10450 4050 50  0001 C CNN
	1    10450 4050
	1    0    0    -1  
$EndComp
Wire Wire Line
	9250 4300 10450 4300
Wire Wire Line
	10450 4300 10450 4150
Connection ~ 9250 4300
Wire Wire Line
	9750 3750 9950 3750
Wire Wire Line
	9950 3750 9950 3800
Wire Wire Line
	9950 4200 9950 4250
Wire Wire Line
	9950 4250 10200 4250
Wire Wire Line
	10200 4250 10200 3750
Wire Wire Line
	10200 3750 10450 3750
Wire Wire Line
	10450 3750 10450 3850
Wire Notes Line
	11000 900  7000 900 
Wire Notes Line
	11000 900  11000 4600
Wire Notes Line
	7000 900  7000 4600
$Comp
L fab:PINHD-1x13-HEADER M3
U 1 1 5E9D7F11
P 2050 2600
F 0 "M3" H 2050 2600 45  0001 C CNN
F 1 "PINHD-1x13-HEADER" H 2050 2600 45  0001 C CNN
F 2 "fab-1X13" H 2080 2750 20  0001 C CNN
F 3 "" H 2050 2600 50  0001 C CNN
	1    2050 2600
	-1   0    0    1   
$EndComp
Wire Wire Line
	2050 2100 2700 2100
Wire Wire Line
	2050 2200 2700 2200
Wire Wire Line
	2700 2300 2050 2300
Wire Wire Line
	2050 2400 2700 2400
Wire Wire Line
	2700 2500 2050 2500
Wire Wire Line
	2050 2600 2700 2600
Wire Wire Line
	2050 2700 2700 2700
Wire Wire Line
	2700 2800 2050 2800
Wire Wire Line
	2050 2900 2700 2900
Wire Wire Line
	2700 3000 2050 3000
Wire Wire Line
	2050 3100 2700 3100
Wire Wire Line
	4550 2850 5600 2850
Wire Wire Line
	4550 2750 5600 2750
Wire Wire Line
	4550 2650 5600 2650
Wire Wire Line
	4550 2550 5600 2550
Wire Wire Line
	5600 2450 4550 2450
Wire Wire Line
	4550 2350 5600 2350
Wire Wire Line
	4550 2150 4750 2150
Wire Wire Line
	4750 2150 4750 2250
Wire Wire Line
	4750 2250 5600 2250
Wire Wire Line
	4550 2050 4850 2050
Wire Wire Line
	4850 2050 4850 2150
Wire Wire Line
	4850 2150 5600 2150
Wire Wire Line
	4550 1950 4950 1950
Wire Wire Line
	4950 1950 4950 2050
Wire Wire Line
	4950 2050 5600 2050
Wire Wire Line
	4550 1850 5050 1850
Wire Wire Line
	5050 1850 5050 1950
Wire Wire Line
	5050 1950 5600 1950
Wire Wire Line
	4550 1750 5150 1750
Wire Wire Line
	5150 1750 5150 1850
Wire Wire Line
	5150 1850 5600 1850
Text GLabel 5000 1650 0    50   Input ~ 0
GND
Wire Wire Line
	5250 1650 5250 1750
Wire Wire Line
	5250 1750 5600 1750
Wire Wire Line
	4550 2950 5450 2950
$Comp
L fab:PINHD-1x09-HEADER M5
U 1 1 5EA4FF9B
P 3600 3950
F 0 "M5" H 3600 3950 45  0001 C CNN
F 1 "PINHD-1x09-HEADER" H 3600 3950 45  0001 C CNN
F 2 "fab-1X09" H 3630 4100 20  0001 C CNN
F 3 "" H 3600 3950 50  0001 C CNN
	1    3600 3950
	0    1    1    0   
$EndComp
Wire Wire Line
	3300 3550 3300 3950
Wire Wire Line
	3400 3950 3400 3550
Wire Wire Line
	3500 3550 3500 3950
Wire Wire Line
	3600 3950 3600 3550
Wire Wire Line
	3700 3550 3700 3950
Wire Wire Line
	3800 3950 3800 3550
Wire Wire Line
	3900 3550 3900 3950
Wire Wire Line
	4000 3950 4000 3550
Wire Wire Line
	4100 3550 4100 3950
Wire Wire Line
	5000 1650 5250 1650
Text GLabel 5200 2050 2    50   Input ~ 0
RX
Text GLabel 5200 2150 2    50   Input ~ 0
TX
Wire Wire Line
	9850 1450 9850 1700
Wire Wire Line
	9400 1450 9850 1450
Text GLabel 9400 1450 0    50   Input ~ 0
VIO
Text GLabel 9000 2600 0    50   Input ~ 0
VIO
Text GLabel 8950 2000 0    50   Input ~ 0
VIO
Wire Wire Line
	8950 2000 9050 2000
Wire Wire Line
	2350 1700 2500 1700
Wire Wire Line
	2700 1700 2700 1900
Wire Wire Line
	2350 1800 2600 1800
Wire Wire Line
	2600 1800 2600 2000
Wire Wire Line
	2600 2000 2700 2000
Text GLabel 2200 1900 2    50   Input ~ 0
5V
Wire Wire Line
	2200 1900 2050 1900
Wire Wire Line
	2050 2000 2500 2000
Wire Wire Line
	2500 2000 2500 1700
Connection ~ 2500 1700
Wire Wire Line
	2500 1700 2700 1700
Text GLabel 7450 2050 2    50   Input ~ 0
GND
Text GLabel 7900 1550 2    50   Input ~ 0
D+
Text GLabel 8150 1350 2    50   Input ~ 0
5V
Wire Wire Line
	7900 1550 7600 1550
Text GLabel 7900 1650 2    50   Input ~ 0
D-
$Comp
L Connector:USB_B_Micro J1
U 1 1 5EE2D454
P 7300 1550
F 0 "J1" H 7357 2017 50  0000 C CNN
F 1 "USB_B_Micro" H 7357 1926 50  0000 C CNN
F 2 "Connector_USB:USB_Micro-B_Molex-105017-0001" H 7450 1500 50  0001 C CNN
F 3 "https://www.molex.com/pdm_docs/sd/1050170001_sd.pdf" H 7450 1500 50  0001 C CNN
	1    7300 1550
	1    0    0    -1  
$EndComp
Wire Wire Line
	7600 1650 7900 1650
NoConn ~ 7600 1750
Wire Wire Line
	7200 1950 7200 2050
Wire Wire Line
	7200 2050 7300 2050
Wire Wire Line
	7300 1950 7300 2050
Connection ~ 7300 2050
Wire Wire Line
	7300 2050 7450 2050
$Comp
L BarDuino2.2.micro-rescue:D_Schottky-fab-Device D1
U 1 1 5F5563F4
P 7900 1350
F 0 "D1" H 7900 1133 50  0000 C CNN
F 1 "D_Schottky" H 7900 1224 50  0000 C CNN
F 2 "fab:fab-SOD123" H 7900 1350 50  0001 C CNN
F 3 "http://www.st.com/content/ccc/resource/technical/document/datasheet/c6/32/d4/4a/28/d3/4b/11/CD00004930.pdf/files/CD00004930.pdf/jcr:content/translations/en.CD00004930.pdf" H 7900 1350 50  0001 C CNN
	1    7900 1350
	-1   0    0    1   
$EndComp
Wire Wire Line
	8050 1350 8150 1350
Wire Wire Line
	7600 1350 7750 1350
$EndSCHEMATC
