G04 #@! TF.GenerationSoftware,KiCad,Pcbnew,(5.1.5-0-10_14)*
G04 #@! TF.CreationDate,2020-09-21T09:42:30+02:00*
G04 #@! TF.ProjectId,BarDuino2.2.micro,42617244-7569-46e6-9f32-2e322e6d6963,rev?*
G04 #@! TF.SameCoordinates,Original*
G04 #@! TF.FileFunction,Copper,L2,Bot*
G04 #@! TF.FilePolarity,Positive*
%FSLAX46Y46*%
G04 Gerber Fmt 4.6, Leading zero omitted, Abs format (unit mm)*
G04 Created by KiCad (PCBNEW (5.1.5-0-10_14)) date 2020-09-21 09:42:30*
%MOMM*%
%LPD*%
G04 APERTURE LIST*
%ADD10O,1.524000X3.048000*%
%ADD11O,3.048000X1.524000*%
%ADD12C,1.450000*%
%ADD13O,1.900000X1.200000*%
G04 APERTURE END LIST*
D10*
X146660000Y-114700000D03*
X144120000Y-114700000D03*
X141580000Y-114700000D03*
X139040000Y-114700000D03*
X136500000Y-114700000D03*
X133960000Y-114700000D03*
X131420000Y-114700000D03*
X128880000Y-114700000D03*
X126340000Y-114700000D03*
D11*
X122700000Y-114720000D03*
X122700000Y-112180000D03*
X122700000Y-109640000D03*
X122700000Y-107100000D03*
X122700000Y-104560000D03*
X122700000Y-102020000D03*
X122700000Y-99480000D03*
X122700000Y-96940000D03*
X122700000Y-94400000D03*
X122700000Y-91860000D03*
X122700000Y-89320000D03*
X122700000Y-86780000D03*
X122700000Y-84240000D03*
X158500000Y-86760000D03*
X158500000Y-89300000D03*
X158500000Y-91840000D03*
X158500000Y-94380000D03*
X158500000Y-96920000D03*
X158500000Y-99460000D03*
X158500000Y-102000000D03*
X158500000Y-104540000D03*
X158500000Y-107080000D03*
X158500000Y-109620000D03*
X158500000Y-112160000D03*
X158500000Y-114700000D03*
D12*
X154407500Y-74110000D03*
X154407500Y-69110000D03*
D13*
X157107500Y-75110000D03*
X157107500Y-68110000D03*
M02*
