%!PS-Adobe-3.0
%%Creator: PCBNEW
%%CreationDate: Mon Sep 21 09:42:34 2020
%%Title: /Users/macoscar/Documents/04_Projects/02_FabLab/03_General/01_Repositories/fablabbcn-projects/electronics/barduino-2/BarDuino2.2.micro-KicadFiles/exports/gerbers/BarDuino2.2.micro-drl_map.ps
%%Pages: 1
%%PageOrder: Ascend
%%BoundingBox: 0 0 596 842
%%DocumentMedia: A4 595 842 0 () ()
%%Orientation: Landscape
%%EndComments
%%BeginProlog
/line { newpath moveto lineto stroke } bind def
/cir0 { newpath 0 360 arc stroke } bind def
/cir1 { newpath 0 360 arc gsave fill grestore stroke } bind def
/cir2 { newpath 0 360 arc gsave fill grestore stroke } bind def
/arc0 { newpath arc stroke } bind def
/arc1 { newpath 4 index 4 index moveto arc closepath gsave fill
    grestore stroke } bind def
/arc2 { newpath 4 index 4 index moveto arc closepath gsave fill
    grestore stroke } bind def
/poly0 { stroke } bind def
/poly1 { closepath gsave fill grestore stroke } bind def
/poly2 { closepath gsave fill grestore stroke } bind def
/rect0 { rectstroke } bind def
/rect1 { rectfill } bind def
/rect2 { rectfill } bind def
/linemode0 { 0 setlinecap 0 setlinejoin 0 setlinewidth } bind def
/linemode1 { 1 setlinecap 1 setlinejoin } bind def
/dashedline { [200] 100 setdash } bind def
/solidline { [] 0 setdash } bind def
/phantomshow { moveto
    /KicadFont findfont 0.000001 scalefont setfont
    show } bind def
/textshow { gsave
    findfont exch scalefont setfont concat 1 scale 0 0 moveto show
    } bind def
/reencodefont {
  findfont dup length dict begin
  { 1 index /FID ne
    { def }
    { pop pop } ifelse
  } forall
  /Encoding ISOLatin1Encoding def
  currentdict
  end } bind def
/KicadFont /Helvetica reencodefont definefont pop
/KicadFont-Bold /Helvetica-Bold reencodefont definefont pop
/KicadFont-Oblique /Helvetica-Oblique reencodefont definefont pop
/KicadFont-BoldOblique /Helvetica-BoldOblique reencodefont definefont pop
%%EndProlog
%%Page: 1 1
%%BeginPageSetup
gsave
0.0072 0.0072 scale
linemode1
82680 0 translate 90 rotate
95.5683 setlinewidth
%%EndPageSetup
0 0 0 setrgbcolor
90.3007 setlinewidth
73585.5 71616.5 714.881 180 219.9 arc0
0 0 0 setrgbcolor
73760.7 68998.3 713.984 -1.22976 39.4547 arc0
0 0 0 setrgbcolor
71562.3 77381 1309.36 -0 90 arc0
0 0 0 setrgbcolor
45600.8 42381.9 1309.36 180 270 arc0
0 0 0 setrgbcolor
73150.1 42389.4 1309.36 -90 -0 arc0
0 0 0 setrgbcolor
46315.7 76666.1 2031.77 90 179 arc0
0 0 0 setrgbcolor
37.6253 setlinewidth
69048.9 42276.5 323.14 cir0
0 0 0 setrgbcolor
66791.4 42276.5 333.149 cir0
0 0 0 setrgbcolor
90.3007 setlinewidth
newpath
72870.6 71616.5 moveto
72871.6 77381 lineto
stroke
0 0 0 setrgbcolor
newpath
74311.9 69452 moveto
73037 71157.9 lineto
stroke
0 0 0 setrgbcolor
newpath
44284.3 76701.5 moveto
44291.5 42381.9 lineto
stroke
0 0 0 setrgbcolor
newpath
71562.3 78690.3 moveto
46315.7 78697.8 lineto
stroke
0 0 0 setrgbcolor
newpath
74459.4 42389.4 moveto
74474.5 68983 lineto
stroke
0 0 0 setrgbcolor
newpath
45600.8 41072.5 moveto
73150.1 41080.1 lineto
stroke
78.74 setlinewidth
newpath
71537.8 77712.1 moveto
71989.3 77260.6 lineto
stroke
newpath
71989.3 77712.1 moveto
71537.8 77260.6 lineto
stroke
newpath
71500.2 77299.9 moveto
72027 77299.9 lineto
stroke
newpath
71500.2 77672.7 moveto
72027 77672.7 lineto
stroke
72027 77486.3 186.381 270 450 arc0
71500.2 77486.3 186.381 90 270 arc0
newpath
71537.8 72444.5 moveto
71989.3 71993 lineto
stroke
newpath
71989.3 72444.5 moveto
71537.8 71993 lineto
stroke
newpath
72027 72405.1 moveto
71500.2 72405.1 lineto
stroke
newpath
72027 72032.4 moveto
71500.2 72032.4 lineto
stroke
71500.2 72218.8 186.381 450 630 arc0
72027 72218.8 186.381 270 450 arc0
69731.8 76733.8 319.815 cir0
69731.8 72971.3 319.815 cir0
newpath
45871.7 65730.7 moveto
45871.7 64966.1 lineto
stroke
newpath
45489.5 65348.4 moveto
46254 65348.4 lineto
stroke
newpath
45871.7 63819.3 moveto
45871.7 63054.7 lineto
stroke
newpath
45489.5 63437 moveto
46254 63437 lineto
stroke
newpath
45871.7 61907.9 moveto
45871.7 61143.4 lineto
stroke
newpath
45489.5 61525.7 moveto
46254 61525.7 lineto
stroke
newpath
45871.7 59996.6 moveto
45871.7 59232 lineto
stroke
newpath
45489.5 59614.3 moveto
46254 59614.3 lineto
stroke
newpath
45871.7 58085.2 moveto
45871.7 57320.6 lineto
stroke
newpath
45489.5 57702.9 moveto
46254 57702.9 lineto
stroke
newpath
45871.7 56173.8 moveto
45871.7 55409.3 lineto
stroke
newpath
45489.5 55791.6 moveto
46254 55791.6 lineto
stroke
newpath
45871.7 54262.5 moveto
45871.7 53497.9 lineto
stroke
newpath
45489.5 53880.2 moveto
46254 53880.2 lineto
stroke
newpath
45871.7 52351.1 moveto
45871.7 51586.6 lineto
stroke
newpath
45489.5 51968.8 moveto
46254 51968.8 lineto
stroke
newpath
45871.7 50439.7 moveto
45871.7 49675.2 lineto
stroke
newpath
45489.5 50057.5 moveto
46254 50057.5 lineto
stroke
newpath
45871.7 48528.4 moveto
45871.7 47763.8 lineto
stroke
newpath
45489.5 48146.1 moveto
46254 48146.1 lineto
stroke
newpath
45871.7 46617 moveto
45871.7 45852.5 lineto
stroke
newpath
45489.5 46234.7 moveto
46254 46234.7 lineto
stroke
newpath
45871.7 44705.6 moveto
45871.7 43941.1 lineto
stroke
newpath
45489.5 44323.4 moveto
46254 44323.4 lineto
stroke
newpath
45871.7 42794.3 moveto
45871.7 42029.7 lineto
stroke
newpath
45489.5 42412 moveto
46254 42412 lineto
stroke
newpath
48610.9 42809.3 moveto
48610.9 42044.8 lineto
stroke
newpath
48228.6 42427.1 moveto
48993.1 42427.1 lineto
stroke
newpath
50522.2 42809.3 moveto
50522.2 42044.8 lineto
stroke
newpath
50139.9 42427.1 moveto
50904.5 42427.1 lineto
stroke
newpath
52433.6 42809.3 moveto
52433.6 42044.8 lineto
stroke
newpath
52051.3 42427.1 moveto
52815.9 42427.1 lineto
stroke
newpath
54344.9 42809.3 moveto
54344.9 42044.8 lineto
stroke
newpath
53962.7 42427.1 moveto
54727.2 42427.1 lineto
stroke
newpath
56256.3 42809.3 moveto
56256.3 42044.8 lineto
stroke
newpath
55874 42427.1 moveto
56638.6 42427.1 lineto
stroke
newpath
58167.7 42809.3 moveto
58167.7 42044.8 lineto
stroke
newpath
57785.4 42427.1 moveto
58550 42427.1 lineto
stroke
newpath
60079 42809.3 moveto
60079 42044.8 lineto
stroke
newpath
59696.8 42427.1 moveto
60461.3 42427.1 lineto
stroke
newpath
61990.4 42809.3 moveto
61990.4 42044.8 lineto
stroke
newpath
61608.1 42427.1 moveto
62372.7 42427.1 lineto
stroke
newpath
63901.8 42809.3 moveto
63901.8 42044.8 lineto
stroke
newpath
63519.5 42427.1 moveto
64284 42427.1 lineto
stroke
newpath
72811.4 63834.3 moveto
72811.4 63069.8 lineto
stroke
newpath
72429.2 63452.1 moveto
73193.7 63452.1 lineto
stroke
newpath
72811.4 61923 moveto
72811.4 61158.4 lineto
stroke
newpath
72429.2 61540.7 moveto
73193.7 61540.7 lineto
stroke
newpath
72811.4 60011.6 moveto
72811.4 59247.1 lineto
stroke
newpath
72429.2 59629.3 moveto
73193.7 59629.3 lineto
stroke
newpath
72811.4 58100.2 moveto
72811.4 57335.7 lineto
stroke
newpath
72429.2 57718 moveto
73193.7 57718 lineto
stroke
newpath
72811.4 56188.9 moveto
72811.4 55424.3 lineto
stroke
newpath
72429.2 55806.6 moveto
73193.7 55806.6 lineto
stroke
newpath
72811.4 54277.5 moveto
72811.4 53513 lineto
stroke
newpath
72429.2 53895.2 moveto
73193.7 53895.2 lineto
stroke
newpath
72811.4 52366.2 moveto
72811.4 51601.6 lineto
stroke
newpath
72429.2 51983.9 moveto
73193.7 51983.9 lineto
stroke
newpath
72811.4 50454.8 moveto
72811.4 49690.2 lineto
stroke
newpath
72429.2 50072.5 moveto
73193.7 50072.5 lineto
stroke
newpath
72811.4 48543.4 moveto
72811.4 47778.9 lineto
stroke
newpath
72429.2 48161.1 moveto
73193.7 48161.1 lineto
stroke
newpath
72811.4 46632.1 moveto
72811.4 45867.5 lineto
stroke
newpath
72429.2 46249.8 moveto
73193.7 46249.8 lineto
stroke
newpath
72811.4 44720.7 moveto
72811.4 43956.1 lineto
stroke
newpath
72429.2 44338.4 moveto
73193.7 44338.4 lineto
stroke
newpath
72811.4 42809.3 moveto
72811.4 42044.8 lineto
stroke
newpath
72429.2 42427.1 moveto
73193.7 42427.1 lineto
stroke
118.11 setlinewidth
0 0 0 setrgbcolor
0 0 0 setrgbcolor
newpath
43537.9 35175.5 moveto
43537.9 36356.6 lineto
43819.1 36356.6 lineto
43987.8 36300.3 lineto
44100.3 36187.9 lineto
44156.5 36075.4 lineto
44212.8 35850.4 lineto
44212.8 35681.7 lineto
44156.5 35456.7 lineto
44100.3 35344.2 lineto
43987.8 35231.7 lineto
43819.1 35175.5 lineto
43537.9 35175.5 lineto
stroke
newpath
44719 35175.5 moveto
44719 35962.9 lineto
stroke
newpath
44719 35737.9 moveto
44775.2 35850.4 lineto
44831.5 35906.6 lineto
44943.9 35962.9 lineto
45056.4 35962.9 lineto
stroke
newpath
45450.1 35175.5 moveto
45450.1 35962.9 lineto
stroke
newpath
45450.1 36356.6 moveto
45393.9 36300.3 lineto
45450.1 36244.1 lineto
45506.4 36300.3 lineto
45450.1 36356.6 lineto
45450.1 36244.1 lineto
stroke
newpath
46181.3 35175.5 moveto
46068.8 35231.7 lineto
46012.6 35344.2 lineto
46012.6 36356.6 lineto
stroke
newpath
46800 35175.5 moveto
46687.5 35231.7 lineto
46631.2 35344.2 lineto
46631.2 36356.6 lineto
stroke
newpath
48149.8 35175.5 moveto
48149.8 36356.6 lineto
48543.5 35512.9 lineto
48937.2 36356.6 lineto
48937.2 35175.5 lineto
stroke
newpath
50005.8 35175.5 moveto
50005.8 35794.2 lineto
49949.6 35906.6 lineto
49837.1 35962.9 lineto
49612.1 35962.9 lineto
49499.6 35906.6 lineto
stroke
newpath
50005.8 35231.7 moveto
49893.3 35175.5 lineto
49612.1 35175.5 lineto
49499.6 35231.7 lineto
49443.4 35344.2 lineto
49443.4 35456.7 lineto
49499.6 35569.2 lineto
49612.1 35625.4 lineto
49893.3 35625.4 lineto
50005.8 35681.7 lineto
stroke
newpath
50568.2 35962.9 moveto
50568.2 34781.8 lineto
stroke
newpath
50568.2 35906.6 moveto
50680.7 35962.9 lineto
50905.7 35962.9 lineto
51018.2 35906.6 lineto
51074.4 35850.4 lineto
51130.7 35737.9 lineto
51130.7 35400.5 lineto
51074.4 35288 lineto
51018.2 35231.7 lineto
50905.7 35175.5 lineto
50680.7 35175.5 lineto
50568.2 35231.7 lineto
stroke
newpath
51636.9 35288 moveto
51693.1 35231.7 lineto
51636.9 35175.5 lineto
51580.6 35231.7 lineto
51636.9 35288 lineto
51636.9 35175.5 lineto
stroke
newpath
51636.9 35906.6 moveto
51693.1 35850.4 lineto
51636.9 35794.2 lineto
51580.6 35850.4 lineto
51636.9 35906.6 lineto
51636.9 35794.2 lineto
stroke
newpath
41958.7 33455.2 moveto
42410.2 33003.7 lineto
stroke
newpath
42410.2 33455.2 moveto
41958.7 33003.7 lineto
stroke
0 0 0 setrgbcolor
0 0 0 setrgbcolor
newpath
43762.8 33876.3 moveto
43875.3 33876.3 lineto
43987.8 33820 lineto
44044.1 33763.8 lineto
44100.3 33651.3 lineto
44156.5 33426.3 lineto
44156.5 33145.1 lineto
44100.3 32920.1 lineto
44044.1 32807.7 lineto
43987.8 32751.4 lineto
43875.3 32695.2 lineto
43762.8 32695.2 lineto
43650.4 32751.4 lineto
43594.1 32807.7 lineto
43537.9 32920.1 lineto
43481.6 33145.1 lineto
43481.6 33426.3 lineto
43537.9 33651.3 lineto
43594.1 33763.8 lineto
43650.4 33820 lineto
43762.8 33876.3 lineto
stroke
newpath
44662.7 32807.7 moveto
44719 32751.4 lineto
44662.7 32695.2 lineto
44606.5 32751.4 lineto
44662.7 32807.7 lineto
44662.7 32695.2 lineto
stroke
newpath
45731.3 33876.3 moveto
45506.4 33876.3 lineto
45393.9 33820 lineto
45337.6 33763.8 lineto
45225.2 33595.1 lineto
45168.9 33370.1 lineto
45168.9 32920.1 lineto
45225.2 32807.7 lineto
45281.4 32751.4 lineto
45393.9 32695.2 lineto
45618.9 32695.2 lineto
45731.3 32751.4 lineto
45787.6 32807.7 lineto
45843.8 32920.1 lineto
45843.8 33201.4 lineto
45787.6 33313.8 lineto
45731.3 33370.1 lineto
45618.9 33426.3 lineto
45393.9 33426.3 lineto
45281.4 33370.1 lineto
45225.2 33313.8 lineto
45168.9 33201.4 lineto
stroke
newpath
46575 33876.3 moveto
46687.5 33876.3 lineto
46800 33820 lineto
46856.2 33763.8 lineto
46912.5 33651.3 lineto
46968.7 33426.3 lineto
46968.7 33145.1 lineto
46912.5 32920.1 lineto
46856.2 32807.7 lineto
46800 32751.4 lineto
46687.5 32695.2 lineto
46575 32695.2 lineto
46462.5 32751.4 lineto
46406.3 32807.7 lineto
46350 32920.1 lineto
46293.8 33145.1 lineto
46293.8 33426.3 lineto
46350 33651.3 lineto
46406.3 33763.8 lineto
46462.5 33820 lineto
46575 33876.3 lineto
stroke
newpath
47474.9 32695.2 moveto
47474.9 33482.6 lineto
stroke
newpath
47474.9 33370.1 moveto
47531.1 33426.3 lineto
47643.6 33482.6 lineto
47812.3 33482.6 lineto
47924.8 33426.3 lineto
47981.1 33313.8 lineto
47981.1 32695.2 lineto
stroke
newpath
47981.1 33313.8 moveto
48037.3 33426.3 lineto
48149.8 33482.6 lineto
48318.5 33482.6 lineto
48431 33426.3 lineto
48487.3 33313.8 lineto
48487.3 32695.2 lineto
stroke
newpath
49049.7 32695.2 moveto
49049.7 33482.6 lineto
stroke
newpath
49049.7 33370.1 moveto
49105.9 33426.3 lineto
49218.4 33482.6 lineto
49387.1 33482.6 lineto
49499.6 33426.3 lineto
49555.9 33313.8 lineto
49555.9 32695.2 lineto
stroke
newpath
49555.9 33313.8 moveto
49612.1 33426.3 lineto
49724.6 33482.6 lineto
49893.3 33482.6 lineto
50005.8 33426.3 lineto
50062.1 33313.8 lineto
50062.1 32695.2 lineto
stroke
newpath
52368 33932.5 moveto
51355.6 32414 lineto
stroke
newpath
53886.6 33876.3 moveto
53999.1 33876.3 lineto
54111.6 33820 lineto
54167.8 33763.8 lineto
54224 33651.3 lineto
54280.3 33426.3 lineto
54280.3 33145.1 lineto
54224 32920.1 lineto
54167.8 32807.7 lineto
54111.6 32751.4 lineto
53999.1 32695.2 lineto
53886.6 32695.2 lineto
53774.1 32751.4 lineto
53717.9 32807.7 lineto
53661.6 32920.1 lineto
53605.4 33145.1 lineto
53605.4 33426.3 lineto
53661.6 33651.3 lineto
53717.9 33763.8 lineto
53774.1 33820 lineto
53886.6 33876.3 lineto
stroke
newpath
54786.5 32807.7 moveto
54842.7 32751.4 lineto
54786.5 32695.2 lineto
54730.2 32751.4 lineto
54786.5 32807.7 lineto
54786.5 32695.2 lineto
stroke
newpath
55573.9 33876.3 moveto
55686.4 33876.3 lineto
55798.8 33820 lineto
55855.1 33763.8 lineto
55911.3 33651.3 lineto
55967.6 33426.3 lineto
55967.6 33145.1 lineto
55911.3 32920.1 lineto
55855.1 32807.7 lineto
55798.8 32751.4 lineto
55686.4 32695.2 lineto
55573.9 32695.2 lineto
55461.4 32751.4 lineto
55405.1 32807.7 lineto
55348.9 32920.1 lineto
55292.7 33145.1 lineto
55292.7 33426.3 lineto
55348.9 33651.3 lineto
55405.1 33763.8 lineto
55461.4 33820 lineto
55573.9 33876.3 lineto
stroke
newpath
56417.5 33763.8 moveto
56473.8 33820 lineto
56586.2 33876.3 lineto
56867.5 33876.3 lineto
56979.9 33820 lineto
57036.2 33763.8 lineto
57092.4 33651.3 lineto
57092.4 33538.8 lineto
57036.2 33370.1 lineto
56361.3 32695.2 lineto
57092.4 32695.2 lineto
stroke
newpath
58104.8 33482.6 moveto
58104.8 32695.2 lineto
stroke
newpath
57823.6 33932.5 moveto
57542.4 33088.9 lineto
58273.5 33088.9 lineto
stroke
newpath
58667.2 33876.3 moveto
58667.2 33651.3 lineto
stroke
newpath
59117.2 33876.3 moveto
59117.2 33651.3 lineto
stroke
newpath
60860.7 32245.2 moveto
60804.5 32301.5 lineto
60692 32470.2 lineto
60635.7 32582.7 lineto
60579.5 32751.4 lineto
60523.3 33032.6 lineto
60523.3 33257.6 lineto
60579.5 33538.8 lineto
60635.7 33707.5 lineto
60692 33820 lineto
60804.5 33988.8 lineto
60860.7 34045 lineto
stroke
newpath
61535.6 33876.3 moveto
61648.1 33876.3 lineto
61760.6 33820 lineto
61816.8 33763.8 lineto
61873.1 33651.3 lineto
61929.3 33426.3 lineto
61929.3 33145.1 lineto
61873.1 32920.1 lineto
61816.8 32807.7 lineto
61760.6 32751.4 lineto
61648.1 32695.2 lineto
61535.6 32695.2 lineto
61423.1 32751.4 lineto
61366.9 32807.7 lineto
61310.7 32920.1 lineto
61254.4 33145.1 lineto
61254.4 33426.3 lineto
61310.7 33651.3 lineto
61366.9 33763.8 lineto
61423.1 33820 lineto
61535.6 33876.3 lineto
stroke
newpath
63335.4 32695.2 moveto
63335.4 33876.3 lineto
stroke
newpath
63841.6 32695.2 moveto
63841.6 33313.8 lineto
63785.3 33426.3 lineto
63672.9 33482.6 lineto
63504.1 33482.6 lineto
63391.6 33426.3 lineto
63335.4 33370.1 lineto
stroke
newpath
64572.7 32695.2 moveto
64460.3 32751.4 lineto
64404 32807.7 lineto
64347.8 32920.1 lineto
64347.8 33257.6 lineto
64404 33370.1 lineto
64460.3 33426.3 lineto
64572.7 33482.6 lineto
64741.5 33482.6 lineto
64854 33426.3 lineto
64910.2 33370.1 lineto
64966.4 33257.6 lineto
64966.4 32920.1 lineto
64910.2 32807.7 lineto
64854 32751.4 lineto
64741.5 32695.2 lineto
64572.7 32695.2 lineto
stroke
newpath
65641.4 32695.2 moveto
65528.9 32751.4 lineto
65472.6 32863.9 lineto
65472.6 33876.3 lineto
stroke
newpath
66541.3 32751.4 moveto
66428.8 32695.2 lineto
66203.8 32695.2 lineto
66091.3 32751.4 lineto
66035.1 32863.9 lineto
66035.1 33313.8 lineto
66091.3 33426.3 lineto
66203.8 33482.6 lineto
66428.8 33482.6 lineto
66541.3 33426.3 lineto
66597.5 33313.8 lineto
66597.5 33201.4 lineto
66035.1 33088.9 lineto
stroke
newpath
67047.4 32751.4 moveto
67159.9 32695.2 lineto
67384.9 32695.2 lineto
67497.4 32751.4 lineto
67553.6 32863.9 lineto
67553.6 32920.1 lineto
67497.4 33032.6 lineto
67384.9 33088.9 lineto
67216.2 33088.9 lineto
67103.7 33145.1 lineto
67047.4 33257.6 lineto
67047.4 33313.8 lineto
67103.7 33426.3 lineto
67216.2 33482.6 lineto
67384.9 33482.6 lineto
67497.4 33426.3 lineto
stroke
newpath
68959.7 33145.1 moveto
69859.6 33145.1 lineto
stroke
newpath
69409.6 32695.2 moveto
69409.6 33595.1 lineto
stroke
newpath
71265.7 33763.8 moveto
71321.9 33820 lineto
71434.4 33876.3 lineto
71715.6 33876.3 lineto
71828.1 33820 lineto
71884.3 33763.8 lineto
71940.6 33651.3 lineto
71940.6 33538.8 lineto
71884.3 33370.1 lineto
71209.4 32695.2 lineto
71940.6 32695.2 lineto
stroke
newpath
73290.4 32751.4 moveto
73402.9 32695.2 lineto
73627.9 32695.2 lineto
73740.4 32751.4 lineto
73796.6 32863.9 lineto
73796.6 32920.1 lineto
73740.4 33032.6 lineto
73627.9 33088.9 lineto
73459.1 33088.9 lineto
73346.7 33145.1 lineto
73290.4 33257.6 lineto
73290.4 33313.8 lineto
73346.7 33426.3 lineto
73459.1 33482.6 lineto
73627.9 33482.6 lineto
73740.4 33426.3 lineto
stroke
newpath
74471.5 32695.2 moveto
74359 32751.4 lineto
74302.8 32863.9 lineto
74302.8 33876.3 lineto
stroke
newpath
75090.2 32695.2 moveto
74977.7 32751.4 lineto
74921.5 32807.7 lineto
74865.2 32920.1 lineto
74865.2 33257.6 lineto
74921.5 33370.1 lineto
74977.7 33426.3 lineto
75090.2 33482.6 lineto
75258.9 33482.6 lineto
75371.4 33426.3 lineto
75427.6 33370.1 lineto
75483.9 33257.6 lineto
75483.9 32920.1 lineto
75427.6 32807.7 lineto
75371.4 32751.4 lineto
75258.9 32695.2 lineto
75090.2 32695.2 lineto
stroke
newpath
75821.3 33482.6 moveto
76271.3 33482.6 lineto
stroke
newpath
75990.1 33876.3 moveto
75990.1 32863.9 lineto
76046.3 32751.4 lineto
76158.8 32695.2 lineto
76271.3 32695.2 lineto
stroke
newpath
76608.7 32751.4 moveto
76721.2 32695.2 lineto
76946.2 32695.2 lineto
77058.7 32751.4 lineto
77114.9 32863.9 lineto
77114.9 32920.1 lineto
77058.7 33032.6 lineto
76946.2 33088.9 lineto
76777.5 33088.9 lineto
76665 33145.1 lineto
76608.7 33257.6 lineto
76608.7 33313.8 lineto
76665 33426.3 lineto
76777.5 33482.6 lineto
76946.2 33482.6 lineto
77058.7 33426.3 lineto
stroke
newpath
77508.6 32245.2 moveto
77564.9 32301.5 lineto
77677.4 32470.2 lineto
77733.6 32582.7 lineto
77789.8 32751.4 lineto
77846.1 33032.6 lineto
77846.1 33257.6 lineto
77789.8 33538.8 lineto
77733.6 33707.5 lineto
77677.4 33820 lineto
77564.9 33988.8 lineto
77508.6 34045 lineto
stroke
42090.4 31670.4 319.815 cir0
0 0 0 setrgbcolor
0 0 0 setrgbcolor
newpath
43762.8 32317.2 moveto
43875.3 32317.2 lineto
43987.8 32261 lineto
44044.1 32204.7 lineto
44100.3 32092.2 lineto
44156.5 31867.3 lineto
44156.5 31586.1 lineto
44100.3 31361.1 lineto
44044.1 31248.6 lineto
43987.8 31192.4 lineto
43875.3 31136.1 lineto
43762.8 31136.1 lineto
43650.4 31192.4 lineto
43594.1 31248.6 lineto
43537.9 31361.1 lineto
43481.6 31586.1 lineto
43481.6 31867.3 lineto
43537.9 32092.2 lineto
43594.1 32204.7 lineto
43650.4 32261 lineto
43762.8 32317.2 lineto
stroke
newpath
44662.7 31248.6 moveto
44719 31192.4 lineto
44662.7 31136.1 lineto
44606.5 31192.4 lineto
44662.7 31248.6 lineto
44662.7 31136.1 lineto
stroke
newpath
45393.9 31811 moveto
45281.4 31867.3 lineto
45225.2 31923.5 lineto
45168.9 32036 lineto
45168.9 32092.2 lineto
45225.2 32204.7 lineto
45281.4 32261 lineto
45393.9 32317.2 lineto
45618.9 32317.2 lineto
45731.3 32261 lineto
45787.6 32204.7 lineto
45843.8 32092.2 lineto
45843.8 32036 lineto
45787.6 31923.5 lineto
45731.3 31867.3 lineto
45618.9 31811 lineto
45393.9 31811 lineto
45281.4 31754.8 lineto
45225.2 31698.5 lineto
45168.9 31586.1 lineto
45168.9 31361.1 lineto
45225.2 31248.6 lineto
45281.4 31192.4 lineto
45393.9 31136.1 lineto
45618.9 31136.1 lineto
45731.3 31192.4 lineto
45787.6 31248.6 lineto
45843.8 31361.1 lineto
45843.8 31586.1 lineto
45787.6 31698.5 lineto
45731.3 31754.8 lineto
45618.9 31811 lineto
stroke
newpath
46912.5 32317.2 moveto
46350 32317.2 lineto
46293.8 31754.8 lineto
46350 31811 lineto
46462.5 31867.3 lineto
46743.7 31867.3 lineto
46856.2 31811 lineto
46912.5 31754.8 lineto
46968.7 31642.3 lineto
46968.7 31361.1 lineto
46912.5 31248.6 lineto
46856.2 31192.4 lineto
46743.7 31136.1 lineto
46462.5 31136.1 lineto
46350 31192.4 lineto
46293.8 31248.6 lineto
stroke
newpath
47474.9 31136.1 moveto
47474.9 31923.5 lineto
stroke
newpath
47474.9 31811 moveto
47531.1 31867.3 lineto
47643.6 31923.5 lineto
47812.3 31923.5 lineto
47924.8 31867.3 lineto
47981.1 31754.8 lineto
47981.1 31136.1 lineto
stroke
newpath
47981.1 31754.8 moveto
48037.3 31867.3 lineto
48149.8 31923.5 lineto
48318.5 31923.5 lineto
48431 31867.3 lineto
48487.3 31754.8 lineto
48487.3 31136.1 lineto
stroke
newpath
49049.7 31136.1 moveto
49049.7 31923.5 lineto
stroke
newpath
49049.7 31811 moveto
49105.9 31867.3 lineto
49218.4 31923.5 lineto
49387.1 31923.5 lineto
49499.6 31867.3 lineto
49555.9 31754.8 lineto
49555.9 31136.1 lineto
stroke
newpath
49555.9 31754.8 moveto
49612.1 31867.3 lineto
49724.6 31923.5 lineto
49893.3 31923.5 lineto
50005.8 31867.3 lineto
50062.1 31754.8 lineto
50062.1 31136.1 lineto
stroke
newpath
52368 32373.5 moveto
51355.6 30854.9 lineto
stroke
newpath
53886.6 32317.2 moveto
53999.1 32317.2 lineto
54111.6 32261 lineto
54167.8 32204.7 lineto
54224 32092.2 lineto
54280.3 31867.3 lineto
54280.3 31586.1 lineto
54224 31361.1 lineto
54167.8 31248.6 lineto
54111.6 31192.4 lineto
53999.1 31136.1 lineto
53886.6 31136.1 lineto
53774.1 31192.4 lineto
53717.9 31248.6 lineto
53661.6 31361.1 lineto
53605.4 31586.1 lineto
53605.4 31867.3 lineto
53661.6 32092.2 lineto
53717.9 32204.7 lineto
53774.1 32261 lineto
53886.6 32317.2 lineto
stroke
newpath
54786.5 31248.6 moveto
54842.7 31192.4 lineto
54786.5 31136.1 lineto
54730.2 31192.4 lineto
54786.5 31248.6 lineto
54786.5 31136.1 lineto
stroke
newpath
55573.9 32317.2 moveto
55686.4 32317.2 lineto
55798.8 32261 lineto
55855.1 32204.7 lineto
55911.3 32092.2 lineto
55967.6 31867.3 lineto
55967.6 31586.1 lineto
55911.3 31361.1 lineto
55855.1 31248.6 lineto
55798.8 31192.4 lineto
55686.4 31136.1 lineto
55573.9 31136.1 lineto
55461.4 31192.4 lineto
55405.1 31248.6 lineto
55348.9 31361.1 lineto
55292.7 31586.1 lineto
55292.7 31867.3 lineto
55348.9 32092.2 lineto
55405.1 32204.7 lineto
55461.4 32261 lineto
55573.9 32317.2 lineto
stroke
newpath
56361.3 32317.2 moveto
57092.4 32317.2 lineto
56698.7 31867.3 lineto
56867.5 31867.3 lineto
56979.9 31811 lineto
57036.2 31754.8 lineto
57092.4 31642.3 lineto
57092.4 31361.1 lineto
57036.2 31248.6 lineto
56979.9 31192.4 lineto
56867.5 31136.1 lineto
56530 31136.1 lineto
56417.5 31192.4 lineto
56361.3 31248.6 lineto
stroke
newpath
57486.1 32317.2 moveto
58217.3 32317.2 lineto
57823.6 31867.3 lineto
57992.3 31867.3 lineto
58104.8 31811 lineto
58161 31754.8 lineto
58217.3 31642.3 lineto
58217.3 31361.1 lineto
58161 31248.6 lineto
58104.8 31192.4 lineto
57992.3 31136.1 lineto
57654.9 31136.1 lineto
57542.4 31192.4 lineto
57486.1 31248.6 lineto
stroke
newpath
58667.2 32317.2 moveto
58667.2 32092.2 lineto
stroke
newpath
59117.2 32317.2 moveto
59117.2 32092.2 lineto
stroke
newpath
60860.7 30686.2 moveto
60804.5 30742.4 lineto
60692 30911.1 lineto
60635.7 31023.6 lineto
60579.5 31192.4 lineto
60523.3 31473.6 lineto
60523.3 31698.5 lineto
60579.5 31979.8 lineto
60635.7 32148.5 lineto
60692 32261 lineto
60804.5 32429.7 lineto
60860.7 32485.9 lineto
stroke
newpath
61254.4 32204.7 moveto
61310.7 32261 lineto
61423.1 32317.2 lineto
61704.4 32317.2 lineto
61816.8 32261 lineto
61873.1 32204.7 lineto
61929.3 32092.2 lineto
61929.3 31979.8 lineto
61873.1 31811 lineto
61198.2 31136.1 lineto
61929.3 31136.1 lineto
stroke
newpath
63335.4 31136.1 moveto
63335.4 32317.2 lineto
stroke
newpath
63841.6 31136.1 moveto
63841.6 31754.8 lineto
63785.3 31867.3 lineto
63672.9 31923.5 lineto
63504.1 31923.5 lineto
63391.6 31867.3 lineto
63335.4 31811 lineto
stroke
newpath
64572.7 31136.1 moveto
64460.3 31192.4 lineto
64404 31248.6 lineto
64347.8 31361.1 lineto
64347.8 31698.5 lineto
64404 31811 lineto
64460.3 31867.3 lineto
64572.7 31923.5 lineto
64741.5 31923.5 lineto
64854 31867.3 lineto
64910.2 31811 lineto
64966.4 31698.5 lineto
64966.4 31361.1 lineto
64910.2 31248.6 lineto
64854 31192.4 lineto
64741.5 31136.1 lineto
64572.7 31136.1 lineto
stroke
newpath
65641.4 31136.1 moveto
65528.9 31192.4 lineto
65472.6 31304.8 lineto
65472.6 32317.2 lineto
stroke
newpath
66541.3 31192.4 moveto
66428.8 31136.1 lineto
66203.8 31136.1 lineto
66091.3 31192.4 lineto
66035.1 31304.8 lineto
66035.1 31754.8 lineto
66091.3 31867.3 lineto
66203.8 31923.5 lineto
66428.8 31923.5 lineto
66541.3 31867.3 lineto
66597.5 31754.8 lineto
66597.5 31642.3 lineto
66035.1 31529.8 lineto
stroke
newpath
67047.4 31192.4 moveto
67159.9 31136.1 lineto
67384.9 31136.1 lineto
67497.4 31192.4 lineto
67553.6 31304.8 lineto
67553.6 31361.1 lineto
67497.4 31473.6 lineto
67384.9 31529.8 lineto
67216.2 31529.8 lineto
67103.7 31586.1 lineto
67047.4 31698.5 lineto
67047.4 31754.8 lineto
67103.7 31867.3 lineto
67216.2 31923.5 lineto
67384.9 31923.5 lineto
67497.4 31867.3 lineto
stroke
newpath
67947.3 30686.2 moveto
68003.6 30742.4 lineto
68116.1 30911.1 lineto
68172.3 31023.6 lineto
68228.5 31192.4 lineto
68284.8 31473.6 lineto
68284.8 31698.5 lineto
68228.5 31979.8 lineto
68172.3 32148.5 lineto
68116.1 32261 lineto
68003.6 32429.7 lineto
67947.3 32485.9 lineto
stroke
newpath
42027.9 30493.6 moveto
42027.9 29729.1 lineto
stroke
newpath
41645.7 30111.4 moveto
42410.2 30111.4 lineto
stroke
0 0 0 setrgbcolor
0 0 0 setrgbcolor
newpath
44156.5 29577.1 moveto
43481.6 29577.1 lineto
stroke
newpath
43819.1 29577.1 moveto
43819.1 30758.2 lineto
43706.6 30589.4 lineto
43594.1 30476.9 lineto
43481.6 30420.7 lineto
stroke
newpath
44662.7 29689.5 moveto
44719 29633.3 lineto
44662.7 29577.1 lineto
44606.5 29633.3 lineto
44662.7 29689.5 lineto
44662.7 29577.1 lineto
stroke
newpath
45450.1 30758.2 moveto
45562.6 30758.2 lineto
45675.1 30701.9 lineto
45731.3 30645.7 lineto
45787.6 30533.2 lineto
45843.8 30308.2 lineto
45843.8 30027 lineto
45787.6 29802 lineto
45731.3 29689.5 lineto
45675.1 29633.3 lineto
45562.6 29577.1 lineto
45450.1 29577.1 lineto
45337.6 29633.3 lineto
45281.4 29689.5 lineto
45225.2 29802 lineto
45168.9 30027 lineto
45168.9 30308.2 lineto
45225.2 30533.2 lineto
45281.4 30645.7 lineto
45337.6 30701.9 lineto
45450.1 30758.2 lineto
stroke
newpath
46293.8 30645.7 moveto
46350 30701.9 lineto
46462.5 30758.2 lineto
46743.7 30758.2 lineto
46856.2 30701.9 lineto
46912.5 30645.7 lineto
46968.7 30533.2 lineto
46968.7 30420.7 lineto
46912.5 30252 lineto
46237.5 29577.1 lineto
46968.7 29577.1 lineto
stroke
newpath
47474.9 29577.1 moveto
47474.9 30364.5 lineto
stroke
newpath
47474.9 30252 moveto
47531.1 30308.2 lineto
47643.6 30364.5 lineto
47812.3 30364.5 lineto
47924.8 30308.2 lineto
47981.1 30195.7 lineto
47981.1 29577.1 lineto
stroke
newpath
47981.1 30195.7 moveto
48037.3 30308.2 lineto
48149.8 30364.5 lineto
48318.5 30364.5 lineto
48431 30308.2 lineto
48487.3 30195.7 lineto
48487.3 29577.1 lineto
stroke
newpath
49049.7 29577.1 moveto
49049.7 30364.5 lineto
stroke
newpath
49049.7 30252 moveto
49105.9 30308.2 lineto
49218.4 30364.5 lineto
49387.1 30364.5 lineto
49499.6 30308.2 lineto
49555.9 30195.7 lineto
49555.9 29577.1 lineto
stroke
newpath
49555.9 30195.7 moveto
49612.1 30308.2 lineto
49724.6 30364.5 lineto
49893.3 30364.5 lineto
50005.8 30308.2 lineto
50062.1 30195.7 lineto
50062.1 29577.1 lineto
stroke
newpath
52368 30814.4 moveto
51355.6 29295.8 lineto
stroke
newpath
53886.6 30758.2 moveto
53999.1 30758.2 lineto
54111.6 30701.9 lineto
54167.8 30645.7 lineto
54224 30533.2 lineto
54280.3 30308.2 lineto
54280.3 30027 lineto
54224 29802 lineto
54167.8 29689.5 lineto
54111.6 29633.3 lineto
53999.1 29577.1 lineto
53886.6 29577.1 lineto
53774.1 29633.3 lineto
53717.9 29689.5 lineto
53661.6 29802 lineto
53605.4 30027 lineto
53605.4 30308.2 lineto
53661.6 30533.2 lineto
53717.9 30645.7 lineto
53774.1 30701.9 lineto
53886.6 30758.2 lineto
stroke
newpath
54786.5 29689.5 moveto
54842.7 29633.3 lineto
54786.5 29577.1 lineto
54730.2 29633.3 lineto
54786.5 29689.5 lineto
54786.5 29577.1 lineto
stroke
newpath
55573.9 30758.2 moveto
55686.4 30758.2 lineto
55798.8 30701.9 lineto
55855.1 30645.7 lineto
55911.3 30533.2 lineto
55967.6 30308.2 lineto
55967.6 30027 lineto
55911.3 29802 lineto
55855.1 29689.5 lineto
55798.8 29633.3 lineto
55686.4 29577.1 lineto
55573.9 29577.1 lineto
55461.4 29633.3 lineto
55405.1 29689.5 lineto
55348.9 29802 lineto
55292.7 30027 lineto
55292.7 30308.2 lineto
55348.9 30533.2 lineto
55405.1 30645.7 lineto
55461.4 30701.9 lineto
55573.9 30758.2 lineto
stroke
newpath
56979.9 30364.5 moveto
56979.9 29577.1 lineto
stroke
newpath
56698.7 30814.4 moveto
56417.5 29970.8 lineto
57148.7 29970.8 lineto
stroke
newpath
57823.6 30758.2 moveto
57936.1 30758.2 lineto
58048.6 30701.9 lineto
58104.8 30645.7 lineto
58161 30533.2 lineto
58217.3 30308.2 lineto
58217.3 30027 lineto
58161 29802 lineto
58104.8 29689.5 lineto
58048.6 29633.3 lineto
57936.1 29577.1 lineto
57823.6 29577.1 lineto
57711.1 29633.3 lineto
57654.9 29689.5 lineto
57598.6 29802 lineto
57542.4 30027 lineto
57542.4 30308.2 lineto
57598.6 30533.2 lineto
57654.9 30645.7 lineto
57711.1 30701.9 lineto
57823.6 30758.2 lineto
stroke
newpath
58667.2 30758.2 moveto
58667.2 30533.2 lineto
stroke
newpath
59117.2 30758.2 moveto
59117.2 30533.2 lineto
stroke
newpath
60860.7 29127.1 moveto
60804.5 29183.4 lineto
60692 29352.1 lineto
60635.7 29464.6 lineto
60579.5 29633.3 lineto
60523.3 29914.5 lineto
60523.3 30139.5 lineto
60579.5 30420.7 lineto
60635.7 30589.4 lineto
60692 30701.9 lineto
60804.5 30870.6 lineto
60860.7 30926.9 lineto
stroke
newpath
61198.2 30758.2 moveto
61929.3 30758.2 lineto
61535.6 30308.2 lineto
61704.4 30308.2 lineto
61816.8 30252 lineto
61873.1 30195.7 lineto
61929.3 30083.2 lineto
61929.3 29802 lineto
61873.1 29689.5 lineto
61816.8 29633.3 lineto
61704.4 29577.1 lineto
61366.9 29577.1 lineto
61254.4 29633.3 lineto
61198.2 29689.5 lineto
stroke
newpath
62941.7 30364.5 moveto
62941.7 29577.1 lineto
stroke
newpath
62660.5 30814.4 moveto
62379.3 29970.8 lineto
63110.4 29970.8 lineto
stroke
newpath
64460.3 29577.1 moveto
64460.3 30758.2 lineto
stroke
newpath
64966.4 29577.1 moveto
64966.4 30195.7 lineto
64910.2 30308.2 lineto
64797.7 30364.5 lineto
64629 30364.5 lineto
64516.5 30308.2 lineto
64460.3 30252 lineto
stroke
newpath
65697.6 29577.1 moveto
65585.1 29633.3 lineto
65528.9 29689.5 lineto
65472.6 29802 lineto
65472.6 30139.5 lineto
65528.9 30252 lineto
65585.1 30308.2 lineto
65697.6 30364.5 lineto
65866.3 30364.5 lineto
65978.8 30308.2 lineto
66035.1 30252 lineto
66091.3 30139.5 lineto
66091.3 29802 lineto
66035.1 29689.5 lineto
65978.8 29633.3 lineto
65866.3 29577.1 lineto
65697.6 29577.1 lineto
stroke
newpath
66766.2 29577.1 moveto
66653.7 29633.3 lineto
66597.5 29745.8 lineto
66597.5 30758.2 lineto
stroke
newpath
67666.1 29633.3 moveto
67553.6 29577.1 lineto
67328.7 29577.1 lineto
67216.2 29633.3 lineto
67159.9 29745.8 lineto
67159.9 30195.7 lineto
67216.2 30308.2 lineto
67328.7 30364.5 lineto
67553.6 30364.5 lineto
67666.1 30308.2 lineto
67722.4 30195.7 lineto
67722.4 30083.2 lineto
67159.9 29970.8 lineto
stroke
newpath
68172.3 29633.3 moveto
68284.8 29577.1 lineto
68509.8 29577.1 lineto
68622.2 29633.3 lineto
68678.5 29745.8 lineto
68678.5 29802 lineto
68622.2 29914.5 lineto
68509.8 29970.8 lineto
68341 29970.8 lineto
68228.5 30027 lineto
68172.3 30139.5 lineto
68172.3 30195.7 lineto
68228.5 30308.2 lineto
68341 30364.5 lineto
68509.8 30364.5 lineto
68622.2 30308.2 lineto
stroke
newpath
69072.2 29127.1 moveto
69128.4 29183.4 lineto
69240.9 29352.1 lineto
69297.2 29464.6 lineto
69353.4 29633.3 lineto
69409.6 29914.5 lineto
69409.6 30139.5 lineto
69353.4 30420.7 lineto
69297.2 30589.4 lineto
69240.9 30701.9 lineto
69128.4 30870.6 lineto
69072.2 30926.9 lineto
stroke
showpage
grestore
%%EOF
