EESchema Schematic File Version 4
EELAYER 30 0
EELAYER END
$Descr A4 11693 8268
encoding utf-8
Sheet 1 1
Title ""
Date ""
Rev ""
Comp ""
Comment1 ""
Comment2 ""
Comment3 ""
Comment4 ""
$EndDescr
$Comp
L fab:NMOSFETSOT23 T1
U 1 1 5EEF6DD6
P 5550 3800
F 0 "T1" V 5700 3800 45  0000 C CNN
F 1 "NMOSFETSOT23" V 5784 3800 45  0000 C CNN
F 2 "fab-SOT-23" H 5580 3950 20  0001 C CNN
F 3 "" H 5550 3800 50  0001 C CNN
	1    5550 3800
	0    1    1    0   
$EndComp
Text GLabel 4550 3100 0    50   Input ~ 0
3V3
Text GLabel 6700 3100 2    50   Input ~ 0
5V
$Comp
L fab:RES-US1206FAB R1
U 1 1 5EEFABAF
P 4800 3450
F 0 "R1" V 4758 3518 45  0000 L CNN
F 1 "10k" V 4842 3518 45  0000 L CNN
F 2 "fab-R1206FAB" H 4830 3600 20  0001 C CNN
F 3 "" H 4800 3450 50  0001 C CNN
	1    4800 3450
	0    1    1    0   
$EndComp
Text GLabel 4450 3800 0    50   Input ~ 0
L1
Wire Wire Line
	4450 3800 4800 3800
Wire Wire Line
	4550 3100 4800 3100
Wire Wire Line
	4800 3100 4800 3250
Wire Wire Line
	4800 3650 4800 3800
Connection ~ 4800 3800
Wire Wire Line
	4800 3800 5350 3800
Wire Wire Line
	4800 3100 5450 3100
Wire Wire Line
	5450 3100 5450 3600
Connection ~ 4800 3100
$Comp
L fab:RES-US1206FAB R2
U 1 1 5EEFFBE2
P 6350 3450
F 0 "R2" V 6308 3518 45  0000 L CNN
F 1 "10k" V 6392 3518 45  0000 L CNN
F 2 "fab-R1206FAB" H 6380 3600 20  0001 C CNN
F 3 "" H 6350 3450 50  0001 C CNN
	1    6350 3450
	0    1    1    0   
$EndComp
Wire Wire Line
	6350 3250 6350 3100
Wire Wire Line
	6350 3100 6700 3100
Wire Wire Line
	5750 3800 6350 3800
Wire Wire Line
	6350 3800 6350 3650
Text GLabel 6700 3800 2    50   Input ~ 0
H1
Wire Wire Line
	6700 3800 6350 3800
Connection ~ 6350 3800
$Comp
L fab:PINHD-1x05-HEADER M1
U 1 1 5EF03458
P 2200 3600
F 0 "M1" H 2200 3600 45  0001 C CNN
F 1 "PINHD-1x05-HEADER" H 2200 3600 45  0001 C CNN
F 2 "fab-1X05" H 2230 3750 20  0001 C CNN
F 3 "" H 2200 3600 50  0001 C CNN
	1    2200 3600
	-1   0    0    1   
$EndComp
$Comp
L fab:PINHD-1x05-HEADER M2
U 1 1 5EF052F7
P 2200 4400
F 0 "M2" H 2200 4400 45  0001 C CNN
F 1 "PINHD-1x05-HEADER" H 2200 4400 45  0001 C CNN
F 2 "fab-1X05" H 2230 4550 20  0001 C CNN
F 3 "" H 2200 4400 50  0001 C CNN
	1    2200 4400
	-1   0    0    1   
$EndComp
Text GLabel 2650 3700 2    50   Input ~ 0
GND
Text GLabel 2650 3900 2    50   Input ~ 0
3V3
Text GLabel 2650 4700 2    50   Input ~ 0
5V
Text GLabel 2650 4500 2    50   Input ~ 0
GND
Text GLabel 2650 4000 2    50   Input ~ 0
L1
Text GLabel 2650 4800 2    50   Input ~ 0
H1
Wire Wire Line
	2200 3700 2650 3700
Wire Wire Line
	2200 3900 2650 3900
Wire Wire Line
	2200 4000 2650 4000
Wire Wire Line
	2200 4500 2650 4500
Wire Wire Line
	2200 4700 2650 4700
Wire Wire Line
	2200 4800 2650 4800
$EndSCHEMATC
