<?xml version="1.0" encoding="UTF-8" standalone="no"?>
<!-- Created with Inkscape (http://www.inkscape.org/) -->

<svg
   width="210mm"
   height="297mm"
   viewBox="0 0 210 297"
   version="1.1"
   id="svg1"
   inkscape:version="1.3 (0e150ed6c4, 2023-07-21)"
   sodipodi:docname="V3.svg"
   xmlns:inkscape="http://www.inkscape.org/namespaces/inkscape"
   xmlns:sodipodi="http://sodipodi.sourceforge.net/DTD/sodipodi-0.dtd"
   xmlns="http://www.w3.org/2000/svg"
   xmlns:svg="http://www.w3.org/2000/svg">
  <sodipodi:namedview
     id="namedview1"
     pagecolor="#ffffff"
     bordercolor="#666666"
     borderopacity="1.0"
     inkscape:showpageshadow="2"
     inkscape:pageopacity="0.0"
     inkscape:pagecheckerboard="0"
     inkscape:deskcolor="#d1d1d1"
     inkscape:document-units="mm"
     inkscape:zoom="1.9628562"
     inkscape:cx="396.36118"
     inkscape:cy="479.65816"
     inkscape:window-width="1920"
     inkscape:window-height="1017"
     inkscape:window-x="1912"
     inkscape:window-y="-8"
     inkscape:window-maximized="1"
     inkscape:current-layer="layer3" />
  <defs
     id="defs1" />
  <g
     inkscape:label="Layer 1"
     inkscape:groupmode="layer"
     id="layer1"
     transform="matrix(0.99999988,0,0,0.9892541,1.2167408e-5,1.0745835)">
    <path
       style="fill:none;stroke:#000000;stroke-width:0.40214px;stroke-linecap:butt;stroke-linejoin:miter;stroke-opacity:1"
       d="m 75,150.34207 h 25 25 25 9.79893 v -50.141 H 150 125 100 75 50.20107 v 50.141 z"
       id="path1"
       sodipodi:nodetypes="ccccccccccccc" />
  </g>
  <g
     inkscape:groupmode="layer"
     id="layer2"
     inkscape:label="Layer 2">
    <path
       style="fill:none;stroke:#000000;stroke-width:0.264917px;stroke-linecap:butt;stroke-linejoin:miter;stroke-opacity:1"
       d="m 75.132458,100 v 50"
       id="path2" />
    <path
       style="fill:none;stroke:#000000;stroke-width:0.297698px;stroke-linecap:butt;stroke-linejoin:miter;stroke-opacity:1"
       d="m 100.14885,100 v 50"
       id="path3" />
    <path
       style="fill:none;stroke:#000000;stroke-width:0.311856px;stroke-linecap:butt;stroke-linejoin:miter;stroke-opacity:1"
       d="m 125.15593,100 v 50"
       id="path4" />
    <path
       style="fill:none;stroke:#000000;stroke-width:0.314818px;stroke-linecap:butt;stroke-linejoin:miter;stroke-opacity:1"
       d="m 150.15741,100 v 50"
       id="path5" />
  </g>
  <g
     inkscape:groupmode="layer"
     id="layer3"
     inkscape:label="Layer 3">
    <circle
       style="fill:none;fill-rule:evenodd;stroke-width:0.264583;stroke:#000000;stroke-opacity:1"
       id="path6"
       cx="111.87991"
       cy="117.00212"
       r="5.5265975" />
    <rect
       style="fill:none;fill-rule:evenodd;stroke:#000000;stroke-width:0.1;stroke-opacity:1"
       id="rect6"
       width="5.2570076"
       height="8.3572941"
       x="55.400772"
       y="109.72319" />
    <rect
       style="fill:none;fill-rule:evenodd;stroke:#000000;stroke-width:0.1;stroke-opacity:1"
       id="rect7"
       width="3.774262"
       height="11.592376"
       x="66.049583"
       y="110.12757" />
    <rect
       style="fill:#000000;fill-rule:evenodd;stroke:#000000;stroke-width:0.1;stroke-opacity:1;fill-opacity:1"
       id="rect8"
       width="7.5485239"
       height="16.175407"
       x="106.35331"
       y="132.36876" />
    <rect
       style="fill:none;fill-rule:evenodd;stroke:#000000;stroke-width:0.1;stroke-opacity:1"
       id="rect9"
       width="3.3698766"
       height="1.2131556"
       x="118.88924"
       y="140.86084" />
    <rect
       style="fill:none;fill-rule:evenodd;stroke:#000000;stroke-width:0.1;stroke-opacity:1"
       id="rect10"
       width="19.1409"
       height="5.3918028"
       x="128.86407"
       y="113.22786" />
    <text
       xml:space="preserve"
       style="font-style:normal;font-weight:normal;font-size:10.5833px;line-height:1.25;font-family:sans-serif;fill:#000000;fill-opacity:1;stroke:none;stroke-width:0.264583"
       x="84.038048"
       y="128.6351"
       id="text10"
       transform="rotate(-0.25290697)"
       inkscape:transform-center-y="-0.53918031"><tspan
         sodipodi:role="line"
         id="tspan10"
         style="stroke-width:0.264583"
         x="84.038048"
         y="128.6351">P</tspan></text>
  </g>
</svg>
