<?xml version="1.0" encoding="UTF-8" standalone="no"?>
<svg
   width="339.70mm"
   height="358.90mm"
   viewBox="0.0 0.0 339.70 358.90"
   version="1.1"
   id="svg1045"
   sodipodi:docname="Bigbox v2 CUT.svg"
   inkscape:version="1.2.2 (732a01da63, 2022-12-09)"
   xmlns:inkscape="http://www.inkscape.org/namespaces/inkscape"
   xmlns:sodipodi="http://sodipodi.sourceforge.net/DTD/sodipodi-0.dtd"
   xmlns="http://www.w3.org/2000/svg"
   xmlns:svg="http://www.w3.org/2000/svg"
   xmlns:rdf="http://www.w3.org/1999/02/22-rdf-syntax-ns#"
   xmlns:cc="http://creativecommons.org/ns#"
   xmlns:dc="http://purl.org/dc/elements/1.1/">
  <defs
     id="defs1049">
    <clipPath
       clipPathUnits="userSpaceOnUse"
       id="clipPath1618">
      <rect
         style="fill:none;stroke:#000000;stroke-width:0.264999"
         id="rect1620"
         width="28.734316"
         height="21.621862"
         x="198.57976"
         y="154.76701" />
    </clipPath>
  </defs>
  <sodipodi:namedview
     pagecolor="#ffffff"
     bordercolor="#666666"
     borderopacity="1"
     objecttolerance="10"
     gridtolerance="10"
     guidetolerance="10"
     inkscape:pageopacity="0"
     inkscape:pageshadow="2"
     inkscape:window-width="1920"
     inkscape:window-height="986"
     id="namedview1047"
     showgrid="false"
     inkscape:zoom="0.59393138"
     inkscape:cx="644.01379"
     inkscape:cy="612.86541"
     inkscape:window-x="-11"
     inkscape:window-y="-11"
     inkscape:window-maximized="1"
     inkscape:current-layer="svg1045"
     inkscape:document-rotation="0"
     inkscape:showpageshadow="2"
     inkscape:pagecheckerboard="0"
     inkscape:deskcolor="#d1d1d1"
     inkscape:document-units="mm" />
  <!--
BasedBox - Fully closed box on a base


This box is more of a building block than a finished item.
Use a vector graphics program (like Inkscape) to add holes or adjust the base
plate. The width of the "brim" can also be adjusted with the **edge_width**
 parameter in the **Finger Joints Settings**.
 
See ClosedBox for variant without a base.



Created with Boxes.py (https://festi.info/boxes.py)
Creation date: 2023-05-11 11:27:55
Command line (remove spaces between dashes): boxes BasedBox - -x=150.0 - -outside=0 - -labels=0 - -reference=1 - -burn=0.05
Url: http://www.festi.info/boxes.py/BasedBox?FingerJoint_angle=90.0&FingerJoint_style=rectangular&FingerJoint_surroundingspaces=2.0&FingerJoint_bottom_lip=0.0&FingerJoint_edge_width=1.0&FingerJoint_extra_length=0.0&FingerJoint_finger=2.0&FingerJoint_play=0.0&FingerJoint_space=2.0&FingerJoint_width=1.0&x=150.0&y=100.0&h=100.0&outside=0&thickness=3.0&format=svg&tabs=0.0&qr_code=0&debug=0&labels=0&reference=1&inner_corners=loop&burn=0.05&language=fr&render=2
Url short: http://www.festi.info/boxes.py/BasedBox?x=150.0&outside=0&labels=0&reference=1&burn=0.05
SettingsUrl: http://www.festi.info/boxes.py/BasedBox?FingerJoint_angle=90.0&FingerJoint_style=rectangular&FingerJoint_surroundingspaces=2.0&FingerJoint_bottom_lip=0.0&FingerJoint_edge_width=1.0&FingerJoint_extra_length=0.0&FingerJoint_finger=2.0&FingerJoint_play=0.0&FingerJoint_space=2.0&FingerJoint_width=1.0&x=150.0&y=100.0&h=100.0&outside=0&thickness=3.0&format=svg&tabs=0.0&qr_code=0&debug=0&labels=0&reference=1&inner_corners=loop&burn=0.05&language=fr&render=2
SettingsUrl short: http://www.festi.info/boxes.py/BasedBox?x=150.0&outside=0&labels=0&reference=1&burn=0.05
-->
  <title
     id="title942">BasedBox</title>
  <metadata
     id="metadata944">
    <rdf:RDF>
      <cc:Work>
        <dc:title>BasedBox</dc:title>
        <dc:date>2023-05-11 11:27:55</dc:date>
        <dc:source>http://www.festi.info/boxes.py/BasedBox?FingerJoint_angle=90.0&amp;FingerJoint_style=rectangular&amp;FingerJoint_surroundingspaces=2.0&amp;FingerJoint_bottom_lip=0.0&amp;FingerJoint_edge_width=1.0&amp;FingerJoint_extra_length=0.0&amp;FingerJoint_finger=2.0&amp;FingerJoint_play=0.0&amp;FingerJoint_space=2.0&amp;FingerJoint_width=1.0&amp;x=150.0&amp;y=100.0&amp;h=100.0&amp;outside=0&amp;thickness=3.0&amp;format=svg&amp;tabs=0.0&amp;qr_code=0&amp;debug=0&amp;labels=0&amp;reference=1&amp;inner_corners=loop&amp;burn=0.05&amp;language=fr&amp;render=2</dc:source>
        <dc:source>http://www.festi.info/boxes.py/BasedBox?x=150.0&amp;outside=0&amp;labels=0&amp;reference=1&amp;burn=0.05</dc:source>
        <dc:description>Fully closed box on a base

This box is more of a building block than a finished item.
Use a vector graphics program (like Inkscape) to add holes or adjust the base
plate. The width of the &quot;brim&quot; can also be adjusted with the **edge_width**
 parameter in the **Finger Joints Settings**.
 
See ClosedBox for variant without a base.


Created with Boxes.py (https://festi.info/boxes.py)
Command line: boxes BasedBox --FingerJoint_angle=90.0 --FingerJoint_style=rectangular --FingerJoint_surroundingspaces=2.0 --FingerJoint_bottom_lip=0.0 --FingerJoint_edge_width=1.0 --FingerJoint_extra_length=0.0 --FingerJoint_finger=2.0 --FingerJoint_play=0.0 --FingerJoint_space=2.0 --FingerJoint_width=1.0 --x=150.0 --y=100.0 --h=100.0 --outside=0 --thickness=3.0 --format=svg --tabs=0.0 --qr_code=0 --debug=0 --labels=0 --reference=1 --inner_corners=loop --burn=0.05
Command line short: boxes BasedBox --x=150.0 --outside=0 --labels=0 --reference=1 --burn=0.05
Url: http://www.festi.info/boxes.py/BasedBox?FingerJoint_angle=90.0&amp;FingerJoint_style=rectangular&amp;FingerJoint_surroundingspaces=2.0&amp;FingerJoint_bottom_lip=0.0&amp;FingerJoint_edge_width=1.0&amp;FingerJoint_extra_length=0.0&amp;FingerJoint_finger=2.0&amp;FingerJoint_play=0.0&amp;FingerJoint_space=2.0&amp;FingerJoint_width=1.0&amp;x=150.0&amp;y=100.0&amp;h=100.0&amp;outside=0&amp;thickness=3.0&amp;format=svg&amp;tabs=0.0&amp;qr_code=0&amp;debug=0&amp;labels=0&amp;reference=1&amp;inner_corners=loop&amp;burn=0.05&amp;language=fr&amp;render=2
Url short: http://www.festi.info/boxes.py/BasedBox?x=150.0&amp;outside=0&amp;labels=0&amp;reference=1&amp;burn=0.05
SettingsUrl: http://www.festi.info/boxes.py/BasedBox?FingerJoint_angle=90.0&amp;FingerJoint_style=rectangular&amp;FingerJoint_surroundingspaces=2.0&amp;FingerJoint_bottom_lip=0.0&amp;FingerJoint_edge_width=1.0&amp;FingerJoint_extra_length=0.0&amp;FingerJoint_finger=2.0&amp;FingerJoint_play=0.0&amp;FingerJoint_space=2.0&amp;FingerJoint_width=1.0&amp;x=150.0&amp;y=100.0&amp;h=100.0&amp;outside=0&amp;thickness=3.0&amp;format=svg&amp;tabs=0.0&amp;qr_code=0&amp;debug=0&amp;labels=0&amp;reference=1&amp;inner_corners=loop&amp;burn=0.05&amp;language=fr&amp;render=2
SettingsUrl short: http://www.festi.info/boxes.py/BasedBox?x=150.0&amp;outside=0&amp;labels=0&amp;reference=1&amp;burn=0.05
</dc:description>
        <dc:format>image/svg+xml</dc:format>
        <dc:type
           rdf:resource="http://purl.org/dc/dcmitype/StillImage" />
      </cc:Work>
    </rdf:RDF>
  </metadata>
  <g
     id="p-1"
     style="fill:none;stroke-linecap:round;stroke-linejoin:round;">
    <path
       d="M 13.050 334.300 H 19.000 C 19.050 334.300 19.000 334.250 19.000 334.300 V 337.250 C 19.000 337.278 19.022 337.300 19.050 337.300 H 25.050 C 25.078 337.300 25.100 337.278 25.100 337.250 V 334.300 C 25.100 334.250 25.050 334.300 25.100 334.300 H 31.000 C 31.050 334.300 31.000 334.250 31.000 334.300 V 337.250 C 31.000 337.278 31.022 337.300 31.050 337.300 H 37.050 C 37.078 337.300 37.100 337.278 37.100 337.250 V 334.300 C 37.100 334.250 37.050 334.300 37.100 334.300 H 43.000 C 43.050 334.300 43.000 334.250 43.000 334.300 V 337.250 C 43.000 337.278 43.022 337.300 43.050 337.300 H 49.050 C 49.078 337.300 49.100 337.278 49.100 337.250 V 334.300 C 49.100 334.250 49.050 334.300 49.100 334.300 H 55.000 C 55.050 334.300 55.000 334.250 55.000 334.300 V 337.250 C 55.000 337.278 55.022 337.300 55.050 337.300 H 61.050 C 61.078 337.300 61.100 337.278 61.100 337.250 V 334.300 C 61.100 334.250 61.050 334.300 61.100 334.300 H 67.000 C 67.050 334.300 67.000 334.250 67.000 334.300 V 337.250 C 67.000 337.278 67.022 337.300 67.050 337.300 H 73.050 C 73.078 337.300 73.100 337.278 73.100 337.250 V 334.300 C 73.100 334.250 73.050 334.300 73.100 334.300 H 79.000 C 79.050 334.300 79.000 334.250 79.000 334.300 V 337.250 C 79.000 337.278 79.022 337.300 79.050 337.300 H 85.050 C 85.078 337.300 85.100 337.278 85.100 337.250 V 334.300 C 85.100 334.250 85.050 334.300 85.100 334.300 H 91.000 C 91.050 334.300 91.000 334.250 91.000 334.300 V 337.250 C 91.000 337.278 91.022 337.300 91.050 337.300 H 97.050 C 97.078 337.300 97.100 337.278 97.100 337.250 V 334.300 C 97.100 334.250 97.050 334.300 97.100 334.300 H 103.000 C 103.050 334.300 103.000 334.250 103.000 334.300 V 337.250 C 103.000 337.278 103.022 337.300 103.050 337.300 H 109.050 C 109.078 337.300 109.100 337.278 109.100 337.250 V 334.300 C 109.100 334.250 109.050 334.300 109.100 334.300 H 115.000 C 115.050 334.300 115.000 334.250 115.000 334.300 V 337.250 C 115.000 337.278 115.022 337.300 115.050 337.300 H 121.050 C 121.078 337.300 121.100 337.278 121.100 337.250 V 334.300 C 121.100 334.250 121.050 334.300 121.100 334.300 H 127.000 C 127.050 334.300 127.000 334.250 127.000 334.300 V 337.250 C 127.000 337.278 127.022 337.300 127.050 337.300 H 133.050 C 133.078 337.300 133.100 337.278 133.100 337.250 V 334.300 C 133.100 334.250 133.050 334.300 133.100 334.300 H 139.000 C 139.050 334.300 139.000 334.250 139.000 334.300 V 337.250 C 139.000 337.278 139.022 337.300 139.050 337.300 H 145.050 C 145.078 337.300 145.100 337.278 145.100 337.250 V 334.300 C 145.100 334.250 145.050 334.300 145.100 334.300 H 151.000 C 151.050 334.300 151.000 334.250 151.000 334.300 V 337.250 C 151.000 337.278 151.022 337.300 151.050 337.300 H 157.050 C 157.078 337.300 157.100 337.278 157.100 337.250 V 334.300 C 157.100 334.250 157.050 334.300 157.100 334.300 H 163.050 H 166.050 C 166.078 334.300 166.100 334.278 166.100 334.250 V 323.250 C 166.100 323.222 166.078 323.200 166.050 323.200 H 163.100 C 163.050 323.200 163.100 323.250 163.100 323.200 V 317.300 C 163.100 317.250 163.050 317.300 163.100 317.300 H 166.050 C 166.078 317.300 166.100 317.278 166.100 317.250 V 311.250 C 166.100 311.222 166.078 311.200 166.050 311.200 H 163.100 C 163.050 311.200 163.100 311.250 163.100 311.200 V 305.300 C 163.100 305.250 163.050 305.300 163.100 305.300 H 166.050 C 166.078 305.300 166.100 305.278 166.100 305.250 V 299.250 C 166.100 299.222 166.078 299.200 166.050 299.200 H 163.100 C 163.050 299.200 163.100 299.250 163.100 299.200 V 293.300 C 163.100 293.250 163.050 293.300 163.100 293.300 H 166.050 C 166.078 293.300 166.100 293.278 166.100 293.250 V 287.250 C 166.100 287.222 166.078 287.200 166.050 287.200 H 163.100 C 163.050 287.200 163.100 287.250 163.100 287.200 V 281.300 C 163.100 281.250 163.050 281.300 163.100 281.300 H 166.050 C 166.078 281.300 166.100 281.278 166.100 281.250 V 275.250 C 166.100 275.222 166.078 275.200 166.050 275.200 H 163.100 C 163.050 275.200 163.100 275.250 163.100 275.200 V 269.300 C 163.100 269.250 163.050 269.300 163.100 269.300 H 166.050 C 166.078 269.300 166.100 269.278 166.100 269.250 V 263.250 C 166.100 263.222 166.078 263.200 166.050 263.200 H 163.100 C 163.050 263.200 163.100 263.250 163.100 263.200 V 257.300 C 163.100 257.250 163.050 257.300 163.100 257.300 H 166.050 C 166.078 257.300 166.100 257.278 166.100 257.250 V 251.250 C 166.100 251.222 166.078 251.200 166.050 251.200 H 163.100 C 163.050 251.200 163.100 251.250 163.100 251.200 V 245.300 C 163.100 245.250 163.050 245.300 163.100 245.300 H 166.050 C 166.078 245.300 166.100 245.278 166.100 245.250 V 234.250 V 231.250 C 166.100 231.222 166.078 231.200 166.050 231.200 H 163.050 H 157.050 C 157.022 231.200 157.000 231.222 157.000 231.250 V 234.200 C 157.000 234.250 157.050 234.200 157.000 234.200 H 151.100 C 151.050 234.200 151.100 234.250 151.100 234.200 V 231.250 C 151.100 231.222 151.078 231.200 151.050 231.200 H 145.050 C 145.022 231.200 145.000 231.222 145.000 231.250 V 234.200 C 145.000 234.250 145.050 234.200 145.000 234.200 H 139.100 C 139.050 234.200 139.100 234.250 139.100 234.200 V 231.250 C 139.100 231.222 139.078 231.200 139.050 231.200 H 133.050 C 133.022 231.200 133.000 231.222 133.000 231.250 V 234.200 C 133.000 234.250 133.050 234.200 133.000 234.200 H 127.100 C 127.050 234.200 127.100 234.250 127.100 234.200 V 231.250 C 127.100 231.222 127.078 231.200 127.050 231.200 H 121.050 C 121.022 231.200 121.000 231.222 121.000 231.250 V 234.200 C 121.000 234.250 121.050 234.200 121.000 234.200 H 115.100 C 115.050 234.200 115.100 234.250 115.100 234.200 V 231.250 C 115.100 231.222 115.078 231.200 115.050 231.200 H 109.050 C 109.022 231.200 109.000 231.222 109.000 231.250 V 234.200 C 109.000 234.250 109.050 234.200 109.000 234.200 H 103.100 C 103.050 234.200 103.100 234.250 103.100 234.200 V 231.250 C 103.100 231.222 103.078 231.200 103.050 231.200 H 97.050 C 97.022 231.200 97.000 231.222 97.000 231.250 V 234.200 C 97.000 234.250 97.050 234.200 97.000 234.200 H 91.100 C 91.050 234.200 91.100 234.250 91.100 234.200 V 231.250 C 91.100 231.222 91.078 231.200 91.050 231.200 H 85.050 C 85.022 231.200 85.000 231.222 85.000 231.250 V 234.200 C 85.000 234.250 85.050 234.200 85.000 234.200 H 79.100 C 79.050 234.200 79.100 234.250 79.100 234.200 V 231.250 C 79.100 231.222 79.078 231.200 79.050 231.200 H 73.050 C 73.022 231.200 73.000 231.222 73.000 231.250 V 234.200 C 73.000 234.250 73.050 234.200 73.000 234.200 H 67.100 C 67.050 234.200 67.100 234.250 67.100 234.200 V 231.250 C 67.100 231.222 67.078 231.200 67.050 231.200 H 61.050 C 61.022 231.200 61.000 231.222 61.000 231.250 V 234.200 C 61.000 234.250 61.050 234.200 61.000 234.200 H 55.100 C 55.050 234.200 55.100 234.250 55.100 234.200 V 231.250 C 55.100 231.222 55.078 231.200 55.050 231.200 H 49.050 C 49.022 231.200 49.000 231.222 49.000 231.250 V 234.200 C 49.000 234.250 49.050 234.200 49.000 234.200 H 43.100 C 43.050 234.200 43.100 234.250 43.100 234.200 V 231.250 C 43.100 231.222 43.078 231.200 43.050 231.200 H 37.050 C 37.022 231.200 37.000 231.222 37.000 231.250 V 234.200 C 37.000 234.250 37.050 234.200 37.000 234.200 H 31.100 C 31.050 234.200 31.100 234.250 31.100 234.200 V 231.250 C 31.100 231.222 31.078 231.200 31.050 231.200 H 25.050 C 25.022 231.200 25.000 231.222 25.000 231.250 V 234.200 C 25.000 234.250 25.050 234.200 25.000 234.200 H 19.100 C 19.050 234.200 19.100 234.250 19.100 234.200 V 231.250 C 19.100 231.222 19.078 231.200 19.050 231.200 H 13.050 H 10.050 C 10.022 231.200 10.000 231.222 10.000 231.250 V 234.250 V 245.250 C 10.000 245.278 10.022 245.300 10.050 245.300 H 13.000 C 13.050 245.300 13.000 245.250 13.000 245.300 V 251.200 C 13.000 251.250 13.050 251.200 13.000 251.200 H 10.050 C 10.022 251.200 10.000 251.222 10.000 251.250 V 257.250 C 10.000 257.278 10.022 257.300 10.050 257.300 H 13.000 C 13.050 257.300 13.000 257.250 13.000 257.300 V 263.200 C 13.000 263.250 13.050 263.200 13.000 263.200 H 10.050 C 10.022 263.200 10.000 263.222 10.000 263.250 V 269.250 C 10.000 269.278 10.022 269.300 10.050 269.300 H 13.000 C 13.050 269.300 13.000 269.250 13.000 269.300 V 275.200 C 13.000 275.250 13.050 275.200 13.000 275.200 H 10.050 C 10.022 275.200 10.000 275.222 10.000 275.250 V 281.250 C 10.000 281.278 10.022 281.300 10.050 281.300 H 13.000 C 13.050 281.300 13.000 281.250 13.000 281.300 V 287.200 C 13.000 287.250 13.050 287.200 13.000 287.200 H 10.050 C 10.022 287.200 10.000 287.222 10.000 287.250 V 293.250 C 10.000 293.278 10.022 293.300 10.050 293.300 H 13.000 C 13.050 293.300 13.000 293.250 13.000 293.300 V 299.200 C 13.000 299.250 13.050 299.200 13.000 299.200 H 10.050 C 10.022 299.200 10.000 299.222 10.000 299.250 V 305.250 C 10.000 305.278 10.022 305.300 10.050 305.300 H 13.000 C 13.050 305.300 13.000 305.250 13.000 305.300 V 311.200 C 13.000 311.250 13.050 311.200 13.000 311.200 H 10.050 C 10.022 311.200 10.000 311.222 10.000 311.250 V 317.250 C 10.000 317.278 10.022 317.300 10.050 317.300 H 13.000 C 13.050 317.300 13.000 317.250 13.000 317.300 V 323.200 C 13.000 323.250 13.050 323.200 13.000 323.200 H 10.050 C 10.022 323.200 10.000 323.222 10.000 323.250 V 334.250 C 10.000 334.278 10.022 334.300 10.050 334.300 H 13.050 Z"
       stroke="rgb(0,0,0)"
       stroke-width="0.10"
       id="path951" />
  </g>
  <g
     id="p-2"
     style="fill:none;stroke-linecap:round;stroke-linejoin:round;">
    <path
       d="M 170.650 334.300 H 181.600 C 181.650 334.300 181.600 334.250 181.600 334.300 V 337.250 C 181.600 337.278 181.622 337.300 181.650 337.300 H 187.650 C 187.678 337.300 187.700 337.278 187.700 337.250 V 334.300 C 187.700 334.250 187.650 334.300 187.700 334.300 H 193.600 C 193.650 334.300 193.600 334.250 193.600 334.300 V 337.250 C 193.600 337.278 193.622 337.300 193.650 337.300 H 199.650 C 199.678 337.300 199.700 337.278 199.700 337.250 V 334.300 C 199.700 334.250 199.650 334.300 199.700 334.300 H 205.600 C 205.650 334.300 205.600 334.250 205.600 334.300 V 337.250 C 205.600 337.278 205.622 337.300 205.650 337.300 H 211.650 C 211.678 337.300 211.700 337.278 211.700 337.250 V 334.300 C 211.700 334.250 211.650 334.300 211.700 334.300 H 217.600 C 217.650 334.300 217.600 334.250 217.600 334.300 V 337.250 C 217.600 337.278 217.622 337.300 217.650 337.300 H 223.650 C 223.678 337.300 223.700 337.278 223.700 337.250 V 334.300 C 223.700 334.250 223.650 334.300 223.700 334.300 H 229.600 C 229.650 334.300 229.600 334.250 229.600 334.300 V 337.250 C 229.600 337.278 229.622 337.300 229.650 337.300 H 235.650 C 235.678 337.300 235.700 337.278 235.700 337.250 V 334.300 C 235.700 334.250 235.650 334.300 235.700 334.300 H 241.600 C 241.650 334.300 241.600 334.250 241.600 334.300 V 337.250 C 241.600 337.278 241.622 337.300 241.650 337.300 H 247.650 C 247.678 337.300 247.700 337.278 247.700 337.250 V 334.300 C 247.700 334.250 247.650 334.300 247.700 334.300 H 253.600 C 253.650 334.300 253.600 334.250 253.600 334.300 V 337.250 C 253.600 337.278 253.622 337.300 253.650 337.300 H 259.650 C 259.678 337.300 259.700 337.278 259.700 337.250 V 334.300 C 259.700 334.250 259.650 334.300 259.700 334.300 H 270.650 C 270.678 334.300 270.700 334.278 270.700 334.250 V 323.300 C 270.700 323.250 270.650 323.300 270.700 323.300 H 273.650 C 273.678 323.300 273.700 323.278 273.700 323.250 V 317.250 C 273.700 317.222 273.678 317.200 273.650 317.200 H 270.700 C 270.650 317.200 270.700 317.250 270.700 317.200 V 311.300 C 270.700 311.250 270.650 311.300 270.700 311.300 H 273.650 C 273.678 311.300 273.700 311.278 273.700 311.250 V 305.250 C 273.700 305.222 273.678 305.200 273.650 305.200 H 270.700 C 270.650 305.200 270.700 305.250 270.700 305.200 V 299.300 C 270.700 299.250 270.650 299.300 270.700 299.300 H 273.650 C 273.678 299.300 273.700 299.278 273.700 299.250 V 293.250 C 273.700 293.222 273.678 293.200 273.650 293.200 H 270.700 C 270.650 293.200 270.700 293.250 270.700 293.200 V 287.300 C 270.700 287.250 270.650 287.300 270.700 287.300 H 273.650 C 273.678 287.300 273.700 287.278 273.700 287.250 V 281.250 C 273.700 281.222 273.678 281.200 273.650 281.200 H 270.700 C 270.650 281.200 270.700 281.250 270.700 281.200 V 275.300 C 270.700 275.250 270.650 275.300 270.700 275.300 H 273.650 C 273.678 275.300 273.700 275.278 273.700 275.250 V 269.250 C 273.700 269.222 273.678 269.200 273.650 269.200 H 270.700 C 270.650 269.200 270.700 269.250 270.700 269.200 V 263.300 C 270.700 263.250 270.650 263.300 270.700 263.300 H 273.650 C 273.678 263.300 273.700 263.278 273.700 263.250 V 257.250 C 273.700 257.222 273.678 257.200 273.650 257.200 H 270.700 C 270.650 257.200 270.700 257.250 270.700 257.200 V 251.300 C 270.700 251.250 270.650 251.300 270.700 251.300 H 273.650 C 273.678 251.300 273.700 251.278 273.700 251.250 V 245.250 C 273.700 245.222 273.678 245.200 273.650 245.200 H 270.700 C 270.650 245.200 270.700 245.250 270.700 245.200 V 234.250 V 231.250 C 270.700 231.222 270.678 231.200 270.650 231.200 H 259.650 C 259.622 231.200 259.600 231.222 259.600 231.250 V 234.200 C 259.600 234.250 259.650 234.200 259.600 234.200 H 253.700 C 253.650 234.200 253.700 234.250 253.700 234.200 V 231.250 C 253.700 231.222 253.678 231.200 253.650 231.200 H 247.650 C 247.622 231.200 247.600 231.222 247.600 231.250 V 234.200 C 247.600 234.250 247.650 234.200 247.600 234.200 H 241.700 C 241.650 234.200 241.700 234.250 241.700 234.200 V 231.250 C 241.700 231.222 241.678 231.200 241.650 231.200 H 235.650 C 235.622 231.200 235.600 231.222 235.600 231.250 V 234.200 C 235.600 234.250 235.650 234.200 235.600 234.200 H 229.700 C 229.650 234.200 229.700 234.250 229.700 234.200 V 231.250 C 229.700 231.222 229.678 231.200 229.650 231.200 H 223.650 C 223.622 231.200 223.600 231.222 223.600 231.250 V 234.200 C 223.600 234.250 223.650 234.200 223.600 234.200 H 217.700 C 217.650 234.200 217.700 234.250 217.700 234.200 V 231.250 C 217.700 231.222 217.678 231.200 217.650 231.200 H 211.650 C 211.622 231.200 211.600 231.222 211.600 231.250 V 234.200 C 211.600 234.250 211.650 234.200 211.600 234.200 H 205.700 C 205.650 234.200 205.700 234.250 205.700 234.200 V 231.250 C 205.700 231.222 205.678 231.200 205.650 231.200 H 199.650 C 199.622 231.200 199.600 231.222 199.600 231.250 V 234.200 C 199.600 234.250 199.650 234.200 199.600 234.200 H 193.700 C 193.650 234.200 193.700 234.250 193.700 234.200 V 231.250 C 193.700 231.222 193.678 231.200 193.650 231.200 H 187.650 C 187.622 231.200 187.600 231.222 187.600 231.250 V 234.200 C 187.600 234.250 187.650 234.200 187.600 234.200 H 181.700 C 181.650 234.200 181.700 234.250 181.700 234.200 V 231.250 C 181.700 231.222 181.678 231.200 181.650 231.200 H 170.650 C 170.622 231.200 170.600 231.222 170.600 231.250 V 234.250 V 245.200 C 170.600 245.250 170.650 245.200 170.600 245.200 H 167.650 C 167.622 245.200 167.600 245.222 167.600 245.250 V 251.250 C 167.600 251.278 167.622 251.300 167.650 251.300 H 170.600 C 170.650 251.300 170.600 251.250 170.600 251.300 V 257.200 C 170.600 257.250 170.650 257.200 170.600 257.200 H 167.650 C 167.622 257.200 167.600 257.222 167.600 257.250 V 263.250 C 167.600 263.278 167.622 263.300 167.650 263.300 H 170.600 C 170.650 263.300 170.600 263.250 170.600 263.300 V 269.200 C 170.600 269.250 170.650 269.200 170.600 269.200 H 167.650 C 167.622 269.200 167.600 269.222 167.600 269.250 V 275.250 C 167.600 275.278 167.622 275.300 167.650 275.300 H 170.600 C 170.650 275.300 170.600 275.250 170.600 275.300 V 281.200 C 170.600 281.250 170.650 281.200 170.600 281.200 H 167.650 C 167.622 281.200 167.600 281.222 167.600 281.250 V 287.250 C 167.600 287.278 167.622 287.300 167.650 287.300 H 170.600 C 170.650 287.300 170.600 287.250 170.600 287.300 V 293.200 C 170.600 293.250 170.650 293.200 170.600 293.200 H 167.650 C 167.622 293.200 167.600 293.222 167.600 293.250 V 299.250 C 167.600 299.278 167.622 299.300 167.650 299.300 H 170.600 C 170.650 299.300 170.600 299.250 170.600 299.300 V 305.200 C 170.600 305.250 170.650 305.200 170.600 305.200 H 167.650 C 167.622 305.200 167.600 305.222 167.600 305.250 V 311.250 C 167.600 311.278 167.622 311.300 167.650 311.300 H 170.600 C 170.650 311.300 170.600 311.250 170.600 311.300 V 317.200 C 170.600 317.250 170.650 317.200 170.600 317.200 H 167.650 C 167.622 317.200 167.600 317.222 167.600 317.250 V 323.250 C 167.600 323.278 167.622 323.300 167.650 323.300 H 170.600 C 170.650 323.300 170.600 323.250 170.600 323.300 V 334.250 C 170.600 334.278 170.622 334.300 170.650 334.300 Z"
       stroke="rgb(0,0,0)"
       stroke-width="0.10"
       id="path954" />
  </g>
  <g
     id="p-3"
     style="fill:none;stroke-linecap:round;stroke-linejoin:round;">
    <path
       d="M 170.650 226.700 H 181.600 C 181.650 226.700 181.600 226.650 181.600 226.700 V 229.650 C 181.600 229.678 181.622 229.700 181.650 229.700 H 187.650 C 187.678 229.700 187.700 229.678 187.700 229.650 V 226.700 C 187.700 226.650 187.650 226.700 187.700 226.700 H 193.600 C 193.650 226.700 193.600 226.650 193.600 226.700 V 229.650 C 193.600 229.678 193.622 229.700 193.650 229.700 H 199.650 C 199.678 229.700 199.700 229.678 199.700 229.650 V 226.700 C 199.700 226.650 199.650 226.700 199.700 226.700 H 205.600 C 205.650 226.700 205.600 226.650 205.600 226.700 V 229.650 C 205.600 229.678 205.622 229.700 205.650 229.700 H 211.650 C 211.678 229.700 211.700 229.678 211.700 229.650 V 226.700 C 211.700 226.650 211.650 226.700 211.700 226.700 H 217.600 C 217.650 226.700 217.600 226.650 217.600 226.700 V 229.650 C 217.600 229.678 217.622 229.700 217.650 229.700 H 223.650 C 223.678 229.700 223.700 229.678 223.700 229.650 V 226.700 C 223.700 226.650 223.650 226.700 223.700 226.700 H 229.600 C 229.650 226.700 229.600 226.650 229.600 226.700 V 229.650 C 229.600 229.678 229.622 229.700 229.650 229.700 H 235.650 C 235.678 229.700 235.700 229.678 235.700 229.650 V 226.700 C 235.700 226.650 235.650 226.700 235.700 226.700 H 241.600 C 241.650 226.700 241.600 226.650 241.600 226.700 V 229.650 C 241.600 229.678 241.622 229.700 241.650 229.700 H 247.650 C 247.678 229.700 247.700 229.678 247.700 229.650 V 226.700 C 247.700 226.650 247.650 226.700 247.700 226.700 H 253.600 C 253.650 226.700 253.600 226.650 253.600 226.700 V 229.650 C 253.600 229.678 253.622 229.700 253.650 229.700 H 259.650 C 259.678 229.700 259.700 229.678 259.700 229.650 V 226.700 C 259.700 226.650 259.650 226.700 259.700 226.700 H 270.650 C 270.678 226.700 270.700 226.678 270.700 226.650 V 215.700 C 270.700 215.650 270.650 215.700 270.700 215.700 H 273.650 C 273.678 215.700 273.700 215.678 273.700 215.650 V 209.650 C 273.700 209.622 273.678 209.600 273.650 209.600 H 270.700 C 270.650 209.600 270.700 209.650 270.700 209.600 V 203.700 C 270.700 203.650 270.650 203.700 270.700 203.700 H 273.650 C 273.678 203.700 273.700 203.678 273.700 203.650 V 197.650 C 273.700 197.622 273.678 197.600 273.650 197.600 H 270.700 C 270.650 197.600 270.700 197.650 270.700 197.600 V 191.700 C 270.700 191.650 270.650 191.700 270.700 191.700 H 273.650 C 273.678 191.700 273.700 191.678 273.700 191.650 V 185.650 C 273.700 185.622 273.678 185.600 273.650 185.600 H 270.700 C 270.650 185.600 270.700 185.650 270.700 185.600 V 179.700 C 270.700 179.650 270.650 179.700 270.700 179.700 H 273.650 C 273.678 179.700 273.700 179.678 273.700 179.650 V 173.650 C 273.700 173.622 273.678 173.600 273.650 173.600 H 270.700 C 270.650 173.600 270.700 173.650 270.700 173.600 V 167.700 C 270.700 167.650 270.650 167.700 270.700 167.700 H 273.650 C 273.678 167.700 273.700 167.678 273.700 167.650 V 161.650 C 273.700 161.622 273.678 161.600 273.650 161.600 H 270.700 C 270.650 161.600 270.700 161.650 270.700 161.600 V 155.700 C 270.700 155.650 270.650 155.700 270.700 155.700 H 273.650 C 273.678 155.700 273.700 155.678 273.700 155.650 V 149.650 C 273.700 149.622 273.678 149.600 273.650 149.600 H 270.700 C 270.650 149.600 270.700 149.650 270.700 149.600 V 143.700 C 270.700 143.650 270.650 143.700 270.700 143.700 H 273.650 C 273.678 143.700 273.700 143.678 273.700 143.650 V 137.650 C 273.700 137.622 273.678 137.600 273.650 137.600 H 270.700 C 270.650 137.600 270.700 137.650 270.700 137.600 V 126.650 V 123.650 C 270.700 123.622 270.678 123.600 270.650 123.600 H 259.650 C 259.622 123.600 259.600 123.622 259.600 123.650 V 126.600 C 259.600 126.650 259.650 126.600 259.600 126.600 H 253.700 C 253.650 126.600 253.700 126.650 253.700 126.600 V 123.650 C 253.700 123.622 253.678 123.600 253.650 123.600 H 247.650 C 247.622 123.600 247.600 123.622 247.600 123.650 V 126.600 C 247.600 126.650 247.650 126.600 247.600 126.600 H 241.700 C 241.650 126.600 241.700 126.650 241.700 126.600 V 123.650 C 241.700 123.622 241.678 123.600 241.650 123.600 H 235.650 C 235.622 123.600 235.600 123.622 235.600 123.650 V 126.600 C 235.600 126.650 235.650 126.600 235.600 126.600 H 229.700 C 229.650 126.600 229.700 126.650 229.700 126.600 V 123.650 C 229.700 123.622 229.678 123.600 229.650 123.600 H 223.650 C 223.622 123.600 223.600 123.622 223.600 123.650 V 126.600 C 223.600 126.650 223.650 126.600 223.600 126.600 H 217.700 C 217.650 126.600 217.700 126.650 217.700 126.600 V 123.650 C 217.700 123.622 217.678 123.600 217.650 123.600 H 211.650 C 211.622 123.600 211.600 123.622 211.600 123.650 V 126.600 C 211.600 126.650 211.650 126.600 211.600 126.600 H 205.700 C 205.650 126.600 205.700 126.650 205.700 126.600 V 123.650 C 205.700 123.622 205.678 123.600 205.650 123.600 H 199.650 C 199.622 123.600 199.600 123.622 199.600 123.650 V 126.600 C 199.600 126.650 199.650 126.600 199.600 126.600 H 193.700 C 193.650 126.600 193.700 126.650 193.700 126.600 V 123.650 C 193.700 123.622 193.678 123.600 193.650 123.600 H 187.650 C 187.622 123.600 187.600 123.622 187.600 123.650 V 126.600 C 187.600 126.650 187.650 126.600 187.600 126.600 H 181.700 C 181.650 126.600 181.700 126.650 181.700 126.600 V 123.650 C 181.700 123.622 181.678 123.600 181.650 123.600 H 170.650 C 170.622 123.600 170.600 123.622 170.600 123.650 V 126.650 V 137.600 C 170.600 137.650 170.650 137.600 170.600 137.600 H 167.650 C 167.622 137.600 167.600 137.622 167.600 137.650 V 143.650 C 167.600 143.678 167.622 143.700 167.650 143.700 H 170.600 C 170.650 143.700 170.600 143.650 170.600 143.700 V 149.600 C 170.600 149.650 170.650 149.600 170.600 149.600 H 167.650 C 167.622 149.600 167.600 149.622 167.600 149.650 V 155.650 C 167.600 155.678 167.622 155.700 167.650 155.700 H 170.600 C 170.650 155.700 170.600 155.650 170.600 155.700 V 161.600 C 170.600 161.650 170.650 161.600 170.600 161.600 H 167.650 C 167.622 161.600 167.600 161.622 167.600 161.650 V 167.650 C 167.600 167.678 167.622 167.700 167.650 167.700 H 170.600 C 170.650 167.700 170.600 167.650 170.600 167.700 V 173.600 C 170.600 173.650 170.650 173.600 170.600 173.600 H 167.650 C 167.622 173.600 167.600 173.622 167.600 173.650 V 179.650 C 167.600 179.678 167.622 179.700 167.650 179.700 H 170.600 C 170.650 179.700 170.600 179.650 170.600 179.700 V 185.600 C 170.600 185.650 170.650 185.600 170.600 185.600 H 167.650 C 167.622 185.600 167.600 185.622 167.600 185.650 V 191.650 C 167.600 191.678 167.622 191.700 167.650 191.700 H 170.600 C 170.650 191.700 170.600 191.650 170.600 191.700 V 197.600 C 170.600 197.650 170.650 197.600 170.600 197.600 H 167.650 C 167.622 197.600 167.600 197.622 167.600 197.650 V 203.650 C 167.600 203.678 167.622 203.700 167.650 203.700 H 170.600 C 170.650 203.700 170.600 203.650 170.600 203.700 V 209.600 C 170.600 209.650 170.650 209.600 170.600 209.600 H 167.650 C 167.622 209.600 167.600 209.622 167.600 209.650 V 215.650 C 167.600 215.678 167.622 215.700 167.650 215.700 H 170.600 C 170.650 215.700 170.600 215.650 170.600 215.700 V 226.650 C 170.600 226.678 170.622 226.700 170.650 226.700 Z"
       stroke="rgb(0,0,0)"
       stroke-width="0.10"
       id="path957" />
  </g>
  <g
     id="p-4"
     style="fill:none;stroke-linecap:round;stroke-linejoin:round;">
    <path
       d="M 13.050 226.700 H 19.000 C 19.050 226.700 19.000 226.650 19.000 226.700 V 229.650 C 19.000 229.678 19.022 229.700 19.050 229.700 H 25.050 C 25.078 229.700 25.100 229.678 25.100 229.650 V 226.700 C 25.100 226.650 25.050 226.700 25.100 226.700 H 31.000 C 31.050 226.700 31.000 226.650 31.000 226.700 V 229.650 C 31.000 229.678 31.022 229.700 31.050 229.700 H 37.050 C 37.078 229.700 37.100 229.678 37.100 229.650 V 226.700 C 37.100 226.650 37.050 226.700 37.100 226.700 H 43.000 C 43.050 226.700 43.000 226.650 43.000 226.700 V 229.650 C 43.000 229.678 43.022 229.700 43.050 229.700 H 49.050 C 49.078 229.700 49.100 229.678 49.100 229.650 V 226.700 C 49.100 226.650 49.050 226.700 49.100 226.700 H 55.000 C 55.050 226.700 55.000 226.650 55.000 226.700 V 229.650 C 55.000 229.678 55.022 229.700 55.050 229.700 H 61.050 C 61.078 229.700 61.100 229.678 61.100 229.650 V 226.700 C 61.100 226.650 61.050 226.700 61.100 226.700 H 67.000 C 67.050 226.700 67.000 226.650 67.000 226.700 V 229.650 C 67.000 229.678 67.022 229.700 67.050 229.700 H 73.050 C 73.078 229.700 73.100 229.678 73.100 229.650 V 226.700 C 73.100 226.650 73.050 226.700 73.100 226.700 H 79.000 C 79.050 226.700 79.000 226.650 79.000 226.700 V 229.650 C 79.000 229.678 79.022 229.700 79.050 229.700 H 85.050 C 85.078 229.700 85.100 229.678 85.100 229.650 V 226.700 C 85.100 226.650 85.050 226.700 85.100 226.700 H 91.000 C 91.050 226.700 91.000 226.650 91.000 226.700 V 229.650 C 91.000 229.678 91.022 229.700 91.050 229.700 H 97.050 C 97.078 229.700 97.100 229.678 97.100 229.650 V 226.700 C 97.100 226.650 97.050 226.700 97.100 226.700 H 103.000 C 103.050 226.700 103.000 226.650 103.000 226.700 V 229.650 C 103.000 229.678 103.022 229.700 103.050 229.700 H 109.050 C 109.078 229.700 109.100 229.678 109.100 229.650 V 226.700 C 109.100 226.650 109.050 226.700 109.100 226.700 H 115.000 C 115.050 226.700 115.000 226.650 115.000 226.700 V 229.650 C 115.000 229.678 115.022 229.700 115.050 229.700 H 121.050 C 121.078 229.700 121.100 229.678 121.100 229.650 V 226.700 C 121.100 226.650 121.050 226.700 121.100 226.700 H 127.000 C 127.050 226.700 127.000 226.650 127.000 226.700 V 229.650 C 127.000 229.678 127.022 229.700 127.050 229.700 H 133.050 C 133.078 229.700 133.100 229.678 133.100 229.650 V 226.700 C 133.100 226.650 133.050 226.700 133.100 226.700 H 139.000 C 139.050 226.700 139.000 226.650 139.000 226.700 V 229.650 C 139.000 229.678 139.022 229.700 139.050 229.700 H 145.050 C 145.078 229.700 145.100 229.678 145.100 229.650 V 226.700 C 145.100 226.650 145.050 226.700 145.100 226.700 H 151.000 C 151.050 226.700 151.000 226.650 151.000 226.700 V 229.650 C 151.000 229.678 151.022 229.700 151.050 229.700 H 157.050 C 157.078 229.700 157.100 229.678 157.100 229.650 V 226.700 C 157.100 226.650 157.050 226.700 157.100 226.700 H 163.050 H 166.050 C 166.078 226.700 166.100 226.678 166.100 226.650 V 215.650 C 166.100 215.622 166.078 215.600 166.050 215.600 H 163.100 C 163.050 215.600 163.100 215.650 163.100 215.600 V 209.700 C 163.100 209.650 163.050 209.700 163.100 209.700 H 166.050 C 166.078 209.700 166.100 209.678 166.100 209.650 V 203.650 C 166.100 203.622 166.078 203.600 166.050 203.600 H 163.100 C 163.050 203.600 163.100 203.650 163.100 203.600 V 197.700 C 163.100 197.650 163.050 197.700 163.100 197.700 H 166.050 C 166.078 197.700 166.100 197.678 166.100 197.650 V 191.650 C 166.100 191.622 166.078 191.600 166.050 191.600 H 163.100 C 163.050 191.600 163.100 191.650 163.100 191.600 V 185.700 C 163.100 185.650 163.050 185.700 163.100 185.700 H 166.050 C 166.078 185.700 166.100 185.678 166.100 185.650 V 179.650 C 166.100 179.622 166.078 179.600 166.050 179.600 H 163.100 C 163.050 179.600 163.100 179.650 163.100 179.600 V 173.700 C 163.100 173.650 163.050 173.700 163.100 173.700 H 166.050 C 166.078 173.700 166.100 173.678 166.100 173.650 V 167.650 C 166.100 167.622 166.078 167.600 166.050 167.600 H 163.100 C 163.050 167.600 163.100 167.650 163.100 167.600 V 161.700 C 163.100 161.650 163.050 161.700 163.100 161.700 H 166.050 C 166.078 161.700 166.100 161.678 166.100 161.650 V 155.650 C 166.100 155.622 166.078 155.600 166.050 155.600 H 163.100 C 163.050 155.600 163.100 155.650 163.100 155.600 V 149.700 C 163.100 149.650 163.050 149.700 163.100 149.700 H 166.050 C 166.078 149.700 166.100 149.678 166.100 149.650 V 143.650 C 166.100 143.622 166.078 143.600 166.050 143.600 H 163.100 C 163.050 143.600 163.100 143.650 163.100 143.600 V 137.700 C 163.100 137.650 163.050 137.700 163.100 137.700 H 166.050 C 166.078 137.700 166.100 137.678 166.100 137.650 V 126.650 V 123.650 C 166.100 123.622 166.078 123.600 166.050 123.600 H 163.050 H 157.050 C 157.022 123.600 157.000 123.622 157.000 123.650 V 126.600 C 157.000 126.650 157.050 126.600 157.000 126.600 H 151.100 C 151.050 126.600 151.100 126.650 151.100 126.600 V 123.650 C 151.100 123.622 151.078 123.600 151.050 123.600 H 145.050 C 145.022 123.600 145.000 123.622 145.000 123.650 V 126.600 C 145.000 126.650 145.050 126.600 145.000 126.600 H 139.100 C 139.050 126.600 139.100 126.650 139.100 126.600 V 123.650 C 139.100 123.622 139.078 123.600 139.050 123.600 H 133.050 C 133.022 123.600 133.000 123.622 133.000 123.650 V 126.600 C 133.000 126.650 133.050 126.600 133.000 126.600 H 127.100 C 127.050 126.600 127.100 126.650 127.100 126.600 V 123.650 C 127.100 123.622 127.078 123.600 127.050 123.600 H 121.050 C 121.022 123.600 121.000 123.622 121.000 123.650 V 126.600 C 121.000 126.650 121.050 126.600 121.000 126.600 H 115.100 C 115.050 126.600 115.100 126.650 115.100 126.600 V 123.650 C 115.100 123.622 115.078 123.600 115.050 123.600 H 109.050 C 109.022 123.600 109.000 123.622 109.000 123.650 V 126.600 C 109.000 126.650 109.050 126.600 109.000 126.600 H 103.100 C 103.050 126.600 103.100 126.650 103.100 126.600 V 123.650 C 103.100 123.622 103.078 123.600 103.050 123.600 H 97.050 C 97.022 123.600 97.000 123.622 97.000 123.650 V 126.600 C 97.000 126.650 97.050 126.600 97.000 126.600 H 91.100 C 91.050 126.600 91.100 126.650 91.100 126.600 V 123.650 C 91.100 123.622 91.078 123.600 91.050 123.600 H 85.050 C 85.022 123.600 85.000 123.622 85.000 123.650 V 126.600 C 85.000 126.650 85.050 126.600 85.000 126.600 H 79.100 C 79.050 126.600 79.100 126.650 79.100 126.600 V 123.650 C 79.100 123.622 79.078 123.600 79.050 123.600 H 73.050 C 73.022 123.600 73.000 123.622 73.000 123.650 V 126.600 C 73.000 126.650 73.050 126.600 73.000 126.600 H 67.100 C 67.050 126.600 67.100 126.650 67.100 126.600 V 123.650 C 67.100 123.622 67.078 123.600 67.050 123.600 H 61.050 C 61.022 123.600 61.000 123.622 61.000 123.650 V 126.600 C 61.000 126.650 61.050 126.600 61.000 126.600 H 55.100 C 55.050 126.600 55.100 126.650 55.100 126.600 V 123.650 C 55.100 123.622 55.078 123.600 55.050 123.600 H 49.050 C 49.022 123.600 49.000 123.622 49.000 123.650 V 126.600 C 49.000 126.650 49.050 126.600 49.000 126.600 H 43.100 C 43.050 126.600 43.100 126.650 43.100 126.600 V 123.650 C 43.100 123.622 43.078 123.600 43.050 123.600 H 37.050 C 37.022 123.600 37.000 123.622 37.000 123.650 V 126.600 C 37.000 126.650 37.050 126.600 37.000 126.600 H 31.100 C 31.050 126.600 31.100 126.650 31.100 126.600 V 123.650 C 31.100 123.622 31.078 123.600 31.050 123.600 H 25.050 C 25.022 123.600 25.000 123.622 25.000 123.650 V 126.600 C 25.000 126.650 25.050 126.600 25.000 126.600 H 19.100 C 19.050 126.600 19.100 126.650 19.100 126.600 V 123.650 C 19.100 123.622 19.078 123.600 19.050 123.600 H 13.050 H 10.050 C 10.022 123.600 10.000 123.622 10.000 123.650 V 126.650 V 137.650 C 10.000 137.678 10.022 137.700 10.050 137.700 H 13.000 C 13.050 137.700 13.000 137.650 13.000 137.700 V 143.600 C 13.000 143.650 13.050 143.600 13.000 143.600 H 10.050 C 10.022 143.600 10.000 143.622 10.000 143.650 V 149.650 C 10.000 149.678 10.022 149.700 10.050 149.700 H 13.000 C 13.050 149.700 13.000 149.650 13.000 149.700 V 155.600 C 13.000 155.650 13.050 155.600 13.000 155.600 H 10.050 C 10.022 155.600 10.000 155.622 10.000 155.650 V 161.650 C 10.000 161.678 10.022 161.700 10.050 161.700 H 13.000 C 13.050 161.700 13.000 161.650 13.000 161.700 V 167.600 C 13.000 167.650 13.050 167.600 13.000 167.600 H 10.050 C 10.022 167.600 10.000 167.622 10.000 167.650 V 173.650 C 10.000 173.678 10.022 173.700 10.050 173.700 H 13.000 C 13.050 173.700 13.000 173.650 13.000 173.700 V 179.600 C 13.000 179.650 13.050 179.600 13.000 179.600 H 10.050 C 10.022 179.600 10.000 179.622 10.000 179.650 V 185.650 C 10.000 185.678 10.022 185.700 10.050 185.700 H 13.000 C 13.050 185.700 13.000 185.650 13.000 185.700 V 191.600 C 13.000 191.650 13.050 191.600 13.000 191.600 H 10.050 C 10.022 191.600 10.000 191.622 10.000 191.650 V 197.650 C 10.000 197.678 10.022 197.700 10.050 197.700 H 13.000 C 13.050 197.700 13.000 197.650 13.000 197.700 V 203.600 C 13.000 203.650 13.050 203.600 13.000 203.600 H 10.050 C 10.022 203.600 10.000 203.622 10.000 203.650 V 209.650 C 10.000 209.678 10.022 209.700 10.050 209.700 H 13.000 C 13.050 209.700 13.000 209.650 13.000 209.700 V 215.600 C 13.000 215.650 13.050 215.600 13.000 215.600 H 10.050 C 10.022 215.600 10.000 215.622 10.000 215.650 V 226.650 C 10.000 226.678 10.022 226.700 10.050 226.700 H 13.050 Z"
       stroke="rgb(0,0,0)"
       stroke-width="0.10"
       id="path960" />
  </g>
  <g
     id="p-5"
     style="fill:none;stroke-linecap:round;stroke-linejoin:round;">
    <path
       d="M 13.050 119.100 H 19.000 C 19.050 119.100 19.000 119.050 19.000 119.100 V 122.050 C 19.000 122.078 19.022 122.100 19.050 122.100 H 25.050 C 25.078 122.100 25.100 122.078 25.100 122.050 V 119.100 C 25.100 119.050 25.050 119.100 25.100 119.100 H 31.000 C 31.050 119.100 31.000 119.050 31.000 119.100 V 122.050 C 31.000 122.078 31.022 122.100 31.050 122.100 H 37.050 C 37.078 122.100 37.100 122.078 37.100 122.050 V 119.100 C 37.100 119.050 37.050 119.100 37.100 119.100 H 43.000 C 43.050 119.100 43.000 119.050 43.000 119.100 V 122.050 C 43.000 122.078 43.022 122.100 43.050 122.100 H 49.050 C 49.078 122.100 49.100 122.078 49.100 122.050 V 119.100 C 49.100 119.050 49.050 119.100 49.100 119.100 H 55.000 C 55.050 119.100 55.000 119.050 55.000 119.100 V 122.050 C 55.000 122.078 55.022 122.100 55.050 122.100 H 61.050 C 61.078 122.100 61.100 122.078 61.100 122.050 V 119.100 C 61.100 119.050 61.050 119.100 61.100 119.100 H 67.000 C 67.050 119.100 67.000 119.050 67.000 119.100 V 122.050 C 67.000 122.078 67.022 122.100 67.050 122.100 H 73.050 C 73.078 122.100 73.100 122.078 73.100 122.050 V 119.100 C 73.100 119.050 73.050 119.100 73.100 119.100 H 79.000 C 79.050 119.100 79.000 119.050 79.000 119.100 V 122.050 C 79.000 122.078 79.022 122.100 79.050 122.100 H 85.050 C 85.078 122.100 85.100 122.078 85.100 122.050 V 119.100 C 85.100 119.050 85.050 119.100 85.100 119.100 H 91.000 C 91.050 119.100 91.000 119.050 91.000 119.100 V 122.050 C 91.000 122.078 91.022 122.100 91.050 122.100 H 97.050 C 97.078 122.100 97.100 122.078 97.100 122.050 V 119.100 C 97.100 119.050 97.050 119.100 97.100 119.100 H 103.000 C 103.050 119.100 103.000 119.050 103.000 119.100 V 122.050 C 103.000 122.078 103.022 122.100 103.050 122.100 H 109.050 C 109.078 122.100 109.100 122.078 109.100 122.050 V 119.100 C 109.100 119.050 109.050 119.100 109.100 119.100 H 115.000 C 115.050 119.100 115.000 119.050 115.000 119.100 V 122.050 C 115.000 122.078 115.022 122.100 115.050 122.100 H 121.050 C 121.078 122.100 121.100 122.078 121.100 122.050 V 119.100 C 121.100 119.050 121.050 119.100 121.100 119.100 H 127.000 C 127.050 119.100 127.000 119.050 127.000 119.100 V 122.050 C 127.000 122.078 127.022 122.100 127.050 122.100 H 133.050 C 133.078 122.100 133.100 122.078 133.100 122.050 V 119.100 C 133.100 119.050 133.050 119.100 133.100 119.100 H 139.000 C 139.050 119.100 139.000 119.050 139.000 119.100 V 122.050 C 139.000 122.078 139.022 122.100 139.050 122.100 H 145.050 C 145.078 122.100 145.100 122.078 145.100 122.050 V 119.100 C 145.100 119.050 145.050 119.100 145.100 119.100 H 151.000 C 151.050 119.100 151.000 119.050 151.000 119.100 V 122.050 C 151.000 122.078 151.022 122.100 151.050 122.100 H 157.050 C 157.078 122.100 157.100 122.078 157.100 122.050 V 119.100 C 157.100 119.050 157.050 119.100 157.100 119.100 H 163.050 C 163.078 119.100 163.100 119.078 163.100 119.050 V 108.100 C 163.100 108.050 163.050 108.100 163.100 108.100 H 166.050 C 166.078 108.100 166.100 108.078 166.100 108.050 V 102.050 C 166.100 102.022 166.078 102.000 166.050 102.000 H 163.100 C 163.050 102.000 163.100 102.050 163.100 102.000 V 96.100 C 163.100 96.050 163.050 96.100 163.100 96.100 H 166.050 C 166.078 96.100 166.100 96.078 166.100 96.050 V 90.050 C 166.100 90.022 166.078 90.000 166.050 90.000 H 163.100 C 163.050 90.000 163.100 90.050 163.100 90.000 V 84.100 C 163.100 84.050 163.050 84.100 163.100 84.100 H 166.050 C 166.078 84.100 166.100 84.078 166.100 84.050 V 78.050 C 166.100 78.022 166.078 78.000 166.050 78.000 H 163.100 C 163.050 78.000 163.100 78.050 163.100 78.000 V 72.100 C 163.100 72.050 163.050 72.100 163.100 72.100 H 166.050 C 166.078 72.100 166.100 72.078 166.100 72.050 V 66.050 C 166.100 66.022 166.078 66.000 166.050 66.000 H 163.100 C 163.050 66.000 163.100 66.050 163.100 66.000 V 60.100 C 163.100 60.050 163.050 60.100 163.100 60.100 H 166.050 C 166.078 60.100 166.100 60.078 166.100 60.050 V 54.050 C 166.100 54.022 166.078 54.000 166.050 54.000 H 163.100 C 163.050 54.000 163.100 54.050 163.100 54.000 V 48.100 C 163.100 48.050 163.050 48.100 163.100 48.100 H 166.050 C 166.078 48.100 166.100 48.078 166.100 48.050 V 42.050 C 166.100 42.022 166.078 42.000 166.050 42.000 H 163.100 C 163.050 42.000 163.100 42.050 163.100 42.000 V 36.100 C 163.100 36.050 163.050 36.100 163.100 36.100 H 166.050 C 166.078 36.100 166.100 36.078 166.100 36.050 V 30.050 C 166.100 30.022 166.078 30.000 166.050 30.000 H 163.100 C 163.050 30.000 163.100 30.050 163.100 30.000 V 19.050 C 163.100 19.022 163.078 19.000 163.050 19.000 H 157.100 C 157.050 19.000 157.100 19.050 157.100 19.000 V 16.050 C 157.100 16.022 157.078 16.000 157.050 16.000 H 151.050 C 151.022 16.000 151.000 16.022 151.000 16.050 V 19.000 C 151.000 19.050 151.050 19.000 151.000 19.000 H 145.100 C 145.050 19.000 145.100 19.050 145.100 19.000 V 16.050 C 145.100 16.022 145.078 16.000 145.050 16.000 H 139.050 C 139.022 16.000 139.000 16.022 139.000 16.050 V 19.000 C 139.000 19.050 139.050 19.000 139.000 19.000 H 133.100 C 133.050 19.000 133.100 19.050 133.100 19.000 V 16.050 C 133.100 16.022 133.078 16.000 133.050 16.000 H 127.050 C 127.022 16.000 127.000 16.022 127.000 16.050 V 19.000 C 127.000 19.050 127.050 19.000 127.000 19.000 H 121.100 C 121.050 19.000 121.100 19.050 121.100 19.000 V 16.050 C 121.100 16.022 121.078 16.000 121.050 16.000 H 115.050 C 115.022 16.000 115.000 16.022 115.000 16.050 V 19.000 C 115.000 19.050 115.050 19.000 115.000 19.000 H 109.100 C 109.050 19.000 109.100 19.050 109.100 19.000 V 16.050 C 109.100 16.022 109.078 16.000 109.050 16.000 H 103.050 C 103.022 16.000 103.000 16.022 103.000 16.050 V 19.000 C 103.000 19.050 103.050 19.000 103.000 19.000 H 97.100 C 97.050 19.000 97.100 19.050 97.100 19.000 V 16.050 C 97.100 16.022 97.078 16.000 97.050 16.000 H 91.050 C 91.022 16.000 91.000 16.022 91.000 16.050 V 19.000 C 91.000 19.050 91.050 19.000 91.000 19.000 H 85.100 C 85.050 19.000 85.100 19.050 85.100 19.000 V 16.050 C 85.100 16.022 85.078 16.000 85.050 16.000 H 79.050 C 79.022 16.000 79.000 16.022 79.000 16.050 V 19.000 C 79.000 19.050 79.050 19.000 79.000 19.000 H 73.100 C 73.050 19.000 73.100 19.050 73.100 19.000 V 16.050 C 73.100 16.022 73.078 16.000 73.050 16.000 H 67.050 C 67.022 16.000 67.000 16.022 67.000 16.050 V 19.000 C 67.000 19.050 67.050 19.000 67.000 19.000 H 61.100 C 61.050 19.000 61.100 19.050 61.100 19.000 V 16.050 C 61.100 16.022 61.078 16.000 61.050 16.000 H 55.050 C 55.022 16.000 55.000 16.022 55.000 16.050 V 19.000 C 55.000 19.050 55.050 19.000 55.000 19.000 H 49.100 C 49.050 19.000 49.100 19.050 49.100 19.000 V 16.050 C 49.100 16.022 49.078 16.000 49.050 16.000 H 43.050 C 43.022 16.000 43.000 16.022 43.000 16.050 V 19.000 C 43.000 19.050 43.050 19.000 43.000 19.000 H 37.100 C 37.050 19.000 37.100 19.050 37.100 19.000 V 16.050 C 37.100 16.022 37.078 16.000 37.050 16.000 H 31.050 C 31.022 16.000 31.000 16.022 31.000 16.050 V 19.000 C 31.000 19.050 31.050 19.000 31.000 19.000 H 25.100 C 25.050 19.000 25.100 19.050 25.100 19.000 V 16.050 C 25.100 16.022 25.078 16.000 25.050 16.000 H 19.050 C 19.022 16.000 19.000 16.022 19.000 16.050 V 19.000 C 19.000 19.050 19.050 19.000 19.000 19.000 H 13.050 C 13.022 19.000 13.000 19.022 13.000 19.050 V 30.000 C 13.000 30.050 13.050 30.000 13.000 30.000 H 10.050 C 10.022 30.000 10.000 30.022 10.000 30.050 V 36.050 C 10.000 36.078 10.022 36.100 10.050 36.100 H 13.000 C 13.050 36.100 13.000 36.050 13.000 36.100 V 42.000 C 13.000 42.050 13.050 42.000 13.000 42.000 H 10.050 C 10.022 42.000 10.000 42.022 10.000 42.050 V 48.050 C 10.000 48.078 10.022 48.100 10.050 48.100 H 13.000 C 13.050 48.100 13.000 48.050 13.000 48.100 V 54.000 C 13.000 54.050 13.050 54.000 13.000 54.000 H 10.050 C 10.022 54.000 10.000 54.022 10.000 54.050 V 60.050 C 10.000 60.078 10.022 60.100 10.050 60.100 H 13.000 C 13.050 60.100 13.000 60.050 13.000 60.100 V 66.000 C 13.000 66.050 13.050 66.000 13.000 66.000 H 10.050 C 10.022 66.000 10.000 66.022 10.000 66.050 V 72.050 C 10.000 72.078 10.022 72.100 10.050 72.100 H 13.000 C 13.050 72.100 13.000 72.050 13.000 72.100 V 78.000 C 13.000 78.050 13.050 78.000 13.000 78.000 H 10.050 C 10.022 78.000 10.000 78.022 10.000 78.050 V 84.050 C 10.000 84.078 10.022 84.100 10.050 84.100 H 13.000 C 13.050 84.100 13.000 84.050 13.000 84.100 V 90.000 C 13.000 90.050 13.050 90.000 13.000 90.000 H 10.050 C 10.022 90.000 10.000 90.022 10.000 90.050 V 96.050 C 10.000 96.078 10.022 96.100 10.050 96.100 H 13.000 C 13.050 96.100 13.000 96.050 13.000 96.100 V 102.000 C 13.000 102.050 13.050 102.000 13.000 102.000 H 10.050 C 10.022 102.000 10.000 102.022 10.000 102.050 V 108.050 C 10.000 108.078 10.022 108.100 10.050 108.100 H 13.000 C 13.050 108.100 13.000 108.050 13.000 108.100 V 119.050 C 13.000 119.078 13.022 119.100 13.050 119.100 Z"
       stroke="rgb(0,0,0)"
       stroke-width="0.10"
       id="path963" />
  </g>
  <g
     id="p-6"
     style="fill:none;stroke-linecap:round;stroke-linejoin:round;">
    <path
       d="M 182.650 119.000 H 179.700 C 179.650 119.000 179.700 119.050 179.700 119.000 V 116.100 C 179.700 116.050 179.650 116.100 179.700 116.100 H 185.600 C 185.650 116.100 185.600 116.050 185.600 116.100 V 119.000 C 185.600 119.050 185.650 119.000 185.600 119.000 H 182.650 Z"
       stroke="rgb(0,0,255)"
       stroke-width="0.10"
       id="path966" />
    <path
       d="M 194.650 119.000 H 191.700 C 191.650 119.000 191.700 119.050 191.700 119.000 V 116.100 C 191.700 116.050 191.650 116.100 191.700 116.100 H 197.600 C 197.650 116.100 197.600 116.050 197.600 116.100 V 119.000 C 197.600 119.050 197.650 119.000 197.600 119.000 H 194.650 Z"
       stroke="rgb(0,0,255)"
       stroke-width="0.10"
       id="path968" />
    <path
       d="M 206.650 119.000 H 203.700 C 203.650 119.000 203.700 119.050 203.700 119.000 V 116.100 C 203.700 116.050 203.650 116.100 203.700 116.100 H 209.600 C 209.650 116.100 209.600 116.050 209.600 116.100 V 119.000 C 209.600 119.050 209.650 119.000 209.600 119.000 H 206.650 Z"
       stroke="rgb(0,0,255)"
       stroke-width="0.10"
       id="path970" />
    <path
       d="M 218.650 119.000 H 215.700 C 215.650 119.000 215.700 119.050 215.700 119.000 V 116.100 C 215.700 116.050 215.650 116.100 215.700 116.100 H 221.600 C 221.650 116.100 221.600 116.050 221.600 116.100 V 119.000 C 221.600 119.050 221.650 119.000 221.600 119.000 H 218.650 Z"
       stroke="rgb(0,0,255)"
       stroke-width="0.10"
       id="path972" />
    <path
       d="M 230.650 119.000 H 227.700 C 227.650 119.000 227.700 119.050 227.700 119.000 V 116.100 C 227.700 116.050 227.650 116.100 227.700 116.100 H 233.600 C 233.650 116.100 233.600 116.050 233.600 116.100 V 119.000 C 233.600 119.050 233.650 119.000 233.600 119.000 H 230.650 Z"
       stroke="rgb(0,0,255)"
       stroke-width="0.10"
       id="path974" />
    <path
       d="M 242.650 119.000 H 239.700 C 239.650 119.000 239.700 119.050 239.700 119.000 V 116.100 C 239.700 116.050 239.650 116.100 239.700 116.100 H 245.600 C 245.650 116.100 245.600 116.050 245.600 116.100 V 119.000 C 245.600 119.050 245.650 119.000 245.600 119.000 H 242.650 Z"
       stroke="rgb(0,0,255)"
       stroke-width="0.10"
       id="path976" />
    <path
       d="M 254.650 119.000 H 251.700 C 251.650 119.000 251.700 119.050 251.700 119.000 V 116.100 C 251.700 116.050 251.650 116.100 251.700 116.100 H 257.600 C 257.650 116.100 257.600 116.050 257.600 116.100 V 119.000 C 257.600 119.050 257.650 119.000 257.600 119.000 H 254.650 Z"
       stroke="rgb(0,0,255)"
       stroke-width="0.10"
       id="path978" />
    <path
       d="M 266.650 119.000 H 263.700 C 263.650 119.000 263.700 119.050 263.700 119.000 V 116.100 C 263.700 116.050 263.650 116.100 263.700 116.100 H 269.600 C 269.650 116.100 269.600 116.050 269.600 116.100 V 119.000 C 269.600 119.050 269.650 119.000 269.600 119.000 H 266.650 Z"
       stroke="rgb(0,0,255)"
       stroke-width="0.10"
       id="path980" />
    <path
       d="M 278.650 119.000 H 275.700 C 275.650 119.000 275.700 119.050 275.700 119.000 V 116.100 C 275.700 116.050 275.650 116.100 275.700 116.100 H 281.600 C 281.650 116.100 281.600 116.050 281.600 116.100 V 119.000 C 281.600 119.050 281.650 119.000 281.600 119.000 H 278.650 Z"
       stroke="rgb(0,0,255)"
       stroke-width="0.10"
       id="path982" />
    <path
       d="M 290.650 119.000 H 287.700 C 287.650 119.000 287.700 119.050 287.700 119.000 V 116.100 C 287.700 116.050 287.650 116.100 287.700 116.100 H 293.600 C 293.650 116.100 293.600 116.050 293.600 116.100 V 119.000 C 293.600 119.050 293.650 119.000 293.600 119.000 H 290.650 Z"
       stroke="rgb(0,0,255)"
       stroke-width="0.10"
       id="path984" />
    <path
       d="M 302.650 119.000 H 299.700 C 299.650 119.000 299.700 119.050 299.700 119.000 V 116.100 C 299.700 116.050 299.650 116.100 299.700 116.100 H 305.600 C 305.650 116.100 305.600 116.050 305.600 116.100 V 119.000 C 305.600 119.050 305.650 119.000 305.600 119.000 H 302.650 Z"
       stroke="rgb(0,0,255)"
       stroke-width="0.10"
       id="path986" />
    <path
       d="M 314.650 119.000 H 311.700 C 311.650 119.000 311.700 119.050 311.700 119.000 V 116.100 C 311.700 116.050 311.650 116.100 311.700 116.100 H 317.600 C 317.650 116.100 317.600 116.050 317.600 116.100 V 119.000 C 317.600 119.050 317.650 119.000 317.600 119.000 H 314.650 Z"
       stroke="rgb(0,0,255)"
       stroke-width="0.10"
       id="path988" />
    <path
       d="M 173.650 122.100 H 323.650 H 329.650 C 329.678 122.100 329.700 122.078 329.700 122.050 V 116.050 V 16.050 V 10.050 C 329.700 10.022 329.678 10.000 329.650 10.000 H 323.650 H 173.650 H 167.650 C 167.622 10.000 167.600 10.022 167.600 10.050 V 16.050 V 116.050 V 122.050 C 167.600 122.078 167.622 122.100 167.650 122.100 H 173.650 Z"
       stroke="rgb(0,0,0)"
       stroke-width="0.10"
       id="path990" />
    <path
       d="M 326.600 102.050 V 105.000 C 326.600 105.050 326.650 105.000 326.600 105.000 H 323.700 C 323.650 105.000 323.700 105.050 323.700 105.000 V 99.100 C 323.700 99.050 323.650 99.100 323.700 99.100 H 326.600 C 326.650 99.100 326.600 99.050 326.600 99.100 V 102.050 Z"
       stroke="rgb(0,0,255)"
       stroke-width="0.10"
       id="path992" />
    <path
       d="M 326.600 90.050 V 93.000 C 326.600 93.050 326.650 93.000 326.600 93.000 H 323.700 C 323.650 93.000 323.700 93.050 323.700 93.000 V 87.100 C 323.700 87.050 323.650 87.100 323.700 87.100 H 326.600 C 326.650 87.100 326.600 87.050 326.600 87.100 V 90.050 Z"
       stroke="rgb(0,0,255)"
       stroke-width="0.10"
       id="path994" />
    <path
       d="M 326.600 78.050 V 81.000 C 326.600 81.050 326.650 81.000 326.600 81.000 H 323.700 C 323.650 81.000 323.700 81.050 323.700 81.000 V 75.100 C 323.700 75.050 323.650 75.100 323.700 75.100 H 326.600 C 326.650 75.100 326.600 75.050 326.600 75.100 V 78.050 Z"
       stroke="rgb(0,0,255)"
       stroke-width="0.10"
       id="path996" />
    <path
       d="M 326.600 66.050 V 69.000 C 326.600 69.050 326.650 69.000 326.600 69.000 H 323.700 C 323.650 69.000 323.700 69.050 323.700 69.000 V 63.100 C 323.700 63.050 323.650 63.100 323.700 63.100 H 326.600 C 326.650 63.100 326.600 63.050 326.600 63.100 V 66.050 Z"
       stroke="rgb(0,0,255)"
       stroke-width="0.10"
       id="path998" />
    <path
       d="M 326.600 54.050 V 57.000 C 326.600 57.050 326.650 57.000 326.600 57.000 H 323.700 C 323.650 57.000 323.700 57.050 323.700 57.000 V 51.100 C 323.700 51.050 323.650 51.100 323.700 51.100 H 326.600 C 326.650 51.100 326.600 51.050 326.600 51.100 V 54.050 Z"
       stroke="rgb(0,0,255)"
       stroke-width="0.10"
       id="path1000" />
    <path
       d="M 326.600 42.050 V 45.000 C 326.600 45.050 326.650 45.000 326.600 45.000 H 323.700 C 323.650 45.000 323.700 45.050 323.700 45.000 V 39.100 C 323.700 39.050 323.650 39.100 323.700 39.100 H 326.600 C 326.650 39.100 326.600 39.050 326.600 39.100 V 42.050 Z"
       stroke="rgb(0,0,255)"
       stroke-width="0.10"
       id="path1002" />
    <path
       d="M 326.600 30.050 V 33.000 C 326.600 33.050 326.650 33.000 326.600 33.000 H 323.700 C 323.650 33.000 323.700 33.050 323.700 33.000 V 27.100 C 323.700 27.050 323.650 27.100 323.700 27.100 H 326.600 C 326.650 27.100 326.600 27.050 326.600 27.100 V 30.050 Z"
       stroke="rgb(0,0,255)"
       stroke-width="0.10"
       id="path1004" />
    <path
       d="M 314.650 13.100 H 317.600 C 317.650 13.100 317.600 13.050 317.600 13.100 V 16.000 C 317.600 16.050 317.650 16.000 317.600 16.000 H 311.700 C 311.650 16.000 311.700 16.050 311.700 16.000 V 13.100 C 311.700 13.050 311.650 13.100 311.700 13.100 H 314.650 Z"
       stroke="rgb(0,0,255)"
       stroke-width="0.10"
       id="path1006" />
    <path
       d="M 302.650 13.100 H 305.600 C 305.650 13.100 305.600 13.050 305.600 13.100 V 16.000 C 305.600 16.050 305.650 16.000 305.600 16.000 H 299.700 C 299.650 16.000 299.700 16.050 299.700 16.000 V 13.100 C 299.700 13.050 299.650 13.100 299.700 13.100 H 302.650 Z"
       stroke="rgb(0,0,255)"
       stroke-width="0.10"
       id="path1008" />
    <path
       d="M 290.650 13.100 H 293.600 C 293.650 13.100 293.600 13.050 293.600 13.100 V 16.000 C 293.600 16.050 293.650 16.000 293.600 16.000 H 287.700 C 287.650 16.000 287.700 16.050 287.700 16.000 V 13.100 C 287.700 13.050 287.650 13.100 287.700 13.100 H 290.650 Z"
       stroke="rgb(0,0,255)"
       stroke-width="0.10"
       id="path1010" />
    <path
       d="M 278.650 13.100 H 281.600 C 281.650 13.100 281.600 13.050 281.600 13.100 V 16.000 C 281.600 16.050 281.650 16.000 281.600 16.000 H 275.700 C 275.650 16.000 275.700 16.050 275.700 16.000 V 13.100 C 275.700 13.050 275.650 13.100 275.700 13.100 H 278.650 Z"
       stroke="rgb(0,0,255)"
       stroke-width="0.10"
       id="path1012" />
    <path
       d="M 266.650 13.100 H 269.600 C 269.650 13.100 269.600 13.050 269.600 13.100 V 16.000 C 269.600 16.050 269.650 16.000 269.600 16.000 H 263.700 C 263.650 16.000 263.700 16.050 263.700 16.000 V 13.100 C 263.700 13.050 263.650 13.100 263.700 13.100 H 266.650 Z"
       stroke="rgb(0,0,255)"
       stroke-width="0.10"
       id="path1014" />
    <path
       d="M 254.650 13.100 H 257.600 C 257.650 13.100 257.600 13.050 257.600 13.100 V 16.000 C 257.600 16.050 257.650 16.000 257.600 16.000 H 251.700 C 251.650 16.000 251.700 16.050 251.700 16.000 V 13.100 C 251.700 13.050 251.650 13.100 251.700 13.100 H 254.650 Z"
       stroke="rgb(0,0,255)"
       stroke-width="0.10"
       id="path1016" />
    <path
       d="M 242.650 13.100 H 245.600 C 245.650 13.100 245.600 13.050 245.600 13.100 V 16.000 C 245.600 16.050 245.650 16.000 245.600 16.000 H 239.700 C 239.650 16.000 239.700 16.050 239.700 16.000 V 13.100 C 239.700 13.050 239.650 13.100 239.700 13.100 H 242.650 Z"
       stroke="rgb(0,0,255)"
       stroke-width="0.10"
       id="path1018" />
    <path
       d="M 230.650 13.100 H 233.600 C 233.650 13.100 233.600 13.050 233.600 13.100 V 16.000 C 233.600 16.050 233.650 16.000 233.600 16.000 H 227.700 C 227.650 16.000 227.700 16.050 227.700 16.000 V 13.100 C 227.700 13.050 227.650 13.100 227.700 13.100 H 230.650 Z"
       stroke="rgb(0,0,255)"
       stroke-width="0.10"
       id="path1020" />
    <path
       d="M 218.650 13.100 H 221.600 C 221.650 13.100 221.600 13.050 221.600 13.100 V 16.000 C 221.600 16.050 221.650 16.000 221.600 16.000 H 215.700 C 215.650 16.000 215.700 16.050 215.700 16.000 V 13.100 C 215.700 13.050 215.650 13.100 215.700 13.100 H 218.650 Z"
       stroke="rgb(0,0,255)"
       stroke-width="0.10"
       id="path1022" />
    <path
       d="M 206.650 13.100 H 209.600 C 209.650 13.100 209.600 13.050 209.600 13.100 V 16.000 C 209.600 16.050 209.650 16.000 209.600 16.000 H 203.700 C 203.650 16.000 203.700 16.050 203.700 16.000 V 13.100 C 203.700 13.050 203.650 13.100 203.700 13.100 H 206.650 Z"
       stroke="rgb(0,0,255)"
       stroke-width="0.10"
       id="path1024" />
    <path
       d="M 194.650 13.100 H 197.600 C 197.650 13.100 197.600 13.050 197.600 13.100 V 16.000 C 197.600 16.050 197.650 16.000 197.600 16.000 H 191.700 C 191.650 16.000 191.700 16.050 191.700 16.000 V 13.100 C 191.700 13.050 191.650 13.100 191.700 13.100 H 194.650 Z"
       stroke="rgb(0,0,255)"
       stroke-width="0.10"
       id="path1026" />
    <path
       d="M 182.650 13.100 H 185.600 C 185.650 13.100 185.600 13.050 185.600 13.100 V 16.000 C 185.600 16.050 185.650 16.000 185.600 16.000 H 179.700 C 179.650 16.000 179.700 16.050 179.700 16.000 V 13.100 C 179.700 13.050 179.650 13.100 179.700 13.100 H 182.650 Z"
       stroke="rgb(0,0,255)"
       stroke-width="0.10"
       id="path1028" />
    <path
       d="M 170.700 30.050 V 27.100 C 170.700 27.050 170.650 27.100 170.700 27.100 H 173.600 C 173.650 27.100 173.600 27.050 173.600 27.100 V 33.000 C 173.600 33.050 173.650 33.000 173.600 33.000 H 170.700 C 170.650 33.000 170.700 33.050 170.700 33.000 V 30.050 Z"
       stroke="rgb(0,0,255)"
       stroke-width="0.10"
       id="path1030" />
    <path
       d="M 170.700 42.050 V 39.100 C 170.700 39.050 170.650 39.100 170.700 39.100 H 173.600 C 173.650 39.100 173.600 39.050 173.600 39.100 V 45.000 C 173.600 45.050 173.650 45.000 173.600 45.000 H 170.700 C 170.650 45.000 170.700 45.050 170.700 45.000 V 42.050 Z"
       stroke="rgb(0,0,255)"
       stroke-width="0.10"
       id="path1032" />
    <path
       d="M 170.700 54.050 V 51.100 C 170.700 51.050 170.650 51.100 170.700 51.100 H 173.600 C 173.650 51.100 173.600 51.050 173.600 51.100 V 57.000 C 173.600 57.050 173.650 57.000 173.600 57.000 H 170.700 C 170.650 57.000 170.700 57.050 170.700 57.000 V 54.050 Z"
       stroke="rgb(0,0,255)"
       stroke-width="0.10"
       id="path1034" />
    <path
       d="M 170.700 66.050 V 63.100 C 170.700 63.050 170.650 63.100 170.700 63.100 H 173.600 C 173.650 63.100 173.600 63.050 173.600 63.100 V 69.000 C 173.600 69.050 173.650 69.000 173.600 69.000 H 170.700 C 170.650 69.000 170.700 69.050 170.700 69.000 V 66.050 Z"
       stroke="rgb(0,0,255)"
       stroke-width="0.10"
       id="path1036" />
    <path
       d="M 170.700 78.050 V 75.100 C 170.700 75.050 170.650 75.100 170.700 75.100 H 173.600 C 173.650 75.100 173.600 75.050 173.600 75.100 V 81.000 C 173.600 81.050 173.650 81.000 173.600 81.000 H 170.700 C 170.650 81.000 170.700 81.050 170.700 81.000 V 78.050 Z"
       stroke="rgb(0,0,255)"
       stroke-width="0.10"
       id="path1038" />
    <path
       d="M 170.700 90.050 V 87.100 C 170.700 87.050 170.650 87.100 170.700 87.100 H 173.600 C 173.650 87.100 173.600 87.050 173.600 87.100 V 93.000 C 173.600 93.050 173.650 93.000 173.600 93.000 H 170.700 C 170.650 93.000 170.700 93.050 170.700 93.000 V 90.050 Z"
       stroke="rgb(0,0,255)"
       stroke-width="0.10"
       id="path1040" />
    <path
       d="M 170.700 102.050 V 99.100 C 170.700 99.050 170.650 99.100 170.700 99.100 H 173.600 C 173.650 99.100 173.600 99.050 173.600 99.100 V 105.000 C 173.600 105.050 173.650 105.000 173.600 105.000 H 170.700 C 170.650 105.000 170.700 105.050 170.700 105.000 V 102.050 Z"
       stroke="rgb(0,0,255)"
       stroke-width="0.10"
       id="path1042" />
  </g>
  <circle
     style="fill:none;stroke:#000000;stroke-width:0.132;stroke-opacity:1"
     id="path1226"
     cx="86.089638"
     cy="68.307907"
     r="20" />
  <rect
     style="fill:none;stroke:#000000;stroke-width:0.263104"
     id="rect458"
     width="69.736893"
     height="24.736895"
     x="-254.48907"
     y="-264.95447"
     transform="scale(-1)" />
</svg>
