<?xml version="1.0" encoding="UTF-8" standalone="no"?>
<!-- Created with Inkscape (http://www.inkscape.org/) -->

<svg
   width="210mm"
   height="297mm"
   version="1.1"
   viewBox="0 0 210 297"
   id="svg3458"
   sodipodi:docname="TestA4.svg"
   inkscape:version="1.2.2 (1:1.2.2+202212051552+b0a8486541)"
   xmlns:inkscape="http://www.inkscape.org/namespaces/inkscape"
   xmlns:sodipodi="http://sodipodi.sourceforge.net/DTD/sodipodi-0.dtd"
   xmlns="http://www.w3.org/2000/svg"
   xmlns:svg="http://www.w3.org/2000/svg">
  <defs
     id="defs3462" />
  <sodipodi:namedview
     id="namedview3460"
     pagecolor="#ffffff"
     bordercolor="#000000"
     borderopacity="0.25"
     inkscape:showpageshadow="2"
     inkscape:pageopacity="0.0"
     inkscape:pagecheckerboard="0"
     inkscape:deskcolor="#d1d1d1"
     inkscape:document-units="mm"
     showgrid="false"
     inkscape:zoom="0.32236594"
     inkscape:cx="510.28965"
     inkscape:cy="142.69498"
     inkscape:window-width="1366"
     inkscape:window-height="699"
     inkscape:window-x="0"
     inkscape:window-y="32"
     inkscape:window-maximized="1"
     inkscape:current-layer="svg3458" />
  <g
     transform="matrix(1.0155318,0,0,1.0155318,25.490997,19.918462)"
     fill="none"
     stroke-width="1.2203"
     id="g3336">
    <rect
       x="26.198"
       y="22.114"
       width="23.780001"
       height="23.780001"
       stroke="#000010"
       style="paint-order:markers fill"
       id="rect3236" />
    <path
       d="m 26.198,22.114 23.78,23.78"
       fill="none"
       stroke="#000010"
       stroke-linecap="round"
       stroke-linejoin="round"
       stroke-width="1.8448"
       style="paint-order:markers fill stroke"
       id="path3238" />
    <rect
       x="55.167"
       y="22.114"
       width="23.780001"
       height="23.780001"
       stroke="#000020"
       style="paint-order:markers fill"
       id="rect3240" />
    <path
       d="m 55.167,22.114 23.78,23.78"
       fill="none"
       stroke="#000020"
       stroke-linecap="round"
       stroke-linejoin="round"
       stroke-width="1.8448"
       style="paint-order:markers fill stroke"
       id="path3242" />
    <rect
       x="84.136002"
       y="22.114"
       width="23.780001"
       height="23.780001"
       stroke="#000030"
       style="paint-order:markers fill"
       id="rect3244" />
    <path
       d="m 84.136,22.114 23.78,23.78"
       fill="none"
       stroke="#000030"
       stroke-linecap="round"
       stroke-linejoin="round"
       stroke-width="1.8448"
       style="paint-order:markers fill stroke"
       id="path3246" />
    <rect
       x="113.1"
       y="22.114"
       width="23.780001"
       height="23.780001"
       stroke="#000040"
       style="paint-order:markers fill"
       id="rect3248" />
    <path
       d="m 113.1,22.114 23.78,23.78"
       fill="none"
       stroke="#000040"
       stroke-linecap="round"
       stroke-linejoin="round"
       stroke-width="1.8448"
       style="paint-order:markers fill stroke"
       id="path3250" />
    <rect
       x="142.07001"
       y="22.114"
       width="23.780001"
       height="23.780001"
       stroke="#000050"
       style="paint-order:markers fill"
       id="rect3252" />
    <path
       d="m 142.07,22.114 23.78,23.78"
       fill="none"
       stroke="#000050"
       stroke-linecap="round"
       stroke-linejoin="round"
       stroke-width="1.8448"
       style="paint-order:markers fill stroke"
       id="path3254" />
    <rect
       x="26.198"
       y="51.083"
       width="23.780001"
       height="23.780001"
       stroke="#100010"
       style="paint-order:markers fill"
       id="rect3256" />
    <path
       d="m 26.198,51.083 23.78,23.78"
       fill="none"
       stroke="#100010"
       stroke-linecap="round"
       stroke-linejoin="round"
       stroke-width="1.8448"
       style="paint-order:markers fill stroke"
       id="path3258" />
    <rect
       x="55.167"
       y="51.083"
       width="23.780001"
       height="23.780001"
       stroke="#100020"
       style="paint-order:markers fill"
       id="rect3260" />
    <path
       d="m 55.167,51.083 23.78,23.78"
       fill="none"
       stroke="#100020"
       stroke-linecap="round"
       stroke-linejoin="round"
       stroke-width="1.8448"
       style="paint-order:markers fill stroke"
       id="path3262" />
    <rect
       x="84.136002"
       y="51.083"
       width="23.780001"
       height="23.780001"
       stroke="#100030"
       style="paint-order:markers fill"
       id="rect3264" />
    <path
       d="m 84.136,51.083 23.78,23.78"
       fill="none"
       stroke="#100030"
       stroke-linecap="round"
       stroke-linejoin="round"
       stroke-width="1.8448"
       style="paint-order:markers fill stroke"
       id="path3266" />
    <rect
       x="113.1"
       y="51.083"
       width="23.780001"
       height="23.780001"
       stroke="#100040"
       style="paint-order:markers fill"
       id="rect3268" />
    <path
       d="m 113.1,51.083 23.78,23.78"
       fill="none"
       stroke="#100040"
       stroke-linecap="round"
       stroke-linejoin="round"
       stroke-width="1.8448"
       style="paint-order:markers fill stroke"
       id="path3270" />
    <rect
       x="142.07001"
       y="51.083"
       width="23.780001"
       height="23.780001"
       stroke="#100050"
       style="paint-order:markers fill"
       id="rect3272" />
    <path
       d="m 142.07,51.083 23.78,23.78"
       fill="none"
       stroke="#100050"
       stroke-linecap="round"
       stroke-linejoin="round"
       stroke-width="1.8448"
       style="paint-order:markers fill stroke"
       id="path3274" />
    <rect
       x="26.198"
       y="80.052002"
       width="23.780001"
       height="23.780001"
       stroke="#30001f"
       style="paint-order:markers fill"
       id="rect3276" />
    <path
       d="m 26.198,80.052 23.78,23.78"
       fill="none"
       stroke="#30001f"
       stroke-linecap="round"
       stroke-linejoin="round"
       stroke-width="1.8448"
       style="paint-order:markers fill stroke"
       id="path3278" />
    <rect
       x="55.167"
       y="80.052002"
       width="23.780001"
       height="23.780001"
       stroke="#30002f"
       style="paint-order:markers fill"
       id="rect3280" />
    <path
       d="m 55.167,80.052 23.78,23.78"
       fill="none"
       stroke="#30002f"
       stroke-linecap="round"
       stroke-linejoin="round"
       stroke-width="1.8448"
       style="paint-order:markers fill stroke"
       id="path3282" />
    <rect
       x="84.136002"
       y="80.052002"
       width="23.780001"
       height="23.780001"
       stroke="#30003f"
       style="paint-order:markers fill"
       id="rect3284" />
    <path
       d="m 84.136,80.052 23.78,23.78"
       fill="none"
       stroke="#30003f"
       stroke-linecap="round"
       stroke-linejoin="round"
       stroke-width="1.8448"
       style="paint-order:markers fill stroke"
       id="path3286" />
    <rect
       x="113.1"
       y="80.052002"
       width="23.780001"
       height="23.780001"
       stroke="#30004f"
       style="paint-order:markers fill"
       id="rect3288" />
    <path
       d="m 113.1,80.052 23.78,23.78"
       fill="none"
       stroke="#30004f"
       stroke-linecap="round"
       stroke-linejoin="round"
       stroke-width="1.8448"
       style="paint-order:markers fill stroke"
       id="path3290" />
    <rect
       x="142.07001"
       y="80.052002"
       width="23.780001"
       height="23.780001"
       stroke="#30005f"
       style="paint-order:markers fill"
       id="rect3292" />
    <path
       d="m 142.07,80.052 23.78,23.78"
       fill="none"
       stroke="#30005f"
       stroke-linecap="round"
       stroke-linejoin="round"
       stroke-width="1.8448"
       style="paint-order:markers fill stroke"
       id="path3294" />
    <rect
       x="26.198"
       y="109.02"
       width="23.780001"
       height="23.780001"
       stroke="#40001f"
       style="paint-order:markers fill"
       id="rect3296" />
    <path
       d="m 26.198,109.02 23.78,23.78"
       fill="none"
       stroke="#40001f"
       stroke-linecap="round"
       stroke-linejoin="round"
       stroke-width="1.8448"
       style="paint-order:markers fill stroke"
       id="path3298" />
    <rect
       x="55.167"
       y="109.02"
       width="23.780001"
       height="23.780001"
       stroke="#40002f"
       style="paint-order:markers fill"
       id="rect3300" />
    <path
       d="m 55.167,109.02 23.78,23.78"
       fill="none"
       stroke="#40002f"
       stroke-linecap="round"
       stroke-linejoin="round"
       stroke-width="1.8448"
       style="paint-order:markers fill stroke"
       id="path3302" />
    <rect
       x="84.136002"
       y="109.02"
       width="23.780001"
       height="23.780001"
       stroke="#40003f"
       style="paint-order:markers fill"
       id="rect3304" />
    <path
       d="m 84.136,109.02 23.78,23.78"
       fill="none"
       stroke="#40003f"
       stroke-linecap="round"
       stroke-linejoin="round"
       stroke-width="1.8448"
       style="paint-order:markers fill stroke"
       id="path3306" />
    <rect
       x="113.1"
       y="109.02"
       width="23.780001"
       height="23.780001"
       stroke="#40004f"
       style="paint-order:markers fill"
       id="rect3308" />
    <path
       d="m 113.1,109.02 23.78,23.78"
       fill="none"
       stroke="#40004f"
       stroke-linecap="round"
       stroke-linejoin="round"
       stroke-width="1.8448"
       style="paint-order:markers fill stroke"
       id="path3310" />
    <rect
       x="142.07001"
       y="109.02"
       width="23.780001"
       height="23.780001"
       stroke="#40005f"
       style="paint-order:markers fill"
       id="rect3312" />
    <path
       d="m 142.07,109.02 23.78,23.78"
       fill="none"
       stroke="#40005f"
       stroke-linecap="round"
       stroke-linejoin="round"
       stroke-width="1.8448"
       style="paint-order:markers fill stroke"
       id="path3314" />
    <rect
       x="26.198"
       y="137.99001"
       width="23.780001"
       height="23.780001"
       stroke="#500010"
       style="paint-order:markers fill"
       id="rect3316" />
    <path
       d="m 26.198,137.99 23.78,23.78"
       fill="none"
       stroke="#500010"
       stroke-linecap="round"
       stroke-linejoin="round"
       stroke-width="1.8448"
       style="paint-order:markers fill stroke"
       id="path3318" />
    <rect
       x="55.167"
       y="137.99001"
       width="23.780001"
       height="23.780001"
       stroke="#500020"
       style="paint-order:markers fill"
       id="rect3320" />
    <path
       d="m 55.167,137.99 23.78,23.78"
       fill="none"
       stroke="#500020"
       stroke-linecap="round"
       stroke-linejoin="round"
       stroke-width="1.8448"
       style="paint-order:markers fill stroke"
       id="path3322" />
    <rect
       x="84.136002"
       y="137.99001"
       width="23.780001"
       height="23.780001"
       stroke="#500030"
       style="paint-order:markers fill"
       id="rect3324" />
    <path
       d="m 84.136,137.99 23.78,23.78"
       fill="none"
       stroke="#500030"
       stroke-linecap="round"
       stroke-linejoin="round"
       stroke-width="1.8448"
       style="paint-order:markers fill stroke"
       id="path3326" />
    <rect
       x="113.1"
       y="137.99001"
       width="23.780001"
       height="23.780001"
       stroke="#500040"
       style="paint-order:markers fill"
       id="rect3328" />
    <path
       d="m 113.1,137.99 23.78,23.78"
       fill="none"
       stroke="#500040"
       stroke-linecap="round"
       stroke-linejoin="round"
       stroke-width="1.8448"
       style="paint-order:markers fill stroke"
       id="path3330" />
    <rect
       x="142.07001"
       y="137.99001"
       width="23.780001"
       height="23.780001"
       stroke="#500050"
       style="paint-order:markers fill"
       id="rect3332" />
    <path
       d="m 142.07,137.99 23.78,23.78"
       fill="none"
       stroke="#500050"
       stroke-linecap="round"
       stroke-linejoin="round"
       stroke-width="1.8448"
       style="paint-order:markers fill stroke"
       id="path3334" />
  </g>
  <g
     transform="matrix(0.2686927,0,0,0.2686927,13.364042,22.200345)"
     stroke-width="6.8032"
     style="white-space:pre;shape-inside:url(#rect341);paint-order:markers fill stroke"
     aria-label="100%"
     id="g3346">
    <path
       d="m 582.98,48.117 h 4.5117 V 32.545 l -4.9082,0.98438 v -2.5156 l 4.8809,-0.98438 h 2.7617 v 18.088 h 4.5117 v 2.3242 h -11.758 z"
       id="path3338" />
    <path
       d="m 606.22,31.848 q -2.1328,0 -3.2129,2.1055 -1.0664,2.0918 -1.0664,6.3027 0,4.1973 1.0664,6.3027 1.0801,2.0918 3.2129,2.0918 2.1465,0 3.2129,-2.0918 1.0801,-2.1055 1.0801,-6.3027 0,-4.2109 -1.0801,-6.3027 -1.0664,-2.1055 -3.2129,-2.1055 z m 0,-2.1875 q 3.4316,0 5.2363,2.7207 1.8184,2.707 1.8184,7.875 0,5.1543 -1.8184,7.875 -1.8047,2.707 -5.2363,2.707 -3.4316,0 -5.25,-2.707 -1.8047,-2.7207 -1.8047,-7.875 0,-5.168 1.8047,-7.875 1.8184,-2.7207 5.25,-2.7207 z"
       id="path3340" />
    <path
       d="m 624.04,31.848 q -2.1328,0 -3.2129,2.1055 -1.0664,2.0918 -1.0664,6.3027 0,4.1973 1.0664,6.3027 1.0801,2.0918 3.2129,2.0918 2.1465,0 3.2129,-2.0918 1.0801,-2.1055 1.0801,-6.3027 0,-4.2109 -1.0801,-6.3027 -1.0664,-2.1055 -3.2129,-2.1055 z m 0,-2.1875 q 3.4316,0 5.2363,2.7207 1.8184,2.707 1.8184,7.875 0,5.1543 -1.8184,7.875 -1.8047,2.707 -5.2363,2.707 -3.4316,0 -5.25,-2.707 -1.8047,-2.7207 -1.8047,-7.875 0,-5.168 1.8047,-7.875 1.8184,-2.7207 5.25,-2.7207 z"
       id="path3342" />
    <path
       d="m 653.31,41.459 q -1.1894,0 -1.873,1.0117 -0.66992,1.0117 -0.66992,2.8164 0,1.7773 0.66992,2.8027 0.6836,1.0117 1.873,1.0117 1.1621,0 1.832,-1.0117 0.6836,-1.0254 0.6836,-2.8027 0,-1.791 -0.6836,-2.8027 -0.66992,-1.0254 -1.832,-1.0254 z m 0,-1.7363 q 2.1602,0 3.4316,1.5039 1.2715,1.5039 1.2715,4.0605 0,2.5566 -1.2852,4.0605 -1.2715,1.4902 -3.418,1.4902 -2.1875,0 -3.459,-1.4902 -1.2715,-1.5039 -1.2715,-4.0605 0,-2.5703 1.2715,-4.0605 1.2852,-1.5039 3.459,-1.5039 z m -14.109,-8.3262 q -1.1758,0 -1.8594,1.0254 -0.66992,1.0117 -0.66992,2.7891 0,1.8047 0.66992,2.8164 0.66992,1.0117 1.8594,1.0117 1.1894,0 1.8594,-1.0117 0.68359,-1.0117 0.68359,-2.8164 0,-1.7637 -0.68359,-2.7891 -0.68359,-1.0254 -1.8594,-1.0254 z m 12.346,-1.7363 h 2.1875 l -12.77,21.178 h -2.1875 z m -12.346,0 q 2.1602,0 3.4453,1.5039 1.2852,1.4902 1.2852,4.0469 0,2.584 -1.2852,4.0742 -1.2715,1.4902 -3.4453,1.4902 -2.1738,0 -3.4453,-1.4902 -1.2578,-1.5039 -1.2578,-4.0742 0,-2.543 1.2715,-4.0469 1.2715,-1.5039 3.4316,-1.5039 z"
       id="path3344" />
  </g>
  <g
     transform="matrix(0.2686927,0,0,0.2686927,-14.85937,22.200345)"
     stroke-width="6.8032"
     style="white-space:pre;shape-inside:url(#rect341-3);paint-order:markers fill stroke"
     aria-label="75%"
     id="g3354">
    <path
       d="m 590.71,30.029 h 13.125 v 1.1758 l -7.4102,19.236 H 593.54 l 6.9727,-18.088 H 590.71 Z"
       id="path3348" />
    <path
       d="m 609.25,30.029 h 10.842 v 2.3242 h -8.3125 v 5.0039 q 0.60156,-0.20508 1.2031,-0.30078 0.60156,-0.10938 1.2031,-0.10938 3.418,0 5.4141,1.873 1.9961,1.873 1.9961,5.0723 0,3.2949 -2.0508,5.127 -2.0508,1.8184 -5.7832,1.8184 -1.2852,0 -2.625,-0.21875 -1.3262,-0.21875 -2.748,-0.65625 v -2.7754 q 1.2305,0.66992 2.543,0.99805 1.3125,0.32813 2.7754,0.32812 2.3652,0 3.7461,-1.2441 1.3809,-1.2441 1.3809,-3.377 0,-2.1328 -1.3809,-3.377 -1.3809,-1.2442 -3.7461,-1.2441 -1.1074,0 -2.2148,0.24609 -1.0938,0.24609 -2.2422,0.76562 z"
       id="path3350" />
    <path
       d="m 644.4,41.459 q -1.1894,0 -1.873,1.0117 -0.66992,1.0117 -0.66992,2.8164 0,1.7773 0.66992,2.8027 0.68359,1.0117 1.873,1.0117 1.1621,0 1.832,-1.0117 0.68359,-1.0254 0.68359,-2.8027 0,-1.791 -0.68359,-2.8027 -0.66993,-1.0254 -1.832,-1.0254 z m 0,-1.7363 q 2.1602,0 3.4316,1.5039 1.2715,1.5039 1.2715,4.0605 0,2.5566 -1.2852,4.0605 -1.2715,1.4902 -3.418,1.4902 -2.1875,0 -3.459,-1.4902 -1.2715,-1.5039 -1.2715,-4.0605 0,-2.5703 1.2715,-4.0605 1.2852,-1.5039 3.459,-1.5039 z m -14.109,-8.3262 q -1.1758,0 -1.8594,1.0254 -0.66992,1.0117 -0.66992,2.7891 0,1.8047 0.66992,2.8164 0.66993,1.0117 1.8594,1.0117 1.18947,0 1.8594,-1.0117 0.6836,-1.0117 0.6836,-2.8164 0,-1.7637 -0.6836,-2.7891 -0.68359,-1.0254 -1.8594,-1.0254 z m 12.346,-1.7363 h 2.1875 l -12.77,21.178 h -2.1875 z m -12.346,0 q 2.1602,0 3.4453,1.5039 1.2852,1.4902 1.2852,4.0469 0,2.584 -1.2852,4.0742 -1.2715,1.4902 -3.4453,1.4902 -2.1738,0 -3.4453,-1.4902 -1.2578,-1.5039 -1.2578,-4.0742 0,-2.543 1.2715,-4.0469 1.2715,-1.5039 3.4316,-1.5039 z"
       id="path3352" />
  </g>
  <g
     transform="matrix(0.2686927,0,0,0.2686927,-43.167838,22.200345)"
     stroke-width="6.8032"
     style="white-space:pre;shape-inside:url(#rect341-7);paint-order:markers fill stroke"
     aria-label="50%"
     id="g3362">
    <path
       d="m 591.43,30.029 h 10.842 v 2.3242 h -8.3125 v 5.0039 q 0.60156,-0.20508 1.2031,-0.30078 0.60156,-0.10938 1.2031,-0.10938 3.418,0 5.4141,1.873 1.9961,1.873 1.9961,5.0723 0,3.2949 -2.0508,5.127 -2.0508,1.8184 -5.7832,1.8184 -1.2852,0 -2.625,-0.21875 -1.3262,-0.21875 -2.748,-0.65625 v -2.7754 q 1.2305,0.66992 2.543,0.99805 1.3125,0.32813 2.7754,0.32812 2.3652,0 3.7461,-1.2441 1.3808,-1.2441 1.3808,-3.377 0,-2.1328 -1.3808,-3.377 -1.3809,-1.2441 -3.7461,-1.2441 -1.1074,0 -2.2148,0.24609 -1.0938,0.24609 -2.2422,0.76562 z"
       id="path3356" />
    <path
       d="m 615.13,31.848 q -2.1328,0 -3.2129,2.1055 -1.0664,2.0918 -1.0664,6.3027 0,4.1973 1.0664,6.3027 1.0801,2.0918 3.2129,2.0918 2.1465,0 3.2129,-2.0918 1.0801,-2.1055 1.0801,-6.3027 0,-4.2109 -1.0801,-6.3027 -1.0664,-2.1055 -3.2129,-2.1055 z m 0,-2.1875 q 3.4316,0 5.2363,2.7207 1.8184,2.707 1.8184,7.875 0,5.1543 -1.8184,7.875 -1.8047,2.707 -5.2363,2.707 -3.4316,0 -5.25,-2.707 -1.8047,-2.7207 -1.8047,-7.875 0,-5.168 1.8047,-7.875 1.8184,-2.7207 5.25,-2.7207 z"
       id="path3358" />
    <path
       d="m 644.4,41.459 q -1.1894,0 -1.873,1.0117 -0.66992,1.0117 -0.66992,2.8164 0,1.7773 0.66992,2.8027 0.68359,1.0117 1.873,1.0117 1.1621,0 1.832,-1.0117 0.68359,-1.0254 0.68359,-2.8027 0,-1.791 -0.68359,-2.8027 -0.66993,-1.0254 -1.832,-1.0254 z m 0,-1.7363 q 2.1602,0 3.4316,1.5039 1.2715,1.5039 1.2715,4.0605 0,2.5566 -1.2852,4.0605 -1.2715,1.4902 -3.418,1.4902 -2.1875,0 -3.459,-1.4902 -1.2715,-1.5039 -1.2715,-4.0605 0,-2.5703 1.2715,-4.0605 1.2852,-1.5039 3.459,-1.5039 z m -14.109,-8.3262 q -1.1758,0 -1.8594,1.0254 -0.66992,1.0117 -0.66992,2.7891 0,1.8047 0.66992,2.8164 0.66993,1.0117 1.8594,1.0117 1.18947,0 1.8594,-1.0117 0.6836,-1.0117 0.6836,-2.8164 0,-1.7637 -0.6836,-2.7891 -0.68359,-1.0254 -1.8594,-1.0254 z m 12.346,-1.7363 h 2.1875 l -12.77,21.178 h -2.1875 z m -12.346,0 q 2.1602,0 3.4453,1.5039 1.2852,1.4902 1.2852,4.0469 0,2.584 -1.2852,4.0742 -1.2715,1.4902 -3.4453,1.4902 -2.1738,0 -3.4453,-1.4902 -1.2578,-1.5039 -1.2578,-4.0742 0,-2.543 1.2715,-4.0469 1.2715,-1.5039 3.4316,-1.5039 z"
       id="path3360" />
  </g>
  <g
     transform="matrix(0.2686927,0,0,0.2686927,-71.481552,22.200345)"
     stroke-width="6.8032"
     style="white-space:pre;shape-inside:url(#rect341-7-3);paint-order:markers fill stroke"
     aria-label="25%"
     id="g3370">
    <path
       d="m 593.79,48.117 h 9.6387 v 2.3242 h -12.961 V 48.117 q 1.5723,-1.627 4.2793,-4.3613 2.7207,-2.748 3.418,-3.541 1.3262,-1.4902 1.8457,-2.5156 0.5332,-1.0391 0.5332,-2.0371 0,-1.627 -1.1484,-2.6523 -1.1348,-1.0254 -2.9668,-1.0254 -1.2988,0 -2.748,0.45117 -1.4356,0.45117 -3.0762,1.3672 v -2.7891 q 1.668,-0.66992 3.1172,-1.0117 1.4492,-0.34178 2.6524,-0.3418 3.1719,0 5.0586,1.5859 1.8867,1.5859 1.8867,4.2383 0,1.2578 -0.47852,2.3926 -0.46484,1.1211 -1.709,2.6523 -0.3418,0.39648 -2.1738,2.2969 -1.832,1.8867 -5.168,5.291 z"
       id="path3364" />
    <path
       d="m 609.25,30.029 h 10.842 v 2.3242 h -8.3125 v 5.0039 q 0.60156,-0.20508 1.2031,-0.30078 0.60156,-0.10938 1.2031,-0.10938 3.418,0 5.4141,1.873 1.9961,1.873 1.9961,5.0723 0,3.2949 -2.0508,5.127 -2.0508,1.8184 -5.7832,1.8184 -1.2852,0 -2.625,-0.21875 -1.3262,-0.21875 -2.748,-0.65625 v -2.7754 q 1.2305,0.66992 2.543,0.99805 1.3125,0.32813 2.7754,0.32812 2.3652,0 3.7461,-1.2441 1.3809,-1.2441 1.3809,-3.377 0,-2.1328 -1.3809,-3.377 -1.3809,-1.2442 -3.7461,-1.2441 -1.1074,0 -2.2148,0.24609 -1.0938,0.24609 -2.2422,0.76562 z"
       id="path3366" />
    <path
       d="m 644.4,41.459 q -1.1894,0 -1.873,1.0117 -0.66992,1.0117 -0.66992,2.8164 0,1.7773 0.66992,2.8027 0.68359,1.0117 1.873,1.0117 1.1621,0 1.832,-1.0117 0.68359,-1.0254 0.68359,-2.8027 0,-1.791 -0.68359,-2.8027 -0.66993,-1.0254 -1.832,-1.0254 z m 0,-1.7363 q 2.1602,0 3.4316,1.5039 1.2715,1.5039 1.2715,4.0605 0,2.5566 -1.2852,4.0605 -1.2715,1.4902 -3.418,1.4902 -2.1875,0 -3.459,-1.4902 -1.2715,-1.5039 -1.2715,-4.0605 0,-2.5703 1.2715,-4.0605 1.2852,-1.5039 3.459,-1.5039 z m -14.109,-8.3262 q -1.1758,0 -1.8594,1.0254 -0.66992,1.0117 -0.66992,2.7891 0,1.8047 0.66992,2.8164 0.66993,1.0117 1.8594,1.0117 1.18947,0 1.8594,-1.0117 0.6836,-1.0117 0.6836,-2.8164 0,-1.7637 -0.6836,-2.7891 -0.68359,-1.0254 -1.8594,-1.0254 z m 12.346,-1.7363 h 2.1875 l -12.77,21.178 h -2.1875 z m -12.346,0 q 2.1602,0 3.4453,1.5039 1.2852,1.4902 1.2852,4.0469 0,2.584 -1.2852,4.0742 -1.2715,1.4902 -3.4453,1.4902 -2.1738,0 -3.4453,-1.4902 -1.2578,-1.5039 -1.2578,-4.0742 0,-2.543 1.2715,-4.0469 1.2715,-1.5039 3.4316,-1.5039 z"
       id="path3368" />
  </g>
  <g
     transform="matrix(0.2686927,0,0,0.2686927,-99.947016,22.200345)"
     stroke-width="6.8032"
     style="white-space:pre;shape-inside:url(#rect341-7-6);paint-order:markers fill stroke"
     aria-label="10%"
     id="g3378">
    <path
       d="m 591.89,48.117 h 4.5117 V 32.545 l -4.9082,0.98438 v -2.5156 l 4.8809,-0.98438 h 2.7617 v 18.088 h 4.5117 v 2.3242 h -11.758 z"
       id="path3372" />
    <path
       d="m 615.13,31.848 q -2.1328,0 -3.2129,2.1055 -1.0664,2.0918 -1.0664,6.3027 0,4.1973 1.0664,6.3027 1.0801,2.0918 3.2129,2.0918 2.1465,0 3.2129,-2.0918 1.0801,-2.1055 1.0801,-6.3027 0,-4.2109 -1.0801,-6.3027 -1.0664,-2.1055 -3.2129,-2.1055 z m 0,-2.1875 q 3.4316,0 5.2363,2.7207 1.8184,2.707 1.8184,7.875 0,5.1543 -1.8184,7.875 -1.8047,2.707 -5.2363,2.707 -3.4316,0 -5.25,-2.707 -1.8047,-2.7207 -1.8047,-7.875 0,-5.168 1.8047,-7.875 1.8184,-2.7207 5.25,-2.7207 z"
       id="path3374" />
    <path
       d="m 644.4,41.459 q -1.1894,0 -1.873,1.0117 -0.66992,1.0117 -0.66992,2.8164 0,1.7773 0.66992,2.8027 0.68359,1.0117 1.873,1.0117 1.1621,0 1.832,-1.0117 0.68359,-1.0254 0.68359,-2.8027 0,-1.791 -0.68359,-2.8027 -0.66993,-1.0254 -1.832,-1.0254 z m 0,-1.7363 q 2.1602,0 3.4316,1.5039 1.2715,1.5039 1.2715,4.0605 0,2.5566 -1.2852,4.0605 -1.2715,1.4902 -3.418,1.4902 -2.1875,0 -3.459,-1.4902 -1.2715,-1.5039 -1.2715,-4.0605 0,-2.5703 1.2715,-4.0605 1.2852,-1.5039 3.459,-1.5039 z m -14.109,-8.3262 q -1.1758,0 -1.8594,1.0254 -0.66992,1.0117 -0.66992,2.7891 0,1.8047 0.66992,2.8164 0.66993,1.0117 1.8594,1.0117 1.18947,0 1.8594,-1.0117 0.6836,-1.0117 0.6836,-2.8164 0,-1.7637 -0.6836,-2.7891 -0.68359,-1.0254 -1.8594,-1.0254 z m 12.346,-1.7363 h 2.1875 l -12.77,21.178 h -2.1875 z m -12.346,0 q 2.1602,0 3.4453,1.5039 1.2852,1.4902 1.2852,4.0469 0,2.584 -1.2852,4.0742 -1.2715,1.4902 -3.4453,1.4902 -2.1738,0 -3.4453,-1.4902 -1.2578,-1.5039 -1.2578,-4.0742 0,-2.543 1.2715,-4.0469 1.2715,-1.5039 3.4316,-1.5039 z"
       id="path3376" />
  </g>
  <g
     transform="matrix(0.2686927,0,0,0.2686927,-130.99225,157.549)"
     stroke-width="6.8032"
     style="white-space:pre;shape-inside:url(#rect341-9);paint-order:markers fill stroke"
     aria-label="100%"
     id="g3388">
    <path
       d="m 582.98,48.117 h 4.5117 V 32.545 l -4.9082,0.98438 v -2.5156 l 4.8809,-0.98438 h 2.7617 v 18.088 h 4.5117 v 2.3242 h -11.758 z"
       id="path3380" />
    <path
       d="m 606.22,31.848 q -2.1328,0 -3.2129,2.1055 -1.0664,2.0918 -1.0664,6.3027 0,4.1973 1.0664,6.3027 1.0801,2.0918 3.2129,2.0918 2.1465,0 3.2129,-2.0918 1.0801,-2.1055 1.0801,-6.3027 0,-4.2109 -1.0801,-6.3027 -1.0664,-2.1055 -3.2129,-2.1055 z m 0,-2.1875 q 3.4316,0 5.2363,2.7207 1.8184,2.707 1.8184,7.875 0,5.1543 -1.8184,7.875 -1.8047,2.707 -5.2363,2.707 -3.4316,0 -5.25,-2.707 -1.8047,-2.7207 -1.8047,-7.875 0,-5.168 1.8047,-7.875 1.8184,-2.7207 5.25,-2.7207 z"
       id="path3382" />
    <path
       d="m 624.04,31.848 q -2.1328,0 -3.2129,2.1055 -1.0664,2.0918 -1.0664,6.3027 0,4.1973 1.0664,6.3027 1.0801,2.0918 3.2129,2.0918 2.1465,0 3.2129,-2.0918 1.0801,-2.1055 1.0801,-6.3027 0,-4.2109 -1.0801,-6.3027 -1.0664,-2.1055 -3.2129,-2.1055 z m 0,-2.1875 q 3.4316,0 5.2363,2.7207 1.8184,2.707 1.8184,7.875 0,5.1543 -1.8184,7.875 -1.8047,2.707 -5.2363,2.707 -3.4316,0 -5.25,-2.707 -1.8047,-2.7207 -1.8047,-7.875 0,-5.168 1.8047,-7.875 1.8184,-2.7207 5.25,-2.7207 z"
       id="path3384" />
    <path
       d="m 653.31,41.459 q -1.1894,0 -1.873,1.0117 -0.66992,1.0117 -0.66992,2.8164 0,1.7773 0.66992,2.8027 0.6836,1.0117 1.873,1.0117 1.1621,0 1.832,-1.0117 0.6836,-1.0254 0.6836,-2.8027 0,-1.791 -0.6836,-2.8027 -0.66992,-1.0254 -1.832,-1.0254 z m 0,-1.7363 q 2.1602,0 3.4316,1.5039 1.2715,1.5039 1.2715,4.0605 0,2.5566 -1.2852,4.0605 -1.2715,1.4902 -3.418,1.4902 -2.1875,0 -3.459,-1.4902 -1.2715,-1.5039 -1.2715,-4.0605 0,-2.5703 1.2715,-4.0605 1.2852,-1.5039 3.459,-1.5039 z m -14.109,-8.3262 q -1.1758,0 -1.8594,1.0254 -0.66992,1.0117 -0.66992,2.7891 0,1.8047 0.66992,2.8164 0.66992,1.0117 1.8594,1.0117 1.1894,0 1.8594,-1.0117 0.68359,-1.0117 0.68359,-2.8164 0,-1.7637 -0.68359,-2.7891 -0.68359,-1.0254 -1.8594,-1.0254 z m 12.346,-1.7363 h 2.1875 l -12.77,21.178 h -2.1875 z m -12.346,0 q 2.1602,0 3.4453,1.5039 1.2852,1.4902 1.2852,4.0469 0,2.584 -1.2852,4.0742 -1.2715,1.4902 -3.4453,1.4902 -2.1738,0 -3.4453,-1.4902 -1.2578,-1.5039 -1.2578,-4.0742 0,-2.543 1.2715,-4.0469 1.2715,-1.5039 3.4316,-1.5039 z"
       id="path3386" />
  </g>
  <g
     transform="matrix(0.2686927,0,0,0.2686927,-130.89108,130.36312)"
     stroke-width="6.8032"
     style="white-space:pre;shape-inside:url(#rect341-3-1);paint-order:markers fill stroke"
     aria-label="75%"
     id="g3396">
    <path
       d="m 590.71,30.029 h 13.125 v 1.1758 l -7.4102,19.236 H 593.54 l 6.9727,-18.088 H 590.71 Z"
       id="path3390" />
    <path
       d="m 609.25,30.029 h 10.842 v 2.3242 h -8.3125 v 5.0039 q 0.60156,-0.20508 1.2031,-0.30078 0.60156,-0.10938 1.2031,-0.10938 3.418,0 5.4141,1.873 1.9961,1.873 1.9961,5.0723 0,3.2949 -2.0508,5.127 -2.0508,1.8184 -5.7832,1.8184 -1.2852,0 -2.625,-0.21875 -1.3262,-0.21875 -2.748,-0.65625 v -2.7754 q 1.2305,0.66992 2.543,0.99805 1.3125,0.32813 2.7754,0.32812 2.3652,0 3.7461,-1.2441 1.3809,-1.2441 1.3809,-3.377 0,-2.1328 -1.3809,-3.377 -1.3809,-1.2442 -3.7461,-1.2441 -1.1074,0 -2.2148,0.24609 -1.0938,0.24609 -2.2422,0.76562 z"
       id="path3392" />
    <path
       d="m 644.4,41.459 q -1.1894,0 -1.873,1.0117 -0.66992,1.0117 -0.66992,2.8164 0,1.7773 0.66992,2.8027 0.68359,1.0117 1.873,1.0117 1.1621,0 1.832,-1.0117 0.68359,-1.0254 0.68359,-2.8027 0,-1.791 -0.68359,-2.8027 -0.66993,-1.0254 -1.832,-1.0254 z m 0,-1.7363 q 2.1602,0 3.4316,1.5039 1.2715,1.5039 1.2715,4.0605 0,2.5566 -1.2852,4.0605 -1.2715,1.4902 -3.418,1.4902 -2.1875,0 -3.459,-1.4902 -1.2715,-1.5039 -1.2715,-4.0605 0,-2.5703 1.2715,-4.0605 1.2852,-1.5039 3.459,-1.5039 z m -14.109,-8.3262 q -1.1758,0 -1.8594,1.0254 -0.66992,1.0117 -0.66992,2.7891 0,1.8047 0.66992,2.8164 0.66993,1.0117 1.8594,1.0117 1.18947,0 1.8594,-1.0117 0.6836,-1.0117 0.6836,-2.8164 0,-1.7637 -0.6836,-2.7891 -0.68359,-1.0254 -1.8594,-1.0254 z m 12.346,-1.7363 h 2.1875 l -12.77,21.178 h -2.1875 z m -12.346,0 q 2.1602,0 3.4453,1.5039 1.2852,1.4902 1.2852,4.0469 0,2.584 -1.2852,4.0742 -1.2715,1.4902 -3.4453,1.4902 -2.1738,0 -3.4453,-1.4902 -1.2578,-1.5039 -1.2578,-4.0742 0,-2.543 1.2715,-4.0469 1.2715,-1.5039 3.4316,-1.5039 z"
       id="path3394" />
  </g>
  <g
     transform="matrix(0.2686927,0,0,0.2686927,-130.87047,103.17723)"
     stroke-width="6.8032"
     style="white-space:pre;shape-inside:url(#rect341-7-2);paint-order:markers fill stroke"
     aria-label="50%"
     id="g3404">
    <path
       d="m 591.43,30.029 h 10.842 v 2.3242 h -8.3125 v 5.0039 q 0.60156,-0.20508 1.2031,-0.30078 0.60156,-0.10938 1.2031,-0.10938 3.418,0 5.4141,1.873 1.9961,1.873 1.9961,5.0723 0,3.2949 -2.0508,5.127 -2.0508,1.8184 -5.7832,1.8184 -1.2852,0 -2.625,-0.21875 -1.3262,-0.21875 -2.748,-0.65625 v -2.7754 q 1.2305,0.66992 2.543,0.99805 1.3125,0.32813 2.7754,0.32812 2.3652,0 3.7461,-1.2441 1.3808,-1.2441 1.3808,-3.377 0,-2.1328 -1.3808,-3.377 -1.3809,-1.2441 -3.7461,-1.2441 -1.1074,0 -2.2148,0.24609 -1.0938,0.24609 -2.2422,0.76562 z"
       id="path3398" />
    <path
       d="m 615.13,31.848 q -2.1328,0 -3.2129,2.1055 -1.0664,2.0918 -1.0664,6.3027 0,4.1973 1.0664,6.3027 1.0801,2.0918 3.2129,2.0918 2.1465,0 3.2129,-2.0918 1.0801,-2.1055 1.0801,-6.3027 0,-4.2109 -1.0801,-6.3027 -1.0664,-2.1055 -3.2129,-2.1055 z m 0,-2.1875 q 3.4316,0 5.2363,2.7207 1.8184,2.707 1.8184,7.875 0,5.1543 -1.8184,7.875 -1.8047,2.707 -5.2363,2.707 -3.4316,0 -5.25,-2.707 -1.8047,-2.7207 -1.8047,-7.875 0,-5.168 1.8047,-7.875 1.8184,-2.7207 5.25,-2.7207 z"
       id="path3400" />
    <path
       d="m 644.4,41.459 q -1.1894,0 -1.873,1.0117 -0.66992,1.0117 -0.66992,2.8164 0,1.7773 0.66992,2.8027 0.68359,1.0117 1.873,1.0117 1.1621,0 1.832,-1.0117 0.68359,-1.0254 0.68359,-2.8027 0,-1.791 -0.68359,-2.8027 -0.66993,-1.0254 -1.832,-1.0254 z m 0,-1.7363 q 2.1602,0 3.4316,1.5039 1.2715,1.5039 1.2715,4.0605 0,2.5566 -1.2852,4.0605 -1.2715,1.4902 -3.418,1.4902 -2.1875,0 -3.459,-1.4902 -1.2715,-1.5039 -1.2715,-4.0605 0,-2.5703 1.2715,-4.0605 1.2852,-1.5039 3.459,-1.5039 z m -14.109,-8.3262 q -1.1758,0 -1.8594,1.0254 -0.66992,1.0117 -0.66992,2.7891 0,1.8047 0.66992,2.8164 0.66993,1.0117 1.8594,1.0117 1.18947,0 1.8594,-1.0117 0.6836,-1.0117 0.6836,-2.8164 0,-1.7637 -0.6836,-2.7891 -0.68359,-1.0254 -1.8594,-1.0254 z m 12.346,-1.7363 h 2.1875 l -12.77,21.178 h -2.1875 z m -12.346,0 q 2.1602,0 3.4453,1.5039 1.2852,1.4902 1.2852,4.0469 0,2.584 -1.2852,4.0742 -1.2715,1.4902 -3.4453,1.4902 -2.1738,0 -3.4453,-1.4902 -1.2578,-1.5039 -1.2578,-4.0742 0,-2.543 1.2715,-4.0469 1.2715,-1.5039 3.4316,-1.5039 z"
       id="path3402" />
  </g>
  <g
     transform="matrix(0.2686927,0,0,0.2686927,-130.84986,75.987596)"
     stroke-width="6.8032"
     style="white-space:pre;shape-inside:url(#rect341-7-3-7);paint-order:markers fill stroke"
     aria-label="25%"
     id="g3412">
    <path
       d="m 593.79,48.117 h 9.6387 v 2.3242 h -12.961 V 48.117 q 1.5723,-1.627 4.2793,-4.3613 2.7207,-2.748 3.418,-3.541 1.3262,-1.4902 1.8457,-2.5156 0.5332,-1.0391 0.5332,-2.0371 0,-1.627 -1.1484,-2.6523 -1.1348,-1.0254 -2.9668,-1.0254 -1.2988,0 -2.748,0.45117 -1.4356,0.45117 -3.0762,1.3672 v -2.7891 q 1.668,-0.66992 3.1172,-1.0117 1.4492,-0.34178 2.6524,-0.3418 3.1719,0 5.0586,1.5859 1.8867,1.5859 1.8867,4.2383 0,1.2578 -0.47852,2.3926 -0.46484,1.1211 -1.709,2.6523 -0.3418,0.39648 -2.1738,2.2969 -1.832,1.8867 -5.168,5.291 z"
       id="path3406" />
    <path
       d="m 609.25,30.029 h 10.842 v 2.3242 h -8.3125 v 5.0039 q 0.60156,-0.20508 1.2031,-0.30078 0.60156,-0.10938 1.2031,-0.10938 3.418,0 5.4141,1.873 1.9961,1.873 1.9961,5.0723 0,3.2949 -2.0508,5.127 -2.0508,1.8184 -5.7832,1.8184 -1.2852,0 -2.625,-0.21875 -1.3262,-0.21875 -2.748,-0.65625 v -2.7754 q 1.2305,0.66992 2.543,0.99805 1.3125,0.32813 2.7754,0.32812 2.3652,0 3.7461,-1.2441 1.3809,-1.2441 1.3809,-3.377 0,-2.1328 -1.3809,-3.377 -1.3809,-1.2442 -3.7461,-1.2441 -1.1074,0 -2.2148,0.24609 -1.0938,0.24609 -2.2422,0.76562 z"
       id="path3408" />
    <path
       d="m 644.4,41.459 q -1.1894,0 -1.873,1.0117 -0.66992,1.0117 -0.66992,2.8164 0,1.7773 0.66992,2.8027 0.68359,1.0117 1.873,1.0117 1.1621,0 1.832,-1.0117 0.68359,-1.0254 0.68359,-2.8027 0,-1.791 -0.68359,-2.8027 -0.66993,-1.0254 -1.832,-1.0254 z m 0,-1.7363 q 2.1602,0 3.4316,1.5039 1.2715,1.5039 1.2715,4.0605 0,2.5566 -1.2852,4.0605 -1.2715,1.4902 -3.418,1.4902 -2.1875,0 -3.459,-1.4902 -1.2715,-1.5039 -1.2715,-4.0605 0,-2.5703 1.2715,-4.0605 1.2852,-1.5039 3.459,-1.5039 z m -14.109,-8.3262 q -1.1758,0 -1.8594,1.0254 -0.66992,1.0117 -0.66992,2.7891 0,1.8047 0.66992,2.8164 0.66993,1.0117 1.8594,1.0117 1.18947,0 1.8594,-1.0117 0.6836,-1.0117 0.6836,-2.8164 0,-1.7637 -0.6836,-2.7891 -0.68359,-1.0254 -1.8594,-1.0254 z m 12.346,-1.7363 h 2.1875 l -12.77,21.178 h -2.1875 z m -12.346,0 q 2.1602,0 3.4453,1.5039 1.2852,1.4902 1.2852,4.0469 0,2.584 -1.2852,4.0742 -1.2715,1.4902 -3.4453,1.4902 -2.1738,0 -3.4453,-1.4902 -1.2578,-1.5039 -1.2578,-4.0742 0,-2.543 1.2715,-4.0469 1.2715,-1.5039 3.4316,-1.5039 z"
       id="path3410" />
  </g>
  <g
     transform="matrix(0.2686927,0,0,0.2686927,-130.99225,48.803583)"
     stroke-width="6.8032"
     style="white-space:pre;shape-inside:url(#rect341-7-6-0);paint-order:markers fill stroke"
     aria-label="10%"
     id="g3420">
    <path
       d="m 591.89,48.117 h 4.5117 V 32.545 l -4.9082,0.98438 v -2.5156 l 4.8809,-0.98438 h 2.7617 v 18.088 h 4.5117 v 2.3242 h -11.758 z"
       id="path3414" />
    <path
       d="m 615.13,31.848 q -2.1328,0 -3.2129,2.1055 -1.0664,2.0918 -1.0664,6.3027 0,4.1973 1.0664,6.3027 1.0801,2.0918 3.2129,2.0918 2.1465,0 3.2129,-2.0918 1.0801,-2.1055 1.0801,-6.3027 0,-4.2109 -1.0801,-6.3027 -1.0664,-2.1055 -3.2129,-2.1055 z m 0,-2.1875 q 3.4316,0 5.2363,2.7207 1.8184,2.707 1.8184,7.875 0,5.1543 -1.8184,7.875 -1.8047,2.707 -5.2363,2.707 -3.4316,0 -5.25,-2.707 -1.8047,-2.7207 -1.8047,-7.875 0,-5.168 1.8047,-7.875 1.8184,-2.7207 5.25,-2.7207 z"
       id="path3416" />
    <path
       d="m 644.4,41.459 q -1.1894,0 -1.873,1.0117 -0.66992,1.0117 -0.66992,2.8164 0,1.7773 0.66992,2.8027 0.68359,1.0117 1.873,1.0117 1.1621,0 1.832,-1.0117 0.68359,-1.0254 0.68359,-2.8027 0,-1.791 -0.68359,-2.8027 -0.66993,-1.0254 -1.832,-1.0254 z m 0,-1.7363 q 2.1602,0 3.4316,1.5039 1.2715,1.5039 1.2715,4.0605 0,2.5566 -1.2852,4.0605 -1.2715,1.4902 -3.418,1.4902 -2.1875,0 -3.459,-1.4902 -1.2715,-1.5039 -1.2715,-4.0605 0,-2.5703 1.2715,-4.0605 1.2852,-1.5039 3.459,-1.5039 z m -14.109,-8.3262 q -1.1758,0 -1.8594,1.0254 -0.66992,1.0117 -0.66992,2.7891 0,1.8047 0.66992,2.8164 0.66993,1.0117 1.8594,1.0117 1.18947,0 1.8594,-1.0117 0.6836,-1.0117 0.6836,-2.8164 0,-1.7637 -0.6836,-2.7891 -0.68359,-1.0254 -1.8594,-1.0254 z m 12.346,-1.7363 h 2.1875 l -12.77,21.178 h -2.1875 z m -12.346,0 q 2.1602,0 3.4453,1.5039 1.2852,1.4902 1.2852,4.0469 0,2.584 -1.2852,4.0742 -1.2715,1.4902 -3.4453,1.4902 -2.1738,0 -3.4453,-1.4902 -1.2578,-1.5039 -1.2578,-4.0742 0,-2.543 1.2715,-4.0469 1.2715,-1.5039 3.4316,-1.5039 z"
       id="path3418" />
  </g>
  <g
     transform="matrix(0.2686927,0,0,0.2686927,0.8030051,-0.15180752)"
     stroke-width="6.8032"
     style="white-space:pre;shape-inside:url(#rect1437);paint-order:markers fill stroke"
     aria-label="vitesse"
     id="g3436">
    <path
       d="m 376.38,46.01 h 4.0625 l 7.2917,19.583 7.2917,-19.583 h 4.0625 l -8.75,23.333 h -5.2083 z"
       id="path3422" />
    <path
       d="m 404.38,46.01 h 3.8333 V 69.343 H 404.38 Z m 0,-9.0833 h 3.8333 v 4.8542 H 404.38 Z"
       id="path3424" />
    <path
       d="m 420.03,39.385 v 6.625 h 7.8958 v 2.9792 H 420.03 v 12.667 q 0,2.8542 0.77084,3.6667 0.79166,0.8125 3.1875,0.8125 h 3.9375 v 3.2083 h -3.9375 q -4.4375,0 -6.125,-1.6458 -1.6875,-1.6667 -1.6875,-6.0417 v -12.667 h -2.8125 V 46.01 h 2.8125 v -6.625 z"
       id="path3426" />
    <path
       d="m 452.92,56.719 v 1.875 h -17.625 q 0.25,3.9583 2.375,6.0417 2.1458,2.0625 5.9583,2.0625 2.2083,0 4.2708,-0.54167 2.0833,-0.54167 4.125,-1.625 v 3.625 q -2.0625,0.875 -4.2292,1.3333 -2.1667,0.45833 -4.3958,0.45833 -5.5833,0 -8.8542,-3.25 -3.25,-3.25 -3.25,-8.7917 0,-5.7292 3.0833,-9.0833 3.1042,-3.375 8.3542,-3.375 4.7083,0 7.4375,3.0417 2.75,3.0208 2.75,8.2292 z m -3.8333,-1.125 q -0.0417,-3.1458 -1.7708,-5.0208 -1.7083,-1.875 -4.5417,-1.875 -3.2083,0 -5.1458,1.8125 -1.9167,1.8125 -2.2083,5.1042 z"
       id="path3428" />
    <path
       d="m 474.09,46.698 v 3.625 q -1.625,-0.83333 -3.375,-1.25 -1.75,-0.41667 -3.625,-0.41667 -2.8542,0 -4.2917,0.875 -1.4167,0.875 -1.4167,2.625 0,1.3333 1.0208,2.1042 1.0208,0.75 4.1042,1.4375 l 1.3125,0.29167 q 4.0833,0.875 5.7917,2.4792 1.7292,1.5833 1.7292,4.4375 0,3.25 -2.5833,5.1458 -2.5625,1.8958 -7.0625,1.8958 -1.875,0 -3.9167,-0.375 -2.0208,-0.35417 -4.2708,-1.0833 v -3.9583 q 2.125,1.1042 4.1875,1.6667 2.0625,0.54167 4.0833,0.54167 2.7083,0 4.1667,-0.91667 1.4583,-0.9375 1.4583,-2.625 0,-1.5625 -1.0625,-2.3958 -1.0417,-0.83333 -4.6042,-1.6042 l -1.3333,-0.3125 q -3.5625,-0.75 -5.1458,-2.2917 -1.5833,-1.5625 -1.5833,-4.2708 0,-3.2917 2.3333,-5.0833 2.3333,-1.7917 6.625,-1.7917 2.125,0 4,0.3125 1.875,0.3125 3.4583,0.9375 z"
       id="path3430" />
    <path
       d="m 496.32,46.698 v 3.625 q -1.625,-0.83333 -3.375,-1.25 -1.75,-0.41667 -3.625,-0.41667 -2.8542,0 -4.2917,0.875 -1.4167,0.875 -1.4167,2.625 0,1.3333 1.0208,2.1042 1.0208,0.75 4.1042,1.4375 l 1.3125,0.29167 q 4.0833,0.875 5.7917,2.4792 1.7292,1.5833 1.7292,4.4375 0,3.25 -2.5833,5.1458 -2.5625,1.8958 -7.0625,1.8958 -1.875,0 -3.9167,-0.375 -2.0208,-0.35417 -4.2708,-1.0833 v -3.9583 q 2.125,1.1042 4.1875,1.6667 2.0625,0.54167 4.0833,0.54167 2.7083,0 4.1667,-0.91667 1.4583,-0.9375 1.4583,-2.625 0,-1.5625 -1.0625,-2.3958 -1.0417,-0.83333 -4.6042,-1.6042 l -1.3333,-0.3125 q -3.5625,-0.75 -5.1458,-2.2917 -1.5833,-1.5625 -1.5833,-4.2708 0,-3.2917 2.3333,-5.0833 2.3333,-1.7917 6.625,-1.7917 2.125,0 4,0.3125 1.875,0.3125 3.4583,0.9375 z"
       id="path3432" />
    <path
       d="m 523.63,56.719 v 1.875 h -17.625 q 0.25,3.9583 2.375,6.0417 2.1458,2.0625 5.9583,2.0625 2.2083,0 4.2708,-0.54167 2.0833,-0.54167 4.125,-1.625 v 3.625 q -2.0625,0.875 -4.2292,1.3333 -2.1667,0.45833 -4.3958,0.45833 -5.5833,0 -8.8542,-3.25 -3.25,-3.25 -3.25,-8.7917 0,-5.7292 3.0833,-9.0833 3.1042,-3.375 8.3542,-3.375 4.7083,0 7.4375,3.0417 2.75,3.0208 2.75,8.2292 z m -3.8333,-1.125 q -0.0417,-3.1458 -1.7708,-5.0208 -1.7083,-1.875 -4.5417,-1.875 -3.2083,0 -5.1458,1.8125 -1.9167,1.8125 -2.2083,5.1042 z"
       id="path3434" />
  </g>
  <g
     transform="matrix(0.2686927,0,0,0.2686927,0.8030051,-0.15180752)"
     direction="rtl"
     stroke-width="6.8032"
     style="text-orientation:upright;white-space:pre;shape-inside:url(#rect1443);paint-order:markers fill stroke"
     aria-label="puissance"
     id="g3456">
    <path
       d="m 58.341,238.64 v 12.375 h -3.8542 v -32.208 h 3.8542 v 3.5417 q 1.2083,-2.0833 3.0417,-3.0833 1.8542,-1.0208 4.4167,-1.0208 4.25,0 6.8958,3.375 2.6667,3.375 2.6667,8.875 0,5.5 -2.6667,8.875 -2.6458,3.375 -6.8958,3.375 -2.5625,0 -4.4167,-1 -1.8333,-1.0208 -3.0417,-3.1042 z m 13.042,-8.1458 q 0,-4.2292 -1.75,-6.625 -1.7292,-2.4167 -4.7708,-2.4167 -3.0416,0 -4.7917,2.4167 -1.7292,2.3958 -1.7292,6.625 0,4.2292 1.7292,6.6458 1.75,2.3958 4.7917,2.3958 3.0417,0 4.7708,-2.3958 1.75,-2.4167 1.75,-6.6458 z"
       id="path3438" />
    <path
       d="m 54.257,275.6 v -14.125 h 3.8333 v 13.979 q 0,3.3125 1.2917,4.9792 1.2917,1.6458 3.875,1.6458 3.1042,0 4.8958,-1.9792 1.8125,-1.9792 1.8125,-5.3958 v -13.229 h 3.8333 v 23.333 h -3.8333 v -3.5833 q -1.3958,2.125 -3.25,3.1667 -1.8333,1.0208 -4.2708,1.0208 -4.0208,0 -6.1042,-2.5 -2.0834,-2.5 -2.0833,-7.3125 z"
       id="path3440" />
    <path
       d="m 62.247,304.14 h 3.8333 v 23.333 H 62.247 Z m 0,-9.0833 h 3.8333 v 4.8542 H 62.247 Z"
       id="path3442" />
    <path
       d="m 71.934,347.49 v 3.625 q -1.625,-0.83333 -3.375,-1.25 -1.75,-0.41666 -3.625,-0.41666 -2.8542,0 -4.2917,0.875 -1.4167,0.875 -1.4167,2.625 0,1.3333 1.0208,2.1042 1.0208,0.75 4.1042,1.4375 l 1.3125,0.29166 q 4.0833,0.875 5.7917,2.4792 1.7292,1.5833 1.7292,4.4375 0,3.25 -2.5833,5.1458 -2.5625,1.8958 -7.0625,1.8958 -1.875,0 -3.9167,-0.375 -2.0208,-0.35417 -4.2708,-1.0833 v -3.9583 q 2.125,1.1042 4.1875,1.6667 2.0625,0.54167 4.0833,0.54167 2.7083,0 4.1667,-0.91667 1.4583,-0.9375 1.4583,-2.625 0,-1.5625 -1.0625,-2.3958 -1.0417,-0.83334 -4.6042,-1.6042 l -1.3333,-0.3125 q -3.5625,-0.75 -5.1458,-2.2917 -1.5833,-1.5625 -1.5833,-4.2708 0,-3.2917 2.3333,-5.0833 2.3333,-1.7916 6.625,-1.7917 2.125,0 4,0.3125 1.875,0.3125 3.4583,0.9375 z"
       id="path3444" />
    <path
       d="m 71.934,390.16 v 3.625 q -1.625,-0.83334 -3.375,-1.25 -1.75,-0.41666 -3.625,-0.41666 -2.8542,0 -4.2917,0.875 -1.4167,0.875 -1.4167,2.625 0,1.3333 1.0208,2.1042 1.0208,0.75 4.1042,1.4375 l 1.3125,0.29167 q 4.0833,0.875 5.7917,2.4792 1.7292,1.5833 1.7292,4.4375 0,3.25 -2.5833,5.1458 -2.5625,1.8958 -7.0625,1.8958 -1.875,0 -3.9167,-0.375 -2.0208,-0.35417 -4.2708,-1.0833 v -3.9583 q 2.125,1.1042 4.1875,1.6667 2.0625,0.54166 4.0833,0.54166 2.7083,0 4.1667,-0.91666 1.4583,-0.9375 1.4583,-2.625 0,-1.5625 -1.0625,-2.3958 -1.0417,-0.83333 -4.6042,-1.6042 l -1.3333,-0.3125 q -3.5625,-0.75 -5.1458,-2.2917 -1.5833,-1.5625 -1.5833,-4.2708 0,-3.2917 2.3333,-5.0833 2.3333,-1.7916 6.625,-1.7917 2.125,0 4,0.3125 1.875,0.3125 3.4583,0.9375 z"
       id="path3446" />
    <path
       d="m 65.705,443.74 q -4.6458,0 -6.4375,1.0625 -1.7917,1.0625 -1.7917,3.625 0,2.0417 1.3333,3.25 1.3542,1.1875 3.6667,1.1875 3.1875,0 5.1042,-2.25 1.9375,-2.2708 1.9375,-6.0208 v -0.85417 z m 7.6458,-1.5833 v 13.313 h -3.8333 v -3.5417 q -1.3125,2.125 -3.2708,3.1458 -1.9583,1 -4.7917,1 -3.5833,0 -5.7083,-2 -2.1042,-2.0208 -2.1042,-5.3958 0,-3.9375 2.625,-5.9375 2.6458,-2 7.875,-2 h 5.375 v -0.375 q 0,-2.6458 -1.75,-4.0833 -1.7292,-1.4583 -4.875,-1.4583 -2,0 -3.8958,0.47916 -1.8958,0.47917 -3.6458,1.4375 v -3.5417 q 2.1042,-0.81251 4.0833,-1.2083 1.9792,-0.41667 3.8542,-0.41667 5.0625,0 7.5625,2.625 2.5,2.625 2.5,7.9583 z"
       id="path3448" />
    <path
       d="m 74.049,484.06 v 14.083 h -3.8333 v -13.958 q 0,-3.3125 -1.2917,-4.9583 -1.2917,-1.6458 -3.875,-1.6458 -3.1042,0 -4.8958,1.9792 -1.7916,1.9792 -1.7917,5.3958 v 13.188 h -3.8542 v -23.333 h 3.8542 v 3.625 q 1.375,-2.1042 3.2292,-3.1458 1.875,-1.0417 4.3125,-1.0417 4.0208,0 6.0833,2.5 2.0625,2.4792 2.0625,7.3125 z"
       id="path3450" />
    <path
       d="m 73.236,518.37 v 3.5833 q -1.625,-0.89583 -3.2708,-1.3333 -1.625,-0.45833 -3.2917,-0.45833 -3.7292,0 -5.7917,2.375 -2.0625,2.3542 -2.0625,6.625 0,4.2708 2.0625,6.6458 2.0625,2.3542 5.7917,2.3542 1.6667,0 3.2917,-0.4375 1.6458,-0.45834 3.2708,-1.3542 v 3.5417 q -1.6042,0.75 -3.3333,1.125 -1.7083,0.375 -3.6458,0.375 -5.2708,0 -8.375,-3.3125 -3.1042,-3.3125 -3.1042,-8.9375 0,-5.7083 3.125,-8.9792 3.1458,-3.2708 8.6042,-3.2708 1.7708,0 3.4583,0.375 1.6875,0.35417 3.2708,1.0833 z"
       id="path3452" />
    <path
       d="m 75.007,570.85 v 1.875 H 57.382 q 0.25,3.9583 2.375,6.0417 2.1458,2.0625 5.9583,2.0625 2.2083,0 4.2708,-0.54167 2.0833,-0.54167 4.125,-1.625 v 3.625 q -2.0625,0.875 -4.2292,1.3333 -2.1667,0.45834 -4.3958,0.45834 -5.5833,0 -8.8542,-3.25 -3.25,-3.25 -3.25,-8.7917 0,-5.7292 3.0833,-9.0833 3.1042,-3.375 8.3542,-3.375 4.7083,0 7.4375,3.0417 2.75,3.0208 2.75,8.2292 z m -3.8333,-1.125 q -0.04167,-3.1458 -1.7708,-5.0208 -1.7083,-1.875 -4.5417,-1.875 -3.2083,0 -5.1458,1.8125 -1.9167,1.8125 -2.2083,5.1042 z"
       id="path3454" />
  </g>
</svg>
