<?xml version="1.0" encoding="UTF-8" standalone="no"?>
<svg
   width="222.20mm"
   height="335.30mm"
   viewBox="0.0 0.0 222.20 335.30"
   version="1.1"
   id="svg254"
   sodipodi:docname="ABox-2.svg"
   inkscape:version="1.2.2 (b0a8486, 2022-12-01)"
   xmlns:inkscape="http://www.inkscape.org/namespaces/inkscape"
   xmlns:sodipodi="http://sodipodi.sourceforge.net/DTD/sodipodi-0.dtd"
   xmlns="http://www.w3.org/2000/svg"
   xmlns:svg="http://www.w3.org/2000/svg"
   xmlns:rdf="http://www.w3.org/1999/02/22-rdf-syntax-ns#"
   xmlns:cc="http://creativecommons.org/ns#"
   xmlns:dc="http://purl.org/dc/elements/1.1/">
  <defs
     id="defs258">
    <linearGradient
       id="linearGradient2241"
       inkscape:swatch="solid">
      <stop
         style="stop-color:#000000;stop-opacity:1;"
         offset="0"
         id="stop2239" />
    </linearGradient>
  </defs>
  <sodipodi:namedview
     id="namedview256"
     pagecolor="#ffffff"
     bordercolor="#000000"
     borderopacity="0.25"
     inkscape:showpageshadow="2"
     inkscape:pageopacity="0.0"
     inkscape:pagecheckerboard="0"
     inkscape:deskcolor="#d1d1d1"
     inkscape:document-units="mm"
     showgrid="false"
     inkscape:zoom="0.18622627"
     inkscape:cx="-252.38115"
     inkscape:cy="633.63777"
     inkscape:window-width="1440"
     inkscape:window-height="456"
     inkscape:window-x="0"
     inkscape:window-y="25"
     inkscape:window-maximized="0"
     inkscape:current-layer="p-1" />
  <!--
ABox - A simple Box


This box is kept simple on purpose. If you need more features have a look at the UniversalBox.


Created with Boxes.py (https://festi.info/boxes.py)
Creation date: 2023-04-15 12:57:34
Command line (remove spaces between dashes): boxes ABox 
Url: http://www.festi.info/boxes.py/ABox?FingerJoint_angle=90.0&FingerJoint_style=rectangular&FingerJoint_surroundingspaces=2.0&FingerJoint_bottom_lip=0.0&FingerJoint_edge_width=1.0&FingerJoint_extra_length=0.0&FingerJoint_finger=2.0&FingerJoint_play=0.0&FingerJoint_space=2.0&FingerJoint_width=1.0&Lid_handle=none&Lid_style=none&Lid_handle_height=8.0&Lid_height=4.0&Lid_play=0.1&x=100.0&y=100.0&h=100.0&outside=0&outside=1&bottom_edge=h&thickness=3.0&format=svg&tabs=0.0&qr_code=0&debug=0&labels=0&labels=1&reference=100&inner_corners=loop&burn=0.1&language=fr&render=2
Url short: http://www.festi.info/boxes.py/ABox
SettingsUrl: http://www.festi.info/boxes.py/ABox?FingerJoint_angle=90.0&FingerJoint_style=rectangular&FingerJoint_surroundingspaces=2.0&FingerJoint_bottom_lip=0.0&FingerJoint_edge_width=1.0&FingerJoint_extra_length=0.0&FingerJoint_finger=2.0&FingerJoint_play=0.0&FingerJoint_space=2.0&FingerJoint_width=1.0&Lid_handle=none&Lid_style=none&Lid_handle_height=8.0&Lid_height=4.0&Lid_play=0.1&x=100.0&y=100.0&h=100.0&outside=0&outside=1&bottom_edge=h&thickness=3.0&format=svg&tabs=0.0&qr_code=0&debug=0&labels=0&labels=1&reference=100&inner_corners=loop&burn=0.1&language=fr&render=2
SettingsUrl short: http://www.festi.info/boxes.py/ABox
-->
  <title
     id="title174">ABox</title>
  <metadata
     id="metadata176">
    <rdf:RDF>
      <cc:Work>
        <dc:title>Box - ABox</dc:title>
        <dc:date>2023-04-15 12:57:34</dc:date>
        <dc:source>http://www.festi.info/boxes.py/ABox?FingerJoint_angle=90.0&amp;FingerJoint_style=rectangular&amp;FingerJoint_surroundingspaces=2.0&amp;FingerJoint_bottom_lip=0.0&amp;FingerJoint_edge_width=1.0&amp;FingerJoint_extra_length=0.0&amp;FingerJoint_finger=2.0&amp;FingerJoint_play=0.0&amp;FingerJoint_space=2.0&amp;FingerJoint_width=1.0&amp;Lid_handle=none&amp;Lid_style=none&amp;Lid_handle_height=8.0&amp;Lid_height=4.0&amp;Lid_play=0.1&amp;x=100.0&amp;y=100.0&amp;h=100.0&amp;outside=0&amp;outside=1&amp;bottom_edge=h&amp;thickness=3.0&amp;format=svg&amp;tabs=0.0&amp;qr_code=0&amp;debug=0&amp;labels=0&amp;labels=1&amp;reference=100&amp;inner_corners=loop&amp;burn=0.1&amp;language=fr&amp;render=2</dc:source>
        <dc:source>http://www.festi.info/boxes.py/ABox</dc:source>
        <dc:description>A simple Box

This box is kept simple on purpose. If you need more features have a look at the UniversalBox.

Created with Boxes.py (https://festi.info/boxes.py)
Command line: boxes ABox --FingerJoint_angle=90.0 --FingerJoint_style=rectangular --FingerJoint_surroundingspaces=2.0 --FingerJoint_bottom_lip=0.0 --FingerJoint_edge_width=1.0 --FingerJoint_extra_length=0.0 --FingerJoint_finger=2.0 --FingerJoint_play=0.0 --FingerJoint_space=2.0 --FingerJoint_width=1.0 --Lid_handle=none --Lid_style=none --Lid_handle_height=8.0 --Lid_height=4.0 --Lid_play=0.1 --x=100.0 --y=100.0 --h=100.0 --outside=0 --outside=1 --bottom_edge=h --thickness=3.0 --format=svg --tabs=0.0 --qr_code=0 --debug=0 --labels=0 --labels=1 --reference=100 --inner_corners=loop --burn=0.1
Command line short: boxes ABox 
Url: http://www.festi.info/boxes.py/ABox?FingerJoint_angle=90.0&amp;FingerJoint_style=rectangular&amp;FingerJoint_surroundingspaces=2.0&amp;FingerJoint_bottom_lip=0.0&amp;FingerJoint_edge_width=1.0&amp;FingerJoint_extra_length=0.0&amp;FingerJoint_finger=2.0&amp;FingerJoint_play=0.0&amp;FingerJoint_space=2.0&amp;FingerJoint_width=1.0&amp;Lid_handle=none&amp;Lid_style=none&amp;Lid_handle_height=8.0&amp;Lid_height=4.0&amp;Lid_play=0.1&amp;x=100.0&amp;y=100.0&amp;h=100.0&amp;outside=0&amp;outside=1&amp;bottom_edge=h&amp;thickness=3.0&amp;format=svg&amp;tabs=0.0&amp;qr_code=0&amp;debug=0&amp;labels=0&amp;labels=1&amp;reference=100&amp;inner_corners=loop&amp;burn=0.1&amp;language=fr&amp;render=2
Url short: http://www.festi.info/boxes.py/ABox
SettingsUrl: http://www.festi.info/boxes.py/ABox?FingerJoint_angle=90.0&amp;FingerJoint_style=rectangular&amp;FingerJoint_surroundingspaces=2.0&amp;FingerJoint_bottom_lip=0.0&amp;FingerJoint_edge_width=1.0&amp;FingerJoint_extra_length=0.0&amp;FingerJoint_finger=2.0&amp;FingerJoint_play=0.0&amp;FingerJoint_space=2.0&amp;FingerJoint_width=1.0&amp;Lid_handle=none&amp;Lid_style=none&amp;Lid_handle_height=8.0&amp;Lid_height=4.0&amp;Lid_play=0.1&amp;x=100.0&amp;y=100.0&amp;h=100.0&amp;outside=0&amp;outside=1&amp;bottom_edge=h&amp;thickness=3.0&amp;format=svg&amp;tabs=0.0&amp;qr_code=0&amp;debug=0&amp;labels=0&amp;labels=1&amp;reference=100&amp;inner_corners=loop&amp;burn=0.1&amp;language=fr&amp;render=2
SettingsUrl short: http://www.festi.info/boxes.py/ABox
</dc:description>
      </cc:Work>
    </rdf:RDF>
  </metadata>
  <g
     id="p-0"
     style="fill:none;stroke-linecap:round;stroke-linejoin:round;">
    <path
       d="M 10.400 325.300 H 110.400 V 315.300 H 10.400 V 325.300 Z"
       stroke="rgb(0,0,0)"
       stroke-width="0.20"
       id="path178" />
    <text
       transform="matrix( 1.000 0.000 0.000 1.000 60.400 316.300 )"
       style="font-family: sans-serif ; font-weight: normal; font-style: normal; fill: rgb(255,0,0)"
       font-size="8px"
       text-anchor="middle"
       dominant-baseline="hanging"
       id="text180">100mm, burn:0.10mm</text>
  </g>
  <g
     id="p-1"
     style="fill:none;stroke-linecap:round;stroke-linejoin:round;">
    <path
       d="M 24.400 310.400 H 21.500 C 21.400 310.400 21.500 310.500 21.500 310.400 V 307.600 C 21.500 307.500 21.400 307.600 21.500 307.600 H 27.300 C 27.400 307.600 27.300 307.500 27.300 307.600 V 310.400 C 27.300 310.500 27.400 310.400 27.300 310.400 H 24.400 Z"
       stroke="rgb(0,0,255)"
       stroke-width="0.20"
       id="path183" />
    <path
       d="M 36.400 310.400 H 33.500 C 33.400 310.400 33.500 310.500 33.500 310.400 V 307.600 C 33.500 307.500 33.400 307.600 33.500 307.600 H 39.300 C 39.400 307.600 39.300 307.500 39.300 307.600 V 310.400 C 39.300 310.500 39.400 310.400 39.300 310.400 H 36.400 Z"
       stroke="rgb(0,0,255)"
       stroke-width="0.20"
       id="path185" />
    <path
       d="M 48.400 310.400 H 45.500 C 45.400 310.400 45.500 310.500 45.500 310.400 V 307.600 C 45.500 307.500 45.400 307.600 45.500 307.600 H 51.300 C 51.400 307.600 51.300 307.500 51.300 307.600 V 310.400 C 51.300 310.500 51.400 310.400 51.300 310.400 H 48.400 Z"
       stroke="rgb(0,0,255)"
       stroke-width="0.20"
       id="path187" />
    <path
       d="M 60.400 310.400 H 57.500 C 57.400 310.400 57.500 310.500 57.500 310.400 V 307.600 C 57.500 307.500 57.400 307.600 57.500 307.600 H 63.300 C 63.400 307.600 63.300 307.500 63.300 307.600 V 310.400 C 63.300 310.500 63.400 310.400 63.300 310.400 H 60.400 Z"
       stroke="rgb(0,0,255)"
       stroke-width="0.20"
       id="path189" />
    <path
       d="M 72.400 310.400 H 69.500 C 69.400 310.400 69.500 310.500 69.500 310.400 V 307.600 C 69.500 307.500 69.400 307.600 69.500 307.600 H 75.300 C 75.400 307.600 75.300 307.500 75.300 307.600 V 310.400 C 75.300 310.500 75.400 310.400 75.300 310.400 H 72.400 Z"
       stroke="rgb(0,0,255)"
       stroke-width="0.20"
       id="path191" />
    <path
       d="M 84.400 310.400 H 81.500 C 81.400 310.400 81.500 310.500 81.500 310.400 V 307.600 C 81.500 307.500 81.400 307.600 81.500 307.600 H 87.300 C 87.400 307.600 87.300 307.500 87.300 307.600 V 310.400 C 87.300 310.500 87.400 310.400 87.300 310.400 H 84.400 Z"
       stroke="rgb(0,0,255)"
       stroke-width="0.20"
       id="path193" />
    <path
       d="M 96.400 310.400 H 93.500 C 93.400 310.400 93.500 310.500 93.500 310.400 V 307.600 C 93.500 307.500 93.400 307.600 93.500 307.600 H 99.300 C 99.400 307.600 99.300 307.500 99.300 307.600 V 310.400 C 99.300 310.500 99.400 310.400 99.300 310.400 H 96.400 Z"
       stroke="rgb(0,0,255)"
       stroke-width="0.20"
       id="path195" />
    <path
       d="M 13.400 313.600 H 107.400 H 110.400 C 110.455 313.600 110.500 313.555 110.500 313.500 V 302.500 C 110.500 302.445 110.455 302.400 110.400 302.400 H 107.500 C 107.400 302.400 107.500 302.500 107.500 302.400 V 296.600 C 107.500 296.500 107.400 296.600 107.500 296.600 H 110.400 C 110.455 296.600 110.500 296.555 110.500 296.500 V 290.500 C 110.500 290.445 110.455 290.400 110.400 290.400 H 107.500 C 107.400 290.400 107.500 290.500 107.500 290.400 V 284.600 C 107.500 284.500 107.400 284.600 107.500 284.600 H 110.400 C 110.455 284.600 110.500 284.555 110.500 284.500 V 278.500 C 110.500 278.445 110.455 278.400 110.400 278.400 H 107.500 C 107.400 278.400 107.500 278.500 107.500 278.400 V 272.600 C 107.500 272.500 107.400 272.600 107.500 272.600 H 110.400 C 110.455 272.600 110.500 272.555 110.500 272.500 V 266.500 C 110.500 266.445 110.455 266.400 110.400 266.400 H 107.500 C 107.400 266.400 107.500 266.500 107.500 266.400 V 260.600 C 107.500 260.500 107.400 260.600 107.500 260.600 H 110.400 C 110.455 260.600 110.500 260.555 110.500 260.500 V 254.500 C 110.500 254.445 110.455 254.400 110.400 254.400 H 107.500 C 107.400 254.400 107.500 254.500 107.500 254.400 V 248.600 C 107.500 248.500 107.400 248.600 107.500 248.600 H 110.400 C 110.455 248.600 110.500 248.555 110.500 248.500 V 242.500 C 110.500 242.445 110.455 242.400 110.400 242.400 H 107.500 C 107.400 242.400 107.500 242.500 107.500 242.400 V 236.600 C 107.500 236.500 107.400 236.600 107.500 236.600 H 110.400 C 110.455 236.600 110.500 236.555 110.500 236.500 V 230.500 C 110.500 230.445 110.455 230.400 110.400 230.400 H 107.500 C 107.400 230.400 107.500 230.500 107.500 230.400 V 224.600 C 107.500 224.500 107.400 224.600 107.500 224.600 H 110.400 C 110.455 224.600 110.500 224.555 110.500 224.500 V 213.500 C 110.500 213.445 110.455 213.400 110.400 213.400 H 107.400 H 13.400 H 10.400 C 10.345 213.400 10.300 213.445 10.300 213.500 V 224.500 C 10.300 224.555 10.345 224.600 10.400 224.600 H 13.300 C 13.400 224.600 13.300 224.500 13.300 224.600 V 230.400 C 13.300 230.500 13.400 230.400 13.300 230.400 H 10.400 C 10.345 230.400 10.300 230.445 10.300 230.500 V 236.500 C 10.300 236.555 10.345 236.600 10.400 236.600 H 13.300 C 13.400 236.600 13.300 236.500 13.300 236.600 V 242.400 C 13.300 242.500 13.400 242.400 13.300 242.400 H 10.400 C 10.345 242.400 10.300 242.445 10.300 242.500 V 248.500 C 10.300 248.555 10.345 248.600 10.400 248.600 H 13.300 C 13.400 248.600 13.300 248.500 13.300 248.600 V 254.400 C 13.300 254.500 13.400 254.400 13.300 254.400 H 10.400 C 10.345 254.400 10.300 254.445 10.300 254.500 V 260.500 C 10.300 260.555 10.345 260.600 10.400 260.600 H 13.300 C 13.400 260.600 13.300 260.500 13.300 260.600 V 266.400 C 13.300 266.500 13.400 266.400 13.300 266.400 H 10.400 C 10.345 266.400 10.300 266.445 10.300 266.500 V 272.500 C 10.300 272.555 10.345 272.600 10.400 272.600 H 13.300 C 13.400 272.600 13.300 272.500 13.300 272.600 V 278.400 C 13.300 278.500 13.400 278.400 13.300 278.400 H 10.400 C 10.345 278.400 10.300 278.445 10.300 278.500 V 284.500 C 10.300 284.555 10.345 284.600 10.400 284.600 H 13.300 C 13.400 284.600 13.300 284.500 13.300 284.600 V 290.400 C 13.300 290.500 13.400 290.400 13.300 290.400 H 10.400 C 10.345 290.400 10.300 290.445 10.300 290.500 V 296.500 C 10.300 296.555 10.345 296.600 10.400 296.600 H 13.300 C 13.400 296.600 13.300 296.500 13.300 296.600 V 302.400 C 13.300 302.500 13.400 302.400 13.300 302.400 H 10.400 C 10.345 302.400 10.300 302.445 10.300 302.500 V 313.500 C 10.300 313.555 10.345 313.600 10.400 313.600 H 13.400 Z"
       stroke="rgb(0,0,0)"
       stroke-width="0.20"
       id="path197" />
  </g>
  <g
     id="p-2"
     style="fill:none;stroke-linecap:round;stroke-linejoin:round;">
    <path
       d="M 24.400 208.700 H 21.500 C 21.400 208.700 21.500 208.800 21.500 208.700 V 205.900 C 21.500 205.800 21.400 205.900 21.500 205.900 H 27.300 C 27.400 205.900 27.300 205.800 27.300 205.900 V 208.700 C 27.300 208.800 27.400 208.700 27.300 208.700 H 24.400 Z"
       stroke="rgb(0,0,255)"
       stroke-width="0.20"
       id="path200" />
    <path
       d="M 36.400 208.700 H 33.500 C 33.400 208.700 33.500 208.800 33.500 208.700 V 205.900 C 33.500 205.800 33.400 205.900 33.500 205.900 H 39.300 C 39.400 205.900 39.300 205.800 39.300 205.900 V 208.700 C 39.300 208.800 39.400 208.700 39.300 208.700 H 36.400 Z"
       stroke="rgb(0,0,255)"
       stroke-width="0.20"
       id="path202" />
    <path
       d="M 48.400 208.700 H 45.500 C 45.400 208.700 45.500 208.800 45.500 208.700 V 205.900 C 45.500 205.800 45.400 205.900 45.500 205.900 H 51.300 C 51.400 205.900 51.300 205.800 51.300 205.900 V 208.700 C 51.300 208.800 51.400 208.700 51.300 208.700 H 48.400 Z"
       stroke="rgb(0,0,255)"
       stroke-width="0.20"
       id="path204" />
    <path
       d="M 60.400 208.700 H 57.500 C 57.400 208.700 57.500 208.800 57.500 208.700 V 205.900 C 57.500 205.800 57.400 205.900 57.500 205.900 H 63.300 C 63.400 205.900 63.300 205.800 63.300 205.900 V 208.700 C 63.300 208.800 63.400 208.700 63.300 208.700 H 60.400 Z"
       stroke="rgb(0,0,255)"
       stroke-width="0.20"
       id="path206" />
    <path
       d="M 72.400 208.700 H 69.500 C 69.400 208.700 69.500 208.800 69.500 208.700 V 205.900 C 69.500 205.800 69.400 205.900 69.500 205.900 H 75.300 C 75.400 205.900 75.300 205.800 75.300 205.900 V 208.700 C 75.300 208.800 75.400 208.700 75.300 208.700 H 72.400 Z"
       stroke="rgb(0,0,255)"
       stroke-width="0.20"
       id="path208" />
    <path
       d="M 84.400 208.700 H 81.500 C 81.400 208.700 81.500 208.800 81.500 208.700 V 205.900 C 81.500 205.800 81.400 205.900 81.500 205.900 H 87.300 C 87.400 205.900 87.300 205.800 87.300 205.900 V 208.700 C 87.300 208.800 87.400 208.700 87.300 208.700 H 84.400 Z"
       stroke="rgb(0,0,255)"
       stroke-width="0.20"
       id="path210" />
    <path
       d="M 96.400 208.700 H 93.500 C 93.400 208.700 93.500 208.800 93.500 208.700 V 205.900 C 93.500 205.800 93.400 205.900 93.500 205.900 H 99.300 C 99.400 205.900 99.300 205.800 99.300 205.900 V 208.700 C 99.300 208.800 99.400 208.700 99.300 208.700 H 96.400 Z"
       stroke="rgb(0,0,255)"
       stroke-width="0.20"
       id="path212" />
    <path
       d="M 13.400 211.900 H 107.400 H 110.400 C 110.455 211.900 110.500 211.855 110.500 211.800 V 200.800 C 110.500 200.745 110.455 200.700 110.400 200.700 H 107.500 C 107.400 200.700 107.500 200.800 107.500 200.700 V 194.900 C 107.500 194.800 107.400 194.900 107.500 194.900 H 110.400 C 110.455 194.900 110.500 194.855 110.500 194.800 V 188.800 C 110.500 188.745 110.455 188.700 110.400 188.700 H 107.500 C 107.400 188.700 107.500 188.800 107.500 188.700 V 182.900 C 107.500 182.800 107.400 182.900 107.500 182.900 H 110.400 C 110.455 182.900 110.500 182.855 110.500 182.800 V 176.800 C 110.500 176.745 110.455 176.700 110.400 176.700 H 107.500 C 107.400 176.700 107.500 176.800 107.500 176.700 V 170.900 C 107.500 170.800 107.400 170.900 107.500 170.900 H 110.400 C 110.455 170.900 110.500 170.855 110.500 170.800 V 164.800 C 110.500 164.745 110.455 164.700 110.400 164.700 H 107.500 C 107.400 164.700 107.500 164.800 107.500 164.700 V 158.900 C 107.500 158.800 107.400 158.900 107.500 158.900 H 110.400 C 110.455 158.900 110.500 158.855 110.500 158.800 V 152.800 C 110.500 152.745 110.455 152.700 110.400 152.700 H 107.500 C 107.400 152.700 107.500 152.800 107.500 152.700 V 146.900 C 107.500 146.800 107.400 146.900 107.500 146.900 H 110.400 C 110.455 146.900 110.500 146.855 110.500 146.800 V 140.800 C 110.500 140.745 110.455 140.700 110.400 140.700 H 107.500 C 107.400 140.700 107.500 140.800 107.500 140.700 V 134.900 C 107.500 134.800 107.400 134.900 107.500 134.900 H 110.400 C 110.455 134.900 110.500 134.855 110.500 134.800 V 128.800 C 110.500 128.745 110.455 128.700 110.400 128.700 H 107.500 C 107.400 128.700 107.500 128.800 107.500 128.700 V 122.900 C 107.500 122.800 107.400 122.900 107.500 122.900 H 110.400 C 110.455 122.900 110.500 122.855 110.500 122.800 V 111.800 C 110.500 111.745 110.455 111.700 110.400 111.700 H 107.400 H 13.400 H 10.400 C 10.345 111.700 10.300 111.745 10.300 111.800 V 122.800 C 10.300 122.855 10.345 122.900 10.400 122.900 H 13.300 C 13.400 122.900 13.300 122.800 13.300 122.900 V 128.700 C 13.300 128.800 13.400 128.700 13.300 128.700 H 10.400 C 10.345 128.700 10.300 128.745 10.300 128.800 V 134.800 C 10.300 134.855 10.345 134.900 10.400 134.900 H 13.300 C 13.400 134.900 13.300 134.800 13.300 134.900 V 140.700 C 13.300 140.800 13.400 140.700 13.300 140.700 H 10.400 C 10.345 140.700 10.300 140.745 10.300 140.800 V 146.800 C 10.300 146.855 10.345 146.900 10.400 146.900 H 13.300 C 13.400 146.900 13.300 146.800 13.300 146.900 V 152.700 C 13.300 152.800 13.400 152.700 13.300 152.700 H 10.400 C 10.345 152.700 10.300 152.745 10.300 152.800 V 158.800 C 10.300 158.855 10.345 158.900 10.400 158.900 H 13.300 C 13.400 158.900 13.300 158.800 13.300 158.900 V 164.700 C 13.300 164.800 13.400 164.700 13.300 164.700 H 10.400 C 10.345 164.700 10.300 164.745 10.300 164.800 V 170.800 C 10.300 170.855 10.345 170.900 10.400 170.900 H 13.300 C 13.400 170.900 13.300 170.800 13.300 170.900 V 176.700 C 13.300 176.800 13.400 176.700 13.300 176.700 H 10.400 C 10.345 176.700 10.300 176.745 10.300 176.800 V 182.800 C 10.300 182.855 10.345 182.900 10.400 182.900 H 13.300 C 13.400 182.900 13.300 182.800 13.300 182.900 V 188.700 C 13.300 188.800 13.400 188.700 13.300 188.700 H 10.400 C 10.345 188.700 10.300 188.745 10.300 188.800 V 194.800 C 10.300 194.855 10.345 194.900 10.400 194.900 H 13.300 C 13.400 194.900 13.300 194.800 13.300 194.900 V 200.700 C 13.300 200.800 13.400 200.700 13.300 200.700 H 10.400 C 10.345 200.700 10.300 200.745 10.300 200.800 V 211.800 C 10.300 211.855 10.345 211.900 10.400 211.900 H 13.400 Z"
       stroke="rgb(0,0,0)"
       stroke-width="0.20"
       id="path214" />
  </g>
  <g
     id="p-3"
     style="fill:none;stroke-linecap:round;stroke-linejoin:round;">
    <path
       d="M 13.400 107.200 H 21.300 C 21.400 107.200 21.300 107.100 21.300 107.200 V 110.100 C 21.300 110.155 21.345 110.200 21.400 110.200 H 27.400 C 27.455 110.200 27.500 110.155 27.500 110.100 V 107.200 C 27.500 107.100 27.400 107.200 27.500 107.200 H 33.300 C 33.400 107.200 33.300 107.100 33.300 107.200 V 110.100 C 33.300 110.155 33.345 110.200 33.400 110.200 H 39.400 C 39.455 110.200 39.500 110.155 39.500 110.100 V 107.200 C 39.500 107.100 39.400 107.200 39.500 107.200 H 45.300 C 45.400 107.200 45.300 107.100 45.300 107.200 V 110.100 C 45.300 110.155 45.345 110.200 45.400 110.200 H 51.400 C 51.455 110.200 51.500 110.155 51.500 110.100 V 107.200 C 51.500 107.100 51.400 107.200 51.500 107.200 H 57.300 C 57.400 107.200 57.300 107.100 57.300 107.200 V 110.100 C 57.300 110.155 57.345 110.200 57.400 110.200 H 63.400 C 63.455 110.200 63.500 110.155 63.500 110.100 V 107.200 C 63.500 107.100 63.400 107.200 63.500 107.200 H 69.300 C 69.400 107.200 69.300 107.100 69.300 107.200 V 110.100 C 69.300 110.155 69.345 110.200 69.400 110.200 H 75.400 C 75.455 110.200 75.500 110.155 75.500 110.100 V 107.200 C 75.500 107.100 75.400 107.200 75.500 107.200 H 81.300 C 81.400 107.200 81.300 107.100 81.300 107.200 V 110.100 C 81.300 110.155 81.345 110.200 81.400 110.200 H 87.400 C 87.455 110.200 87.500 110.155 87.500 110.100 V 107.200 C 87.500 107.100 87.400 107.200 87.500 107.200 H 93.300 C 93.400 107.200 93.300 107.100 93.300 107.200 V 110.100 C 93.300 110.155 93.345 110.200 93.400 110.200 H 99.400 C 99.455 110.200 99.500 110.155 99.500 110.100 V 107.200 C 99.500 107.100 99.400 107.200 99.500 107.200 H 107.400 C 107.455 107.200 107.500 107.155 107.500 107.100 V 99.200 C 107.500 99.100 107.400 99.200 107.500 99.200 H 110.400 C 110.455 99.200 110.500 99.155 110.500 99.100 V 93.100 C 110.500 93.045 110.455 93.000 110.400 93.000 H 107.500 C 107.400 93.000 107.500 93.100 107.500 93.000 V 87.200 C 107.500 87.100 107.400 87.200 107.500 87.200 H 110.400 C 110.455 87.200 110.500 87.155 110.500 87.100 V 81.100 C 110.500 81.045 110.455 81.000 110.400 81.000 H 107.500 C 107.400 81.000 107.500 81.100 107.500 81.000 V 75.200 C 107.500 75.100 107.400 75.200 107.500 75.200 H 110.400 C 110.455 75.200 110.500 75.155 110.500 75.100 V 69.100 C 110.500 69.045 110.455 69.000 110.400 69.000 H 107.500 C 107.400 69.000 107.500 69.100 107.500 69.000 V 63.200 C 107.500 63.100 107.400 63.200 107.500 63.200 H 110.400 C 110.455 63.200 110.500 63.155 110.500 63.100 V 57.100 C 110.500 57.045 110.455 57.000 110.400 57.000 H 107.500 C 107.400 57.000 107.500 57.100 107.500 57.000 V 51.200 C 107.500 51.100 107.400 51.200 107.500 51.200 H 110.400 C 110.455 51.200 110.500 51.155 110.500 51.100 V 45.100 C 110.500 45.045 110.455 45.000 110.400 45.000 H 107.500 C 107.400 45.000 107.500 45.100 107.500 45.000 V 39.200 C 107.500 39.100 107.400 39.200 107.500 39.200 H 110.400 C 110.455 39.200 110.500 39.155 110.500 39.100 V 33.100 C 110.500 33.045 110.455 33.000 110.400 33.000 H 107.500 C 107.400 33.000 107.500 33.100 107.500 33.000 V 27.200 C 107.500 27.100 107.400 27.200 107.500 27.200 H 110.400 C 110.455 27.200 110.500 27.155 110.500 27.100 V 21.100 C 110.500 21.045 110.455 21.000 110.400 21.000 H 107.500 C 107.400 21.000 107.500 21.100 107.500 21.000 V 13.100 C 107.500 13.045 107.455 13.000 107.400 13.000 H 99.500 C 99.400 13.000 99.500 13.100 99.500 13.000 V 10.100 C 99.500 10.045 99.455 10.000 99.400 10.000 H 93.400 C 93.345 10.000 93.300 10.045 93.300 10.100 V 13.000 C 93.300 13.100 93.400 13.000 93.300 13.000 H 87.500 C 87.400 13.000 87.500 13.100 87.500 13.000 V 10.100 C 87.500 10.045 87.455 10.000 87.400 10.000 H 81.400 C 81.345 10.000 81.300 10.045 81.300 10.100 V 13.000 C 81.300 13.100 81.400 13.000 81.300 13.000 H 75.500 C 75.400 13.000 75.500 13.100 75.500 13.000 V 10.100 C 75.500 10.045 75.455 10.000 75.400 10.000 H 69.400 C 69.345 10.000 69.300 10.045 69.300 10.100 V 13.000 C 69.300 13.100 69.400 13.000 69.300 13.000 H 63.500 C 63.400 13.000 63.500 13.100 63.500 13.000 V 10.100 C 63.500 10.045 63.455 10.000 63.400 10.000 H 57.400 C 57.345 10.000 57.300 10.045 57.300 10.100 V 13.000 C 57.300 13.100 57.400 13.000 57.300 13.000 H 51.500 C 51.400 13.000 51.500 13.100 51.500 13.000 V 10.100 C 51.500 10.045 51.455 10.000 51.400 10.000 H 45.400 C 45.345 10.000 45.300 10.045 45.300 10.100 V 13.000 C 45.300 13.100 45.400 13.000 45.300 13.000 H 39.500 C 39.400 13.000 39.500 13.100 39.500 13.000 V 10.100 C 39.500 10.045 39.455 10.000 39.400 10.000 H 33.400 C 33.345 10.000 33.300 10.045 33.300 10.100 V 13.000 C 33.300 13.100 33.400 13.000 33.300 13.000 H 27.500 C 27.400 13.000 27.500 13.100 27.500 13.000 V 10.100 C 27.500 10.045 27.455 10.000 27.400 10.000 H 21.400 C 21.345 10.000 21.300 10.045 21.300 10.100 V 13.000 C 21.300 13.100 21.400 13.000 21.300 13.000 H 13.400 C 13.345 13.000 13.300 13.045 13.300 13.100 V 21.000 C 13.300 21.100 13.400 21.000 13.300 21.000 H 10.400 C 10.345 21.000 10.300 21.045 10.300 21.100 V 27.100 C 10.300 27.155 10.345 27.200 10.400 27.200 H 13.300 C 13.400 27.200 13.300 27.100 13.300 27.200 V 33.000 C 13.300 33.100 13.400 33.000 13.300 33.000 H 10.400 C 10.345 33.000 10.300 33.045 10.300 33.100 V 39.100 C 10.300 39.155 10.345 39.200 10.400 39.200 H 13.300 C 13.400 39.200 13.300 39.100 13.300 39.200 V 45.000 C 13.300 45.100 13.400 45.000 13.300 45.000 H 10.400 C 10.345 45.000 10.300 45.045 10.300 45.100 V 51.100 C 10.300 51.155 10.345 51.200 10.400 51.200 H 13.300 C 13.400 51.200 13.300 51.100 13.300 51.200 V 57.000 C 13.300 57.100 13.400 57.000 13.300 57.000 H 10.400 C 10.345 57.000 10.300 57.045 10.300 57.100 V 63.100 C 10.300 63.155 10.345 63.200 10.400 63.200 H 13.300 C 13.400 63.200 13.300 63.100 13.300 63.200 V 69.000 C 13.300 69.100 13.400 69.000 13.300 69.000 H 10.400 C 10.345 69.000 10.300 69.045 10.300 69.100 V 75.100 C 10.300 75.155 10.345 75.200 10.400 75.200 H 13.300 C 13.400 75.200 13.300 75.100 13.300 75.200 V 81.000 C 13.300 81.100 13.400 81.000 13.300 81.000 H 10.400 C 10.345 81.000 10.300 81.045 10.300 81.100 V 87.100 C 10.300 87.155 10.345 87.200 10.400 87.200 H 13.300 C 13.400 87.200 13.300 87.100 13.300 87.200 V 93.000 C 13.300 93.100 13.400 93.000 13.300 93.000 H 10.400 C 10.345 93.000 10.300 93.045 10.300 93.100 V 99.100 C 10.300 99.155 10.345 99.200 10.400 99.200 H 13.300 C 13.400 99.200 13.300 99.100 13.300 99.200 V 107.100 C 13.300 107.155 13.345 107.200 13.400 107.200 Z"
       stroke="rgb(0,0,0)"
       stroke-width="0.20"
       id="path217" />
  </g>
  <g
     id="p-4"
     style="fill:none;stroke-linecap:round;stroke-linejoin:round;">
    <path
       d="M 126.100 310.400 H 123.200 C 123.100 310.400 123.200 310.500 123.200 310.400 V 307.600 C 123.200 307.500 123.100 307.600 123.200 307.600 H 129.000 C 129.100 307.600 129.000 307.500 129.000 307.600 V 310.400 C 129.000 310.500 129.100 310.400 129.000 310.400 H 126.100 Z"
       stroke="rgb(0,0,255)"
       stroke-width="0.20"
       id="path220" />
    <path
       d="M 138.100 310.400 H 135.200 C 135.100 310.400 135.200 310.500 135.200 310.400 V 307.600 C 135.200 307.500 135.100 307.600 135.200 307.600 H 141.000 C 141.100 307.600 141.000 307.500 141.000 307.600 V 310.400 C 141.000 310.500 141.100 310.400 141.000 310.400 H 138.100 Z"
       stroke="rgb(0,0,255)"
       stroke-width="0.20"
       id="path222" />
    <path
       d="M 150.100 310.400 H 147.200 C 147.100 310.400 147.200 310.500 147.200 310.400 V 307.600 C 147.200 307.500 147.100 307.600 147.200 307.600 H 153.000 C 153.100 307.600 153.000 307.500 153.000 307.600 V 310.400 C 153.000 310.500 153.100 310.400 153.000 310.400 H 150.100 Z"
       stroke="rgb(0,0,255)"
       stroke-width="0.20"
       id="path224" />
    <path
       d="M 162.100 310.400 H 159.200 C 159.100 310.400 159.200 310.500 159.200 310.400 V 307.600 C 159.200 307.500 159.100 307.600 159.200 307.600 H 165.000 C 165.100 307.600 165.000 307.500 165.000 307.600 V 310.400 C 165.000 310.500 165.100 310.400 165.000 310.400 H 162.100 Z"
       stroke="rgb(0,0,255)"
       stroke-width="0.20"
       id="path226" />
    <path
       d="M 174.100 310.400 H 171.200 C 171.100 310.400 171.200 310.500 171.200 310.400 V 307.600 C 171.200 307.500 171.100 307.600 171.200 307.600 H 177.000 C 177.100 307.600 177.000 307.500 177.000 307.600 V 310.400 C 177.000 310.500 177.100 310.400 177.000 310.400 H 174.100 Z"
       stroke="rgb(0,0,255)"
       stroke-width="0.20"
       id="path228" />
    <path
       d="M 186.100 310.400 H 183.200 C 183.100 310.400 183.200 310.500 183.200 310.400 V 307.600 C 183.200 307.500 183.100 307.600 183.200 307.600 H 189.000 C 189.100 307.600 189.000 307.500 189.000 307.600 V 310.400 C 189.000 310.500 189.100 310.400 189.000 310.400 H 186.100 Z"
       stroke="rgb(0,0,255)"
       stroke-width="0.20"
       id="path230" />
    <path
       d="M 198.100 310.400 H 195.200 C 195.100 310.400 195.200 310.500 195.200 310.400 V 307.600 C 195.200 307.500 195.100 307.600 195.200 307.600 H 201.000 C 201.100 307.600 201.000 307.500 201.000 307.600 V 310.400 C 201.000 310.500 201.100 310.400 201.000 310.400 H 198.100 Z"
       stroke="rgb(0,0,255)"
       stroke-width="0.20"
       id="path232" />
    <path
       d="M 115.100 313.600 H 209.100 C 209.155 313.600 209.200 313.555 209.200 313.500 V 302.600 C 209.200 302.500 209.100 302.600 209.200 302.600 H 212.100 C 212.155 302.600 212.200 302.555 212.200 302.500 V 296.500 C 212.200 296.445 212.155 296.400 212.100 296.400 H 209.200 C 209.100 296.400 209.200 296.500 209.200 296.400 V 290.600 C 209.200 290.500 209.100 290.600 209.200 290.600 H 212.100 C 212.155 290.600 212.200 290.555 212.200 290.500 V 284.500 C 212.200 284.445 212.155 284.400 212.100 284.400 H 209.200 C 209.100 284.400 209.200 284.500 209.200 284.400 V 278.600 C 209.200 278.500 209.100 278.600 209.200 278.600 H 212.100 C 212.155 278.600 212.200 278.555 212.200 278.500 V 272.500 C 212.200 272.445 212.155 272.400 212.100 272.400 H 209.200 C 209.100 272.400 209.200 272.500 209.200 272.400 V 266.600 C 209.200 266.500 209.100 266.600 209.200 266.600 H 212.100 C 212.155 266.600 212.200 266.555 212.200 266.500 V 260.500 C 212.200 260.445 212.155 260.400 212.100 260.400 H 209.200 C 209.100 260.400 209.200 260.500 209.200 260.400 V 254.600 C 209.200 254.500 209.100 254.600 209.200 254.600 H 212.100 C 212.155 254.600 212.200 254.555 212.200 254.500 V 248.500 C 212.200 248.445 212.155 248.400 212.100 248.400 H 209.200 C 209.100 248.400 209.200 248.500 209.200 248.400 V 242.600 C 209.200 242.500 209.100 242.600 209.200 242.600 H 212.100 C 212.155 242.600 212.200 242.555 212.200 242.500 V 236.500 C 212.200 236.445 212.155 236.400 212.100 236.400 H 209.200 C 209.100 236.400 209.200 236.500 209.200 236.400 V 230.600 C 209.200 230.500 209.100 230.600 209.200 230.600 H 212.100 C 212.155 230.600 212.200 230.555 212.200 230.500 V 224.500 C 212.200 224.445 212.155 224.400 212.100 224.400 H 209.200 C 209.100 224.400 209.200 224.500 209.200 224.400 V 213.500 C 209.200 213.445 209.155 213.400 209.100 213.400 H 115.100 C 115.045 213.400 115.000 213.445 115.000 213.500 V 224.400 C 115.000 224.500 115.100 224.400 115.000 224.400 H 112.100 C 112.045 224.400 112.000 224.445 112.000 224.500 V 230.500 C 112.000 230.555 112.045 230.600 112.100 230.600 H 115.000 C 115.100 230.600 115.000 230.500 115.000 230.600 V 236.400 C 115.000 236.500 115.100 236.400 115.000 236.400 H 112.100 C 112.045 236.400 112.000 236.445 112.000 236.500 V 242.500 C 112.000 242.555 112.045 242.600 112.100 242.600 H 115.000 C 115.100 242.600 115.000 242.500 115.000 242.600 V 248.400 C 115.000 248.500 115.100 248.400 115.000 248.400 H 112.100 C 112.045 248.400 112.000 248.445 112.000 248.500 V 254.500 C 112.000 254.555 112.045 254.600 112.100 254.600 H 115.000 C 115.100 254.600 115.000 254.500 115.000 254.600 V 260.400 C 115.000 260.500 115.100 260.400 115.000 260.400 H 112.100 C 112.045 260.400 112.000 260.445 112.000 260.500 V 266.500 C 112.000 266.555 112.045 266.600 112.100 266.600 H 115.000 C 115.100 266.600 115.000 266.500 115.000 266.600 V 272.400 C 115.000 272.500 115.100 272.400 115.000 272.400 H 112.100 C 112.045 272.400 112.000 272.445 112.000 272.500 V 278.500 C 112.000 278.555 112.045 278.600 112.100 278.600 H 115.000 C 115.100 278.600 115.000 278.500 115.000 278.600 V 284.400 C 115.000 284.500 115.100 284.400 115.000 284.400 H 112.100 C 112.045 284.400 112.000 284.445 112.000 284.500 V 290.500 C 112.000 290.555 112.045 290.600 112.100 290.600 H 115.000 C 115.100 290.600 115.000 290.500 115.000 290.600 V 296.400 C 115.000 296.500 115.100 296.400 115.000 296.400 H 112.100 C 112.045 296.400 112.000 296.445 112.000 296.500 V 302.500 C 112.000 302.555 112.045 302.600 112.100 302.600 H 115.000 C 115.100 302.600 115.000 302.500 115.000 302.600 V 313.500 C 115.000 313.555 115.045 313.600 115.100 313.600 Z"
       stroke="rgb(0,0,0)"
       stroke-width="0.20"
       id="path234" />
  </g>
  <g
     id="p-5"
     style="fill:none;stroke-linecap:round;stroke-linejoin:round;">
    <path
       d="M 126.100 208.700 H 123.200 C 123.100 208.700 123.200 208.800 123.200 208.700 V 205.900 C 123.200 205.800 123.100 205.900 123.200 205.900 H 129.000 C 129.100 205.900 129.000 205.800 129.000 205.900 V 208.700 C 129.000 208.800 129.100 208.700 129.000 208.700 H 126.100 Z"
       stroke="rgb(0,0,255)"
       stroke-width="0.20"
       id="path237" />
    <path
       d="M 138.100 208.700 H 135.200 C 135.100 208.700 135.200 208.800 135.200 208.700 V 205.900 C 135.200 205.800 135.100 205.900 135.200 205.900 H 141.000 C 141.100 205.900 141.000 205.800 141.000 205.900 V 208.700 C 141.000 208.800 141.100 208.700 141.000 208.700 H 138.100 Z"
       stroke="rgb(0,0,255)"
       stroke-width="0.20"
       id="path239" />
    <path
       d="M 150.100 208.700 H 147.200 C 147.100 208.700 147.200 208.800 147.200 208.700 V 205.900 C 147.200 205.800 147.100 205.900 147.200 205.900 H 153.000 C 153.100 205.900 153.000 205.800 153.000 205.900 V 208.700 C 153.000 208.800 153.100 208.700 153.000 208.700 H 150.100 Z"
       stroke="rgb(0,0,255)"
       stroke-width="0.20"
       id="path241" />
    <path
       d="M 162.100 208.700 H 159.200 C 159.100 208.700 159.200 208.800 159.200 208.700 V 205.900 C 159.200 205.800 159.100 205.900 159.200 205.900 H 165.000 C 165.100 205.900 165.000 205.800 165.000 205.900 V 208.700 C 165.000 208.800 165.100 208.700 165.000 208.700 H 162.100 Z"
       stroke="rgb(0,0,255)"
       stroke-width="0.20"
       id="path243" />
    <path
       d="M 174.100 208.700 H 171.200 C 171.100 208.700 171.200 208.800 171.200 208.700 V 205.900 C 171.200 205.800 171.100 205.900 171.200 205.900 H 177.000 C 177.100 205.900 177.000 205.800 177.000 205.900 V 208.700 C 177.000 208.800 177.100 208.700 177.000 208.700 H 174.100 Z"
       stroke="rgb(0,0,255)"
       stroke-width="0.20"
       id="path245" />
    <path
       d="M 186.100 208.700 H 183.200 C 183.100 208.700 183.200 208.800 183.200 208.700 V 205.900 C 183.200 205.800 183.100 205.900 183.200 205.900 H 189.000 C 189.100 205.900 189.000 205.800 189.000 205.900 V 208.700 C 189.000 208.800 189.100 208.700 189.000 208.700 H 186.100 Z"
       stroke="rgb(0,0,255)"
       stroke-width="0.20"
       id="path247" />
    <path
       d="M 198.100 208.700 H 195.200 C 195.100 208.700 195.200 208.800 195.200 208.700 V 205.900 C 195.200 205.800 195.100 205.900 195.200 205.900 H 201.000 C 201.100 205.900 201.000 205.800 201.000 205.900 V 208.700 C 201.000 208.800 201.100 208.700 201.000 208.700 H 198.100 Z"
       stroke="rgb(0,0,255)"
       stroke-width="0.20"
       id="path249" />
    <path
       d="M 115.100 211.900 H 209.100 C 209.155 211.900 209.200 211.855 209.200 211.800 V 200.900 C 209.200 200.800 209.100 200.900 209.200 200.900 H 212.100 C 212.155 200.900 212.200 200.855 212.200 200.800 V 194.800 C 212.200 194.745 212.155 194.700 212.100 194.700 H 209.200 C 209.100 194.700 209.200 194.800 209.200 194.700 V 188.900 C 209.200 188.800 209.100 188.900 209.200 188.900 H 212.100 C 212.155 188.900 212.200 188.855 212.200 188.800 V 182.800 C 212.200 182.745 212.155 182.700 212.100 182.700 H 209.200 C 209.100 182.700 209.200 182.800 209.200 182.700 V 176.900 C 209.200 176.800 209.100 176.900 209.200 176.900 H 212.100 C 212.155 176.900 212.200 176.855 212.200 176.800 V 170.800 C 212.200 170.745 212.155 170.700 212.100 170.700 H 209.200 C 209.100 170.700 209.200 170.800 209.200 170.700 V 164.900 C 209.200 164.800 209.100 164.900 209.200 164.900 H 212.100 C 212.155 164.900 212.200 164.855 212.200 164.800 V 158.800 C 212.200 158.745 212.155 158.700 212.100 158.700 H 209.200 C 209.100 158.700 209.200 158.800 209.200 158.700 V 152.900 C 209.200 152.800 209.100 152.900 209.200 152.900 H 212.100 C 212.155 152.900 212.200 152.855 212.200 152.800 V 146.800 C 212.200 146.745 212.155 146.700 212.100 146.700 H 209.200 C 209.100 146.700 209.200 146.800 209.200 146.700 V 140.900 C 209.200 140.800 209.100 140.900 209.200 140.900 H 212.100 C 212.155 140.900 212.200 140.855 212.200 140.800 V 134.800 C 212.200 134.745 212.155 134.700 212.100 134.700 H 209.200 C 209.100 134.700 209.200 134.800 209.200 134.700 V 128.900 C 209.200 128.800 209.100 128.900 209.200 128.900 H 212.100 C 212.155 128.900 212.200 128.855 212.200 128.800 V 122.800 C 212.200 122.745 212.155 122.700 212.100 122.700 H 209.200 C 209.100 122.700 209.200 122.800 209.200 122.700 V 111.800 C 209.200 111.745 209.155 111.700 209.100 111.700 H 115.100 C 115.045 111.700 115.000 111.745 115.000 111.800 V 122.700 C 115.000 122.800 115.100 122.700 115.000 122.700 H 112.100 C 112.045 122.700 112.000 122.745 112.000 122.800 V 128.800 C 112.000 128.855 112.045 128.900 112.100 128.900 H 115.000 C 115.100 128.900 115.000 128.800 115.000 128.900 V 134.700 C 115.000 134.800 115.100 134.700 115.000 134.700 H 112.100 C 112.045 134.700 112.000 134.745 112.000 134.800 V 140.800 C 112.000 140.855 112.045 140.900 112.100 140.900 H 115.000 C 115.100 140.900 115.000 140.800 115.000 140.900 V 146.700 C 115.000 146.800 115.100 146.700 115.000 146.700 H 112.100 C 112.045 146.700 112.000 146.745 112.000 146.800 V 152.800 C 112.000 152.855 112.045 152.900 112.100 152.900 H 115.000 C 115.100 152.900 115.000 152.800 115.000 152.900 V 158.700 C 115.000 158.800 115.100 158.700 115.000 158.700 H 112.100 C 112.045 158.700 112.000 158.745 112.000 158.800 V 164.800 C 112.000 164.855 112.045 164.900 112.100 164.900 H 115.000 C 115.100 164.900 115.000 164.800 115.000 164.900 V 170.700 C 115.000 170.800 115.100 170.700 115.000 170.700 H 112.100 C 112.045 170.700 112.000 170.745 112.000 170.800 V 176.800 C 112.000 176.855 112.045 176.900 112.100 176.900 H 115.000 C 115.100 176.900 115.000 176.800 115.000 176.900 V 182.700 C 115.000 182.800 115.100 182.700 115.000 182.700 H 112.100 C 112.045 182.700 112.000 182.745 112.000 182.800 V 188.800 C 112.000 188.855 112.045 188.900 112.100 188.900 H 115.000 C 115.100 188.900 115.000 188.800 115.000 188.900 V 194.700 C 115.000 194.800 115.100 194.700 115.000 194.700 H 112.100 C 112.045 194.700 112.000 194.745 112.000 194.800 V 200.800 C 112.000 200.855 112.045 200.900 112.100 200.900 H 115.000 C 115.100 200.900 115.000 200.800 115.000 200.900 V 211.800 C 115.000 211.855 115.045 211.900 115.100 211.900 Z"
       stroke="rgb(0,0,0)"
       stroke-width="0.20"
       id="path251" />
  </g>
  <ellipse
     style="fill:none;stroke-width:0.264583;fill-opacity:1"
     id="path416"
     cx="59.672028"
     cy="62.513561"
     rx="32.67754"
     ry="31.256779" />
  <ellipse
     style="fill:none;fill-opacity:1;stroke-width:0.264583"
     id="path4254"
     cx="59.672031"
     cy="66.06546"
     rx="22.732203"
     ry="24.863346" />
  <ellipse
     style="fill:none;fill-opacity:1;stroke-width:0.264583"
     id="path4256"
     cx="65.35508"
     cy="58.25127"
     rx="18.469913"
     ry="25.573727" />
  <ellipse
     style="fill:#000000;fill-opacity:0;stroke-width:0.264583;stroke:#000000;stroke-opacity:1"
     id="path4258"
     cx="56.120125"
     cy="61.803177"
     rx="26.284109"
     ry="27.704872" />
</svg>
