M48
; DRILL file {KiCad 5.1.8-5.1.8} date Thu Mar  4 14:51:32 2021
; FORMAT={-:-/ absolute / metric / decimal}
; #@! TF.CreationDate,2021-03-04T14:51:32+01:00
; #@! TF.GenerationSoftware,Kicad,Pcbnew,5.1.8-5.1.8
FMAT,2
METRIC
%
G90
G05
T0
M30
