EESchema Schematic File Version 4
EELAYER 30 0
EELAYER END
$Descr A4 11693 8268
encoding utf-8
Sheet 1 1
Title ""
Date ""
Rev ""
Comp ""
Comment1 ""
Comment2 ""
Comment3 ""
Comment4 ""
$EndDescr
$Comp
L fab:ATSAMD11C14A-SS U2
U 1 1 6040D852
P 5300 3900
F 0 "U2" H 4900 4600 50  0000 C CNN
F 1 "ATSAMD11C14A-SS" H 5750 4550 50  0000 C CNN
F 2 "fab:SOIC-14_3.9x8.7mm_P1.27mm" H 5300 2850 50  0001 C CNN
F 3 "" H 5300 3200 50  0001 C CNN
	1    5300 3900
	1    0    0    -1  
$EndComp
$Comp
L fab:USB_A_PLUG J1
U 1 1 6040E26B
P 1350 2150
F 0 "J1" V 757 1892 60  0000 C CNN
F 1 "USB_A_PLUG" V 863 1892 60  0000 C CNN
F 2 "fab:fab-USB_A_male_plug" V 969 1892 60  0000 C CNN
F 3 "" H 1350 2150 60  0000 C CNN
	1    1350 2150
	0    -1   1    0   
$EndComp
$Comp
L fab:Regulator_Linear_ZLDO1117-3.3V-1A U1
U 1 1 6040E79B
P 2950 1950
F 0 "U1" H 2950 2192 50  0000 C CNN
F 1 "ZLDO1117-3.3V-1A" H 2950 2101 50  0000 C CNN
F 2 "fab:SOT-223-3_TabPin2" H 2950 2150 50  0001 C CNN
F 3 "http://www.diodes.com/datasheets/AP1117.pdf" H 3050 1700 50  0001 C CNN
	1    2950 1950
	1    0    0    -1  
$EndComp
$Comp
L fab:LED D1
U 1 1 6040F075
P 4350 2150
F 0 "D1" V 4389 2032 50  0000 R CNN
F 1 "POWER_LED" V 4298 2032 50  0000 R CNN
F 2 "fab:LED_1206" H 4350 2150 50  0001 C CNN
F 3 "https://optoelectronics.liteon.com/upload/download/DS-22-98-0002/LTST-C150CKT.pdf" H 4350 2150 50  0001 C CNN
	1    4350 2150
	0    -1   -1   0   
$EndComp
$Comp
L fab:R R1
U 1 1 6040F9FD
P 4000 1950
F 0 "R1" V 3793 1950 50  0000 C CNN
F 1 "R" V 3884 1950 50  0000 C CNN
F 2 "fab:R_1206" V 3930 1950 50  0001 C CNN
F 3 "~" H 4000 1950 50  0001 C CNN
	1    4000 1950
	0    1    1    0   
$EndComp
$Comp
L power:+5V #PWR0101
U 1 1 604126D3
P 2350 1800
F 0 "#PWR0101" H 2350 1650 50  0001 C CNN
F 1 "+5V" H 2365 1973 50  0000 C CNN
F 2 "" H 2350 1800 50  0001 C CNN
F 3 "" H 2350 1800 50  0001 C CNN
	1    2350 1800
	1    0    0    -1  
$EndComp
$Comp
L power:GND #PWR0102
U 1 1 60413162
P 2350 2550
F 0 "#PWR0102" H 2350 2300 50  0001 C CNN
F 1 "GND" H 2355 2377 50  0000 C CNN
F 2 "" H 2350 2550 50  0001 C CNN
F 3 "" H 2350 2550 50  0001 C CNN
	1    2350 2550
	1    0    0    -1  
$EndComp
Wire Wire Line
	2050 1950 2350 1950
Wire Wire Line
	2350 1950 2350 1800
Wire Wire Line
	2050 2400 2350 2400
Wire Wire Line
	2350 2400 2350 2550
Text GLabel 2050 2250 2    50   Input ~ 0
D+
Text GLabel 2050 2100 2    50   Input ~ 0
D-
Wire Wire Line
	2350 1950 2650 1950
Connection ~ 2350 1950
$Comp
L fab:C C1
U 1 1 60414FD2
P 2350 2200
F 0 "C1" H 2465 2246 50  0000 L CNN
F 1 "C" H 2465 2155 50  0000 L CNN
F 2 "fab:C_1206" H 2388 2050 50  0001 C CNN
F 3 "" H 2350 2200 50  0001 C CNN
	1    2350 2200
	1    0    0    -1  
$EndComp
Wire Wire Line
	2350 2050 2350 1950
Wire Wire Line
	2350 2400 2350 2350
Connection ~ 2350 2400
Wire Wire Line
	2350 2400 2950 2400
Wire Wire Line
	2950 2400 2950 2250
$Comp
L fab:C C2
U 1 1 604168D7
P 3600 2200
F 0 "C2" H 3715 2246 50  0000 L CNN
F 1 "C" H 3715 2155 50  0000 L CNN
F 2 "fab:C_1206" H 3638 2050 50  0001 C CNN
F 3 "" H 3600 2200 50  0001 C CNN
	1    3600 2200
	1    0    0    -1  
$EndComp
Wire Wire Line
	3250 1950 3600 1950
Wire Wire Line
	3600 1950 3600 2050
Wire Wire Line
	2950 2400 3600 2400
Wire Wire Line
	3600 2400 3600 2350
Connection ~ 2950 2400
$Comp
L power:+3.3V #PWR0103
U 1 1 604175FA
P 3600 1800
F 0 "#PWR0103" H 3600 1650 50  0001 C CNN
F 1 "+3.3V" H 3615 1973 50  0000 C CNN
F 2 "" H 3600 1800 50  0001 C CNN
F 3 "" H 3600 1800 50  0001 C CNN
	1    3600 1800
	1    0    0    -1  
$EndComp
Wire Wire Line
	3600 1950 3600 1800
Connection ~ 3600 1950
$Comp
L power:+3.3V #PWR0104
U 1 1 60418542
P 5300 3200
F 0 "#PWR0104" H 5300 3050 50  0001 C CNN
F 1 "+3.3V" H 5315 3373 50  0000 C CNN
F 2 "" H 5300 3200 50  0001 C CNN
F 3 "" H 5300 3200 50  0001 C CNN
	1    5300 3200
	1    0    0    -1  
$EndComp
$Comp
L power:GND #PWR0105
U 1 1 604196BD
P 5300 4600
F 0 "#PWR0105" H 5300 4350 50  0001 C CNN
F 1 "GND" H 5305 4427 50  0000 C CNN
F 2 "" H 5300 4600 50  0001 C CNN
F 3 "" H 5300 4600 50  0001 C CNN
	1    5300 4600
	1    0    0    -1  
$EndComp
Wire Wire Line
	3600 1950 3850 1950
Wire Wire Line
	4150 1950 4350 1950
Wire Wire Line
	4350 1950 4350 2000
Wire Wire Line
	4350 2300 4350 2400
Wire Wire Line
	4350 2400 3600 2400
Connection ~ 3600 2400
Text GLabel 5800 4200 2    50   Input ~ 0
D+
Text GLabel 5800 4100 2    50   Input ~ 0
D-
NoConn ~ 4800 3600
$Comp
L fab:Conn_01x06_Male J2
U 1 1 60420C37
P 7750 4500
F 0 "J2" H 7722 4382 50  0000 R CNN
F 1 "GP2" H 7722 4473 50  0000 R CNN
F 2 "Pin_Headers:Pin_Header_Straight_1x06_Pitch2.54mm_SMD_Pin1Left" H 7750 4500 50  0001 C CNN
F 3 "~" H 7750 4500 50  0001 C CNN
	1    7750 4500
	1    0    0    1   
$EndComp
Text GLabel 5800 3800 2    50   Input ~ 0
PA05
Text GLabel 5800 3900 2    50   Input ~ 0
PA14
Text GLabel 5800 4000 2    50   Input ~ 0
PA15
Text GLabel 5800 3700 2    50   Input ~ 0
PA04
Text GLabel 5800 3600 2    50   Input ~ 0
PA02
Text GLabel 4800 3800 0    50   Input ~ 0
PA30
Text GLabel 4800 3900 0    50   Input ~ 0
PA31
Text GLabel 4800 4100 0    50   Input ~ 0
PA08
Text GLabel 4800 4200 0    50   Input ~ 0
PA09
Text GLabel 7950 4700 2    50   Input ~ 0
PA30
Text GLabel 8550 4600 2    50   Input ~ 0
PA15
Text GLabel 7950 4500 2    50   Input ~ 0
PA14
Text GLabel 7950 4400 2    50   Input ~ 0
PA09
Text GLabel 7950 4300 2    50   Input ~ 0
PA08
Text GLabel 8350 4200 2    50   Input ~ 0
PA05
$Comp
L fab:Conn_01x06_Male J3
U 1 1 604287F5
P 7250 4500
F 0 "J3" H 7222 4382 50  0000 R CNN
F 1 "GP1" H 7222 4473 50  0000 R CNN
F 2 "Pin_Headers:Pin_Header_Straight_1x06_Pitch2.54mm_SMD_Pin1Left" H 7250 4500 50  0001 C CNN
F 3 "~" H 7250 4500 50  0001 C CNN
	1    7250 4500
	-1   0    0    1   
$EndComp
Text GLabel 7050 4700 0    50   Input ~ 0
PA31
$Comp
L power:GND #PWR0106
U 1 1 6042F253
P 6600 4750
F 0 "#PWR0106" H 6600 4500 50  0001 C CNN
F 1 "GND" H 6605 4577 50  0000 C CNN
F 2 "" H 6600 4750 50  0001 C CNN
F 3 "" H 6600 4750 50  0001 C CNN
	1    6600 4750
	1    0    0    -1  
$EndComp
Wire Wire Line
	7050 4600 6600 4600
Wire Wire Line
	6600 4600 6600 4750
$Comp
L power:+3.3V #PWR0107
U 1 1 6042FB77
P 6600 4050
F 0 "#PWR0107" H 6600 3900 50  0001 C CNN
F 1 "+3.3V" H 6615 4223 50  0000 C CNN
F 2 "" H 6600 4050 50  0001 C CNN
F 3 "" H 6600 4050 50  0001 C CNN
	1    6600 4050
	1    0    0    -1  
$EndComp
Wire Wire Line
	7050 4500 6600 4500
Wire Wire Line
	6600 4500 6600 4050
Text GLabel 7050 4400 0    50   Input ~ 0
PA02
Text GLabel 7050 4300 0    50   Input ~ 0
PA04
$Comp
L power:+5V #PWR0108
U 1 1 6043199D
P 6950 4100
F 0 "#PWR0108" H 6950 3950 50  0001 C CNN
F 1 "+5V" H 6965 4273 50  0000 C CNN
F 2 "" H 6950 4100 50  0001 C CNN
F 3 "" H 6950 4100 50  0001 C CNN
	1    6950 4100
	1    0    0    -1  
$EndComp
Wire Wire Line
	7050 4200 6950 4200
Wire Wire Line
	6950 4200 6950 4100
$Comp
L fab:R R2
U 1 1 604352A0
P 8150 4200
F 0 "R2" V 7950 4300 50  0000 C CNN
F 1 "R" V 8034 4200 50  0000 C CNN
F 2 "fab:R_1206" V 8080 4200 50  0001 C CNN
F 3 "~" H 8150 4200 50  0001 C CNN
	1    8150 4200
	0    1    1    0   
$EndComp
Wire Wire Line
	7950 4200 8000 4200
Wire Wire Line
	8300 4200 8350 4200
$Comp
L fab:R R3
U 1 1 6043BDA6
P 8350 4800
F 0 "R3" H 8280 4754 50  0000 R CNN
F 1 "R" H 8280 4845 50  0000 R CNN
F 2 "fab:R_1206" V 8280 4800 50  0001 C CNN
F 3 "~" H 8350 4800 50  0001 C CNN
	1    8350 4800
	-1   0    0    1   
$EndComp
Wire Wire Line
	8550 4600 8350 4600
Wire Wire Line
	8350 4650 8350 4600
Connection ~ 8350 4600
Wire Wire Line
	8350 4600 7950 4600
$Comp
L fab:LED D2
U 1 1 6043D645
P 8350 5100
F 0 "D2" V 8389 4982 50  0000 R CNN
F 1 "BUILTIN_LED" V 8298 4982 50  0000 R CNN
F 2 "fab:LED_1206" H 8350 5100 50  0001 C CNN
F 3 "https://optoelectronics.liteon.com/upload/download/DS-22-98-0002/LTST-C150CKT.pdf" H 8350 5100 50  0001 C CNN
	1    8350 5100
	0    -1   -1   0   
$EndComp
$Comp
L power:GND #PWR0109
U 1 1 6043E2AC
P 8350 5250
F 0 "#PWR0109" H 8350 5000 50  0001 C CNN
F 1 "GND" H 8355 5077 50  0000 C CNN
F 2 "" H 8350 5250 50  0001 C CNN
F 3 "" H 8350 5250 50  0001 C CNN
	1    8350 5250
	1    0    0    -1  
$EndComp
$EndSCHEMATC
