<svg xmlns="http://www.w3.org/2000/svg" version="1.1" width="100mm" height="100mm" viewBox="0 0 100 100">
<g stroke="black">
	<path d="M 5,5 H 23.571428571428573"></path>
	<path d="M 33.57142857142857,5 H 52.142857142857146"></path>
	<path d="M 62.142857142857146,5 H 80.71428571428572"></path>
	<path d="M 90.71428571428572,5 H 100"></path>
	<g transform="translate(100,0)scale(-1,1)">
	<path d="M 5,7.5 H 23.571428571428573"></path>
	<path d="M 33.57142857142857,7.5 H 52.142857142857146"></path>
	<path d="M 62.142857142857146,7.5 H 80.71428571428572"></path>
	<path d="M 90.71428571428572,7.5 H 100"></path>
	</g>
	<path d="M 5,10 H 23.571428571428573"></path>
	<path d="M 33.57142857142857,10 H 52.142857142857146"></path>
	<path d="M 62.142857142857146,10 H 80.71428571428572"></path>
	<path d="M 90.71428571428572,10 H 100"></path>
	<g transform="translate(100,0)scale(-1,1)">
	<path d="M 5,12.5 H 23.571428571428573"></path>
	<path d="M 33.57142857142857,12.5 H 52.142857142857146"></path>
	<path d="M 62.142857142857146,12.5 H 80.71428571428572"></path>
	<path d="M 90.71428571428572,12.5 H 100"></path>
	</g>
	<path d="M 5,15 H 23.571428571428573"></path>
	<path d="M 33.57142857142857,15 H 52.142857142857146"></path>
	<path d="M 62.142857142857146,15 H 80.71428571428572"></path>
	<path d="M 90.71428571428572,15 H 100"></path>
	<g transform="translate(100,0)scale(-1,1)">
	<path d="M 5,17.5 H 23.571428571428573"></path>
	<path d="M 33.57142857142857,17.5 H 52.142857142857146"></path>
	<path d="M 62.142857142857146,17.5 H 80.71428571428572"></path>
	<path d="M 90.71428571428572,17.5 H 100"></path>
	</g>
	<path d="M 5,20 H 23.571428571428573"></path>
	<path d="M 33.57142857142857,20 H 52.142857142857146"></path>
	<path d="M 62.142857142857146,20 H 80.71428571428572"></path>
	<path d="M 90.71428571428572,20 H 100"></path>
	<g transform="translate(100,0)scale(-1,1)">
	<path d="M 5,22.5 H 23.571428571428573"></path>
	<path d="M 33.57142857142857,22.5 H 52.142857142857146"></path>
	<path d="M 62.142857142857146,22.5 H 80.71428571428572"></path>
	<path d="M 90.71428571428572,22.5 H 100"></path>
	</g>
	<path d="M 5,25 H 23.571428571428573"></path>
	<path d="M 33.57142857142857,25 H 52.142857142857146"></path>
	<path d="M 62.142857142857146,25 H 80.71428571428572"></path>
	<path d="M 90.71428571428572,25 H 100"></path>
	<g transform="translate(100,0)scale(-1,1)">
	<path d="M 5,27.5 H 23.571428571428573"></path>
	<path d="M 33.57142857142857,27.5 H 52.142857142857146"></path>
	<path d="M 62.142857142857146,27.5 H 80.71428571428572"></path>
	<path d="M 90.71428571428572,27.5 H 100"></path>
	</g>
	<path d="M 5,30 H 23.571428571428573"></path>
	<path d="M 33.57142857142857,30 H 52.142857142857146"></path>
	<path d="M 62.142857142857146,30 H 80.71428571428572"></path>
	<path d="M 90.71428571428572,30 H 100"></path>
	<g transform="translate(100,0)scale(-1,1)">
	<path d="M 5,32.5 H 23.571428571428573"></path>
	<path d="M 33.57142857142857,32.5 H 52.142857142857146"></path>
	<path d="M 62.142857142857146,32.5 H 80.71428571428572"></path>
	<path d="M 90.71428571428572,32.5 H 100"></path>
	</g>
	<path d="M 5,35 H 23.571428571428573"></path>
	<path d="M 33.57142857142857,35 H 52.142857142857146"></path>
	<path d="M 62.142857142857146,35 H 80.71428571428572"></path>
	<path d="M 90.71428571428572,35 H 100"></path>
	<g transform="translate(100,0)scale(-1,1)">
	<path d="M 5,37.5 H 23.571428571428573"></path>
	<path d="M 33.57142857142857,37.5 H 52.142857142857146"></path>
	<path d="M 62.142857142857146,37.5 H 80.71428571428572"></path>
	<path d="M 90.71428571428572,37.5 H 100"></path>
	</g>
	<path d="M 5,40 H 23.571428571428573"></path>
	<path d="M 33.57142857142857,40 H 52.142857142857146"></path>
	<path d="M 62.142857142857146,40 H 80.71428571428572"></path>
	<path d="M 90.71428571428572,40 H 100"></path>
	<g transform="translate(100,0)scale(-1,1)">
	<path d="M 5,42.5 H 23.571428571428573"></path>
	<path d="M 33.57142857142857,42.5 H 52.142857142857146"></path>
	<path d="M 62.142857142857146,42.5 H 80.71428571428572"></path>
	<path d="M 90.71428571428572,42.5 H 100"></path>
	</g>
	<path d="M 5,45 H 23.571428571428573"></path>
	<path d="M 33.57142857142857,45 H 52.142857142857146"></path>
	<path d="M 62.142857142857146,45 H 80.71428571428572"></path>
	<path d="M 90.71428571428572,45 H 100"></path>
	<g transform="translate(100,0)scale(-1,1)">
	<path d="M 5,47.5 H 23.571428571428573"></path>
	<path d="M 33.57142857142857,47.5 H 52.142857142857146"></path>
	<path d="M 62.142857142857146,47.5 H 80.71428571428572"></path>
	<path d="M 90.71428571428572,47.5 H 100"></path>
	</g>
	<path d="M 5,50 H 23.571428571428573"></path>
	<path d="M 33.57142857142857,50 H 52.142857142857146"></path>
	<path d="M 62.142857142857146,50 H 80.71428571428572"></path>
	<path d="M 90.71428571428572,50 H 100"></path>
	<g transform="translate(100,0)scale(-1,1)">
	<path d="M 5,52.5 H 23.571428571428573"></path>
	<path d="M 33.57142857142857,52.5 H 52.142857142857146"></path>
	<path d="M 62.142857142857146,52.5 H 80.71428571428572"></path>
	<path d="M 90.71428571428572,52.5 H 100"></path>
	</g>
	<path d="M 5,55 H 23.571428571428573"></path>
	<path d="M 33.57142857142857,55 H 52.142857142857146"></path>
	<path d="M 62.142857142857146,55 H 80.71428571428572"></path>
	<path d="M 90.71428571428572,55 H 100"></path>
	<g transform="translate(100,0)scale(-1,1)">
	<path d="M 5,57.5 H 23.571428571428573"></path>
	<path d="M 33.57142857142857,57.5 H 52.142857142857146"></path>
	<path d="M 62.142857142857146,57.5 H 80.71428571428572"></path>
	<path d="M 90.71428571428572,57.5 H 100"></path>
	</g>
	<path d="M 5,60 H 23.571428571428573"></path>
	<path d="M 33.57142857142857,60 H 52.142857142857146"></path>
	<path d="M 62.142857142857146,60 H 80.71428571428572"></path>
	<path d="M 90.71428571428572,60 H 100"></path>
	<g transform="translate(100,0)scale(-1,1)">
	<path d="M 5,62.5 H 23.571428571428573"></path>
	<path d="M 33.57142857142857,62.5 H 52.142857142857146"></path>
	<path d="M 62.142857142857146,62.5 H 80.71428571428572"></path>
	<path d="M 90.71428571428572,62.5 H 100"></path>
	</g>
	<path d="M 5,65 H 23.571428571428573"></path>
	<path d="M 33.57142857142857,65 H 52.142857142857146"></path>
	<path d="M 62.142857142857146,65 H 80.71428571428572"></path>
	<path d="M 90.71428571428572,65 H 100"></path>
	<g transform="translate(100,0)scale(-1,1)">
	<path d="M 5,67.5 H 23.571428571428573"></path>
	<path d="M 33.57142857142857,67.5 H 52.142857142857146"></path>
	<path d="M 62.142857142857146,67.5 H 80.71428571428572"></path>
	<path d="M 90.71428571428572,67.5 H 100"></path>
	</g>
	<path d="M 5,70 H 23.571428571428573"></path>
	<path d="M 33.57142857142857,70 H 52.142857142857146"></path>
	<path d="M 62.142857142857146,70 H 80.71428571428572"></path>
	<path d="M 90.71428571428572,70 H 100"></path>
	<g transform="translate(100,0)scale(-1,1)">
	<path d="M 5,72.5 H 23.571428571428573"></path>
	<path d="M 33.57142857142857,72.5 H 52.142857142857146"></path>
	<path d="M 62.142857142857146,72.5 H 80.71428571428572"></path>
	<path d="M 90.71428571428572,72.5 H 100"></path>
	</g>
	<path d="M 5,75 H 23.571428571428573"></path>
	<path d="M 33.57142857142857,75 H 52.142857142857146"></path>
	<path d="M 62.142857142857146,75 H 80.71428571428572"></path>
	<path d="M 90.71428571428572,75 H 100"></path>
	<g transform="translate(100,0)scale(-1,1)">
	<path d="M 5,77.5 H 23.571428571428573"></path>
	<path d="M 33.57142857142857,77.5 H 52.142857142857146"></path>
	<path d="M 62.142857142857146,77.5 H 80.71428571428572"></path>
	<path d="M 90.71428571428572,77.5 H 100"></path>
	</g>
	<path d="M 5,80 H 23.571428571428573"></path>
	<path d="M 33.57142857142857,80 H 52.142857142857146"></path>
	<path d="M 62.142857142857146,80 H 80.71428571428572"></path>
	<path d="M 90.71428571428572,80 H 100"></path>
	<g transform="translate(100,0)scale(-1,1)">
	<path d="M 5,82.5 H 23.571428571428573"></path>
	<path d="M 33.57142857142857,82.5 H 52.142857142857146"></path>
	<path d="M 62.142857142857146,82.5 H 80.71428571428572"></path>
	<path d="M 90.71428571428572,82.5 H 100"></path>
	</g>
	<path d="M 5,85 H 23.571428571428573"></path>
	<path d="M 33.57142857142857,85 H 52.142857142857146"></path>
	<path d="M 62.142857142857146,85 H 80.71428571428572"></path>
	<path d="M 90.71428571428572,85 H 100"></path>
	<g transform="translate(100,0)scale(-1,1)">
	<path d="M 5,87.5 H 23.571428571428573"></path>
	<path d="M 33.57142857142857,87.5 H 52.142857142857146"></path>
	<path d="M 62.142857142857146,87.5 H 80.71428571428572"></path>
	<path d="M 90.71428571428572,87.5 H 100"></path>
	</g>
	<path d="M 5,90 H 23.571428571428573"></path>
	<path d="M 33.57142857142857,90 H 52.142857142857146"></path>
	<path d="M 62.142857142857146,90 H 80.71428571428572"></path>
	<path d="M 90.71428571428572,90 H 100"></path>
	<g transform="translate(100,0)scale(-1,1)">
	<path d="M 5,92.5 H 23.571428571428573"></path>
	<path d="M 33.57142857142857,92.5 H 52.142857142857146"></path>
	<path d="M 62.142857142857146,92.5 H 80.71428571428572"></path>
	<path d="M 90.71428571428572,92.5 H 100"></path>
	</g>
	<path d="M 5,95 H 23.571428571428573"></path>
	<path d="M 33.57142857142857,95 H 52.142857142857146"></path>
	<path d="M 62.142857142857146,95 H 80.71428571428572"></path>
	<path d="M 90.71428571428572,95 H 100"></path>
<rect width="100" height="100" fill="none"></rect>
</g>
</svg>
