<svg xmlns="http://www.w3.org/2000/svg" version="1.1" width="100mm" height="100mm" viewBox="0 0 100 100">
<g stroke="black">
	<path d="M 5,5 H 13.181818181818182"></path>
	<path d="M 23.18181818181818,5 H 31.363636363636363"></path>
	<path d="M 41.36363636363636,5 H 49.54545454545455"></path>
	<path d="M 59.54545454545455,5 H 67.72727272727272"></path>
	<path d="M 77.72727272727272,5 H 85.9090909090909"></path>
	<path d="M 95.9090909090909,5 H 100"></path>
	<g transform="translate(100,0)scale(-1,1)">
	<path d="M 5,10 H 13.181818181818182"></path>
	<path d="M 23.18181818181818,10 H 31.363636363636363"></path>
	<path d="M 41.36363636363636,10 H 49.54545454545455"></path>
	<path d="M 59.54545454545455,10 H 67.72727272727272"></path>
	<path d="M 77.72727272727272,10 H 85.9090909090909"></path>
	<path d="M 95.9090909090909,10 H 100"></path>
	</g>
	<path d="M 5,15 H 13.181818181818182"></path>
	<path d="M 23.18181818181818,15 H 31.363636363636363"></path>
	<path d="M 41.36363636363636,15 H 49.54545454545455"></path>
	<path d="M 59.54545454545455,15 H 67.72727272727272"></path>
	<path d="M 77.72727272727272,15 H 85.9090909090909"></path>
	<path d="M 95.9090909090909,15 H 100"></path>
	<g transform="translate(100,0)scale(-1,1)">
	<path d="M 5,20 H 13.181818181818182"></path>
	<path d="M 23.18181818181818,20 H 31.363636363636363"></path>
	<path d="M 41.36363636363636,20 H 49.54545454545455"></path>
	<path d="M 59.54545454545455,20 H 67.72727272727272"></path>
	<path d="M 77.72727272727272,20 H 85.9090909090909"></path>
	<path d="M 95.9090909090909,20 H 100"></path>
	</g>
	<path d="M 5,25 H 13.181818181818182"></path>
	<path d="M 23.18181818181818,25 H 31.363636363636363"></path>
	<path d="M 41.36363636363636,25 H 49.54545454545455"></path>
	<path d="M 59.54545454545455,25 H 67.72727272727272"></path>
	<path d="M 77.72727272727272,25 H 85.9090909090909"></path>
	<path d="M 95.9090909090909,25 H 100"></path>
	<g transform="translate(100,0)scale(-1,1)">
	<path d="M 5,30 H 13.181818181818182"></path>
	<path d="M 23.18181818181818,30 H 31.363636363636363"></path>
	<path d="M 41.36363636363636,30 H 49.54545454545455"></path>
	<path d="M 59.54545454545455,30 H 67.72727272727272"></path>
	<path d="M 77.72727272727272,30 H 85.9090909090909"></path>
	<path d="M 95.9090909090909,30 H 100"></path>
	</g>
	<path d="M 5,35 H 13.181818181818182"></path>
	<path d="M 23.18181818181818,35 H 31.363636363636363"></path>
	<path d="M 41.36363636363636,35 H 49.54545454545455"></path>
	<path d="M 59.54545454545455,35 H 67.72727272727272"></path>
	<path d="M 77.72727272727272,35 H 85.9090909090909"></path>
	<path d="M 95.9090909090909,35 H 100"></path>
	<g transform="translate(100,0)scale(-1,1)">
	<path d="M 5,40 H 13.181818181818182"></path>
	<path d="M 23.18181818181818,40 H 31.363636363636363"></path>
	<path d="M 41.36363636363636,40 H 49.54545454545455"></path>
	<path d="M 59.54545454545455,40 H 67.72727272727272"></path>
	<path d="M 77.72727272727272,40 H 85.9090909090909"></path>
	<path d="M 95.9090909090909,40 H 100"></path>
	</g>
	<path d="M 5,45 H 13.181818181818182"></path>
	<path d="M 23.18181818181818,45 H 31.363636363636363"></path>
	<path d="M 41.36363636363636,45 H 49.54545454545455"></path>
	<path d="M 59.54545454545455,45 H 67.72727272727272"></path>
	<path d="M 77.72727272727272,45 H 85.9090909090909"></path>
	<path d="M 95.9090909090909,45 H 100"></path>
	<g transform="translate(100,0)scale(-1,1)">
	<path d="M 5,50 H 13.181818181818182"></path>
	<path d="M 23.18181818181818,50 H 31.363636363636363"></path>
	<path d="M 41.36363636363636,50 H 49.54545454545455"></path>
	<path d="M 59.54545454545455,50 H 67.72727272727272"></path>
	<path d="M 77.72727272727272,50 H 85.9090909090909"></path>
	<path d="M 95.9090909090909,50 H 100"></path>
	</g>
	<path d="M 5,55 H 13.181818181818182"></path>
	<path d="M 23.18181818181818,55 H 31.363636363636363"></path>
	<path d="M 41.36363636363636,55 H 49.54545454545455"></path>
	<path d="M 59.54545454545455,55 H 67.72727272727272"></path>
	<path d="M 77.72727272727272,55 H 85.9090909090909"></path>
	<path d="M 95.9090909090909,55 H 100"></path>
	<g transform="translate(100,0)scale(-1,1)">
	<path d="M 5,60 H 13.181818181818182"></path>
	<path d="M 23.18181818181818,60 H 31.363636363636363"></path>
	<path d="M 41.36363636363636,60 H 49.54545454545455"></path>
	<path d="M 59.54545454545455,60 H 67.72727272727272"></path>
	<path d="M 77.72727272727272,60 H 85.9090909090909"></path>
	<path d="M 95.9090909090909,60 H 100"></path>
	</g>
	<path d="M 5,65 H 13.181818181818182"></path>
	<path d="M 23.18181818181818,65 H 31.363636363636363"></path>
	<path d="M 41.36363636363636,65 H 49.54545454545455"></path>
	<path d="M 59.54545454545455,65 H 67.72727272727272"></path>
	<path d="M 77.72727272727272,65 H 85.9090909090909"></path>
	<path d="M 95.9090909090909,65 H 100"></path>
	<g transform="translate(100,0)scale(-1,1)">
	<path d="M 5,70 H 13.181818181818182"></path>
	<path d="M 23.18181818181818,70 H 31.363636363636363"></path>
	<path d="M 41.36363636363636,70 H 49.54545454545455"></path>
	<path d="M 59.54545454545455,70 H 67.72727272727272"></path>
	<path d="M 77.72727272727272,70 H 85.9090909090909"></path>
	<path d="M 95.9090909090909,70 H 100"></path>
	</g>
	<path d="M 5,75 H 13.181818181818182"></path>
	<path d="M 23.18181818181818,75 H 31.363636363636363"></path>
	<path d="M 41.36363636363636,75 H 49.54545454545455"></path>
	<path d="M 59.54545454545455,75 H 67.72727272727272"></path>
	<path d="M 77.72727272727272,75 H 85.9090909090909"></path>
	<path d="M 95.9090909090909,75 H 100"></path>
	<g transform="translate(100,0)scale(-1,1)">
	<path d="M 5,80 H 13.181818181818182"></path>
	<path d="M 23.18181818181818,80 H 31.363636363636363"></path>
	<path d="M 41.36363636363636,80 H 49.54545454545455"></path>
	<path d="M 59.54545454545455,80 H 67.72727272727272"></path>
	<path d="M 77.72727272727272,80 H 85.9090909090909"></path>
	<path d="M 95.9090909090909,80 H 100"></path>
	</g>
	<path d="M 5,85 H 13.181818181818182"></path>
	<path d="M 23.18181818181818,85 H 31.363636363636363"></path>
	<path d="M 41.36363636363636,85 H 49.54545454545455"></path>
	<path d="M 59.54545454545455,85 H 67.72727272727272"></path>
	<path d="M 77.72727272727272,85 H 85.9090909090909"></path>
	<path d="M 95.9090909090909,85 H 100"></path>
	<g transform="translate(100,0)scale(-1,1)">
	<path d="M 5,90 H 13.181818181818182"></path>
	<path d="M 23.18181818181818,90 H 31.363636363636363"></path>
	<path d="M 41.36363636363636,90 H 49.54545454545455"></path>
	<path d="M 59.54545454545455,90 H 67.72727272727272"></path>
	<path d="M 77.72727272727272,90 H 85.9090909090909"></path>
	<path d="M 95.9090909090909,90 H 100"></path>
	</g>
<rect width="100" height="100" fill="none"></rect>
</g>
</svg>
