  0
SECTION
  2
BLOCKS
  0
ENDSEC
  0
SECTION
  2
ENTITIES
  0
LINE
  8
0
 10
139.85
 20
20
 11
20
 21
20
  0
LINE
  8
0
 10
20
 20
20
 11
20
 21
59.95
  0
LINE
  8
0
 10
20
 20
59.95
 11
-20
 21
59.95
  0
LINE
  8
0
 10
-20
 20
59.95
 11
-20
 21
-59.95
  0
LINE
  8
0
 10
-20
 20
-59.95
 11
20
 21
-59.95
  0
LINE
  8
0
 10
20
 20
-59.95
 11
20
 21
-20
  0
LINE
  8
0
 10
20
 20
-20
 11
139.85
 21
-20
  0
LINE
  8
0
 10
139.85
 20
-20
 11
139.85
 21
20
  0
LINE
  8
0
 10
-19.95
 20
20
 11
-19.95
 21
59.9
  0
LINE
  8
0
 10
-19.95
 20
59.9
 11
19.95
 21
59.9
  0
LINE
  8
0
 10
19.95
 20
59.9
 11
19.95
 21
20
  0
LINE
  8
0
 10
19.95
 20
20
 11
-19.95
 21
20
  0
LINE
  8
0
 10
-19.95
 20
-19.95
 11
-19.95
 21
19.95
  0
LINE
  8
0
 10
-19.95
 20
19.95
 11
19.95
 21
19.95
  0
LINE
  8
0
 10
19.95
 20
19.95
 11
19.95
 21
-19.95
  0
LINE
  8
0
 10
19.95
 20
-19.95
 11
-19.95
 21
-19.95
  0
LINE
  8
0
 10
20
 20
-19.95
 11
20
 21
19.95
  0
LINE
  8
0
 10
20
 20
19.95
 11
59.9
 21
19.95
  0
LINE
  8
0
 10
59.9
 20
19.95
 11
59.9
 21
-19.95
  0
LINE
  8
0
 10
59.9
 20
-19.95
 11
20
 21
-19.95
  0
LINE
  8
0
 10
59.95
 20
-19.95
 11
59.95
 21
19.95
  0
LINE
  8
0
 10
59.95
 20
19.95
 11
99.85
 21
19.95
  0
LINE
  8
0
 10
99.85
 20
19.95
 11
99.85
 21
-19.95
  0
LINE
  8
0
 10
99.85
 20
-19.95
 11
59.95
 21
-19.95
  0
LINE
  8
0
 10
99.9
 20
-19.95
 11
99.9
 21
19.95
  0
LINE
  8
0
 10
99.9
 20
19.95
 11
139.8
 21
19.95
  0
LINE
  8
0
 10
139.8
 20
19.95
 11
139.8
 21
-19.95
  0
LINE
  8
0
 10
139.8
 20
-19.95
 11
99.9
 21
-19.95
  0
LINE
  8
0
 10
-19.95
 20
-59.9
 11
-19.95
 21
-20
  0
LINE
  8
0
 10
-19.95
 20
-20
 11
19.95
 21
-20
  0
LINE
  8
0
 10
19.95
 20
-20
 11
19.95
 21
-59.9
  0
LINE
  8
0
 10
19.95
 20
-59.9
 11
-19.95
 21
-59.9
  0
ENDSEC
  0
SECTION
  2
OBJECTS
  0
DICTIONARY
  0
ENDSEC
  0
EOF
