<?xml version="1.0" encoding="UTF-8" standalone="no"?>
<!-- Created with Inkscape (http://www.inkscape.org/) -->

<svg
   width="210mm"
   height="297mm"
   viewBox="0 0 210 297"
   version="1.1"
   id="svg6329"
   inkscape:version="1.1.2 (b8e25be833, 2022-02-05)"
   sodipodi:docname="testPS.svg"
   xmlns:inkscape="http://www.inkscape.org/namespaces/inkscape"
   xmlns:sodipodi="http://sodipodi.sourceforge.net/DTD/sodipodi-0.dtd"
   xmlns="http://www.w3.org/2000/svg"
   xmlns:svg="http://www.w3.org/2000/svg">
  <sodipodi:namedview
     id="namedview6331"
     pagecolor="#ffffff"
     bordercolor="#666666"
     borderopacity="1.0"
     inkscape:pageshadow="2"
     inkscape:pageopacity="0.0"
     inkscape:pagecheckerboard="0"
     inkscape:document-units="mm"
     showgrid="false"
     inkscape:zoom="1.4324916"
     inkscape:cx="294.94065"
     inkscape:cy="660.03877"
     inkscape:window-width="1920"
     inkscape:window-height="1001"
     inkscape:window-x="-9"
     inkscape:window-y="-9"
     inkscape:window-maximized="1"
     inkscape:current-layer="layer1" />
  <defs
     id="defs6326">
    <rect
       x="323.91115"
       y="-129.8437"
       width="37.696557"
       height="272.25291"
       id="rect52770" />
    <rect
       x="72.600776"
       y="869.81314"
       width="27.923375"
       height="113.08967"
       id="rect41882" />
    <rect
       x="94.939476"
       y="289.00693"
       width="62.827593"
       height="69.110306"
       id="rect26708" />
    <rect
       x="90.332497"
       y="188.56292"
       width="6.9106828"
       height="59.234424"
       id="rect19772" />
    <rect
       x="87.958632"
       y="194.06746"
       width="44.6774"
       height="53.054413"
       id="rect12984" />
    <rect
       x="26.527207"
       y="925.65989"
       width="41.885063"
       height="311.34563"
       id="rect2392" />
    <linearGradient
       id="linearGradient7254"
       inkscape:swatch="solid">
      <stop
         style="stop-color:#0000ff;stop-opacity:1;"
         offset="0"
         id="stop7252" />
    </linearGradient>
    <rect
       x="94.939476"
       y="289.00693"
       width="62.827593"
       height="69.110306"
       id="rect28974" />
    <rect
       x="94.939476"
       y="289.00693"
       width="62.827593"
       height="69.110306"
       id="rect28980" />
    <rect
       x="94.939476"
       y="289.00693"
       width="62.827593"
       height="69.110306"
       id="rect28986" />
    <rect
       x="94.939476"
       y="289.00693"
       width="62.827593"
       height="69.110306"
       id="rect28992" />
    <rect
       x="94.939476"
       y="289.00693"
       width="62.827593"
       height="69.110306"
       id="rect28998" />
    <rect
       x="94.939476"
       y="289.00693"
       width="100.52415"
       height="50.960112"
       id="rect29004" />
    <rect
       x="94.939476"
       y="289.00693"
       width="62.827593"
       height="69.110306"
       id="rect38468" />
    <rect
       x="94.939476"
       y="289.00693"
       width="62.827593"
       height="69.110306"
       id="rect39268" />
    <rect
       x="94.939476"
       y="289.00693"
       width="62.827593"
       height="69.110306"
       id="rect39274" />
    <rect
       x="94.939476"
       y="289.00693"
       width="62.827593"
       height="69.110306"
       id="rect39280" />
  </defs>
  <g
     inkscape:label="Calque 1"
     inkscape:groupmode="layer"
     id="layer1">
    <path
       id="rect6355"
       style="fill:none;fill-rule:evenodd;stroke:#000081;stroke-width:0.01;stroke-opacity:1;stroke-miterlimit:4;stroke-dasharray:none"
       d="m 34.335466,181.14128 h 13.495001 v 14.94088 H 34.335466 Z" />
    <path
       id="path174"
       style="fill:none;fill-rule:evenodd;stroke:#008100;stroke-width:0.01;stroke-opacity:1;stroke-miterlimit:4;stroke-dasharray:none"
       d="m 53.493549,181.14128 h 13.495002 v 14.94088 H 53.493549 Z" />
    <path
       id="path176"
       style="fill:none;fill-rule:evenodd;stroke:#830000;stroke-width:0.01;stroke-opacity:1;stroke-miterlimit:4;stroke-dasharray:none"
       d="m 72.892613,181.14128 h 13.495004 v 14.94088 H 72.892613 Z" />
    <path
       id="path178"
       style="fill:none;fill-rule:evenodd;stroke:#008181;stroke-width:0.01;stroke-opacity:1;stroke-miterlimit:4;stroke-dasharray:none"
       d="m 34.335466,158.60943 h 13.495001 v 14.94089 H 34.335466 Z" />
    <path
       id="path180"
       style="fill:none;fill-rule:evenodd;stroke:#82007e;stroke-width:0.01;stroke-opacity:1;stroke-miterlimit:4;stroke-dasharray:none"
       d="m 53.493549,158.60943 h 13.495002 v 14.94089 H 53.493549 Z" />
    <path
       id="path182"
       style="fill:none;fill-rule:evenodd;stroke:#7c7e00;stroke-width:0.01;stroke-opacity:1;stroke-miterlimit:4;stroke-dasharray:none"
       d="m 72.892613,158.60943 h 13.495004 v 14.94089 H 72.892613 Z" />
    <path
       id="path184"
       style="fill:none;fill-rule:evenodd;stroke:#c3c300;stroke-width:0.01;stroke-opacity:1;stroke-miterlimit:4;stroke-dasharray:none"
       d="M 34.335466,137.40301 H 47.830467 V 152.3439 H 34.335466 Z" />
    <path
       id="path186"
       style="fill:none;fill-rule:evenodd;stroke:#c50000;stroke-width:0.01;stroke-opacity:1;stroke-miterlimit:4;stroke-dasharray:none"
       d="M 53.493549,137.40301 H 66.988551 V 152.3439 H 53.493549 Z" />
    <text
       xml:space="preserve"
       style="font-style:normal;font-weight:normal;font-size:9.21366px;line-height:1.25;font-family:sans-serif;white-space:pre;inline-size:57.8234;fill:none;fill-opacity:1;stroke:#000000;stroke-width:0.02611745;stroke-opacity:1;stroke-miterlimit:4;stroke-dasharray:none"
       x="-49.998947"
       y="23.77268"
       id="text6262"
       transform="matrix(0.38090701,0,0,0.38487487,33.672761,209.3427)"><tspan
         x="-49.998947"
         y="23.77268"
         id="tspan947">Speed (%)</tspan></text>
    <text
       xml:space="preserve"
       style="font-style:normal;font-weight:normal;font-size:3.52778px;line-height:1.25;font-family:sans-serif;fill:none;fill-opacity:1;stroke:#000000;stroke-width:0.01;stroke-opacity:1;stroke-miterlimit:4;stroke-dasharray:none"
       x="86.006943"
       y="137.84915"
       id="text8416"
       transform="scale(0.9991114,1.0008894)"><tspan
         sodipodi:role="line"
         id="tspan8414"
         style="font-size:3.52778px;stroke-width:0.01;fill:none;stroke:#000000;stroke-opacity:1;stroke-miterlimit:4;stroke-dasharray:none"
         x="86.006943"
         y="137.84915">Power (%)</tspan></text>
    <text
       xml:space="preserve"
       transform="matrix(0.10767446,0,0,0.10767446,11.699277,111.04968)"
       id="text26706"
       style="font-style:normal;font-weight:normal;font-size:40px;line-height:1.25;font-family:sans-serif;white-space:pre;shape-inside:url(#rect26708);fill:none;fill-opacity:1;stroke:#000000;stroke-opacity:1;stroke-width:0.09287255;stroke-miterlimit:4;stroke-dasharray:none"><tspan
         x="94.939453"
         y="325.50103"
         id="tspan949">30</tspan></text>
    <text
       xml:space="preserve"
       transform="matrix(0.10774393,0,0,0.10774393,11.650367,132.10974)"
       id="text28972"
       style="font-style:normal;font-weight:normal;font-size:40px;line-height:1.25;font-family:sans-serif;white-space:pre;shape-inside:url(#rect28974);fill:none;fill-opacity:1;stroke:#000000;stroke-opacity:1;stroke-width:0.09281266;stroke-miterlimit:4;stroke-dasharray:none"><tspan
         x="94.939453"
         y="325.50103"
         id="tspan951">50</tspan></text>
    <text
       xml:space="preserve"
       transform="matrix(0.10774393,0,0,0.10774393,11.719812,154.72509)"
       id="text28978"
       style="font-style:normal;font-weight:normal;font-size:40px;line-height:1.25;font-family:sans-serif;white-space:pre;shape-inside:url(#rect28980);fill:none;fill-opacity:1;stroke:#000000;stroke-opacity:1;stroke-width:0.09281266;stroke-miterlimit:4;stroke-dasharray:none"><tspan
         x="94.939453"
         y="325.50103"
         id="tspan953">70</tspan></text>
    <text
       xml:space="preserve"
       transform="matrix(0.10767446,0,0,0.10767446,27.688486,97.593468)"
       id="text28984"
       style="font-style:normal;font-weight:normal;font-size:40px;line-height:1.25;font-family:sans-serif;white-space:pre;shape-inside:url(#rect28986);fill:none;fill-opacity:1;stroke:#000000;stroke-opacity:1;stroke-width:0.09287255;stroke-miterlimit:4;stroke-dasharray:none"><tspan
         x="94.939453"
         y="325.50103"
         id="tspan955">30</tspan></text>
    <text
       xml:space="preserve"
       transform="matrix(0.10774393,0,0,0.10774393,47.286211,97.570813)"
       id="text28990"
       style="font-style:normal;font-weight:normal;font-size:40px;line-height:1.25;font-family:sans-serif;white-space:pre;shape-inside:url(#rect28992);fill:none;fill-opacity:1;stroke:#000000;stroke-opacity:1;stroke-width:0.09281266;stroke-miterlimit:4;stroke-dasharray:none"><tspan
         x="94.939453"
         y="325.50103"
         id="tspan957">50</tspan></text>
    <text
       xml:space="preserve"
       transform="matrix(0.10725952,0,0,0.10725952,67.400884,97.722498)"
       id="text28996"
       style="font-style:normal;font-weight:normal;font-size:40px;line-height:1.25;font-family:sans-serif;white-space:pre;shape-inside:url(#rect28998);fill:none;fill-opacity:1;stroke:#000000;stroke-opacity:1;stroke-width:0.09323183;stroke-miterlimit:4;stroke-dasharray:none"><tspan
         x="94.939453"
         y="325.50103"
         id="tspan959">80</tspan></text>
    <text
       xml:space="preserve"
       transform="matrix(0.10774393,0,0,0.10774393,84.612034,97.570813)"
       id="text29002"
       style="font-style:normal;font-weight:normal;font-size:40px;line-height:1.25;font-family:sans-serif;white-space:pre;shape-inside:url(#rect29004);fill:none;fill-opacity:1;stroke:#000000;stroke-opacity:1;stroke-width:0.09281266;stroke-miterlimit:4;stroke-dasharray:none"><tspan
         x="94.939453"
         y="325.50103"
         id="tspan961">100</tspan></text>
    <text
       xml:space="preserve"
       transform="matrix(0.10725952,0,0,0.10725952,11.834296,177.48176)"
       id="text39278"
       style="font-style:normal;font-weight:normal;font-size:40px;line-height:1.25;font-family:sans-serif;white-space:pre;shape-inside:url(#rect39280);fill:none;fill-opacity:1;stroke:#000000;stroke-opacity:1;stroke-width:0.09323183;stroke-miterlimit:4;stroke-dasharray:none"><tspan
         x="94.939453"
         y="325.50103"
         id="tspan963">80</tspan></text>
    <path
       id="path42508"
       style="fill:none;fill-rule:evenodd;stroke:#00ff00;stroke-width:0.01;stroke-opacity:1;stroke-miterlimit:4;stroke-dasharray:none"
       d="m 34.335466,204.51654 h 13.495001 v 14.9409 H 34.335466 Z" />
    <path
       id="path42510"
       style="fill:none;fill-rule:evenodd;stroke:#ff00ff;stroke-width:0.01;stroke-opacity:1;stroke-miterlimit:4;stroke-dasharray:none"
       d="m 53.493549,204.51654 h 13.495002 v 14.9409 H 53.493549 Z" />
    <path
       id="path42512"
       style="fill:none;fill-rule:evenodd;stroke:#ffff00;stroke-width:0.01;stroke-opacity:1;stroke-miterlimit:4;stroke-dasharray:none"
       d="m 72.892613,204.51654 h 13.495004 v 14.9409 H 72.892613 Z" />
    <path
       id="path44968"
       style="fill:none;fill-rule:evenodd;stroke:#0000f6;stroke-width:0.01;stroke-opacity:1;stroke-miterlimit:4;stroke-dasharray:none"
       d="m 93.135116,181.14128 h 13.495004 v 14.94088 H 93.135116 Z" />
    <path
       id="path44974"
       style="fill:none;fill-rule:evenodd;stroke:#ff0036;stroke-width:0.01;stroke-opacity:1;stroke-miterlimit:4;stroke-dasharray:none"
       d="m 93.135116,204.51654 h 13.495004 v 14.9409 H 93.135116 Z" />
    <rect
       style="fill:none;fill-opacity:0.0666667;stroke:#ff0000;stroke-width:0.01;stroke-opacity:1;stroke-miterlimit:4;stroke-dasharray:none"
       id="rect79"
       width="100"
       height="100"
       x="12.986099"
       y="124.22674" />
  </g>
</svg>
