<?xml version="1.0" encoding="UTF-8" standalone="no"?>
<!-- Created with Inkscape (http://www.inkscape.org/) -->

<svg
   width="210mm"
   height="297mm"
   viewBox="0 0 210 297"
   version="1.1"
   id="svg5"
   inkscape:version="1.1.2 (b8e25be833, 2022-02-05)"
   sodipodi:docname="d20.svg"
   xmlns:inkscape="http://www.inkscape.org/namespaces/inkscape"
   xmlns:sodipodi="http://sodipodi.sourceforge.net/DTD/sodipodi-0.dtd"
   xmlns="http://www.w3.org/2000/svg"
   xmlns:svg="http://www.w3.org/2000/svg">
  <sodipodi:namedview
     id="namedview7"
     pagecolor="#ffffff"
     bordercolor="#666666"
     borderopacity="1.0"
     inkscape:pageshadow="2"
     inkscape:pageopacity="0.0"
     inkscape:pagecheckerboard="0"
     inkscape:document-units="mm"
     showgrid="false"
     inkscape:zoom="1.4142136"
     inkscape:cx="602.80853"
     inkscape:cy="487.90368"
     inkscape:window-width="3840"
     inkscape:window-height="2066"
     inkscape:window-x="-11"
     inkscape:window-y="-11"
     inkscape:window-maximized="1"
     inkscape:current-layer="layer1" />
  <defs
     id="defs2">
    <rect
       x="234.57646"
       y="201.84486"
       width="54.552666"
       height="42.732921"
       id="rect8331" />
  </defs>
  <g
     inkscape:label="Calque 1"
     inkscape:groupmode="layer"
     id="layer1">
    <path
       sodipodi:type="star"
       style="fill:#ffff00;fill-opacity:0;fill-rule:evenodd;stroke:#000000;stroke-opacity:1"
       id="path149"
       inkscape:flatsided="true"
       sodipodi:sides="3"
       sodipodi:cx="190.30116"
       sodipodi:cy="270.02191"
       sodipodi:r1="96.170296"
       sodipodi:r2="48.085148"
       sodipodi:arg1="0.51748774"
       sodipodi:arg2="1.5646853"
       inkscape:rounded="0"
       inkscape:randomized="0"
       d="m 273.87937,317.5972 -166.56872,1.01792 82.40282,-144.76171 z"
       transform="matrix(0.22024271,0,0,0.21920311,9.0592894,29.592022)"
       inkscape:transform-center-x="-0.064717643"
       inkscape:transform-center-y="-5.2143257" />
    <path
       sodipodi:type="star"
       style="fill:#ffff00;fill-opacity:0;fill-rule:evenodd;stroke:#000000;stroke-opacity:1"
       id="path149-2"
       inkscape:flatsided="true"
       sodipodi:sides="3"
       sodipodi:cx="190.30116"
       sodipodi:cy="270.02191"
       sodipodi:r1="96.170296"
       sodipodi:r2="48.085148"
       sodipodi:arg1="0.51748774"
       sodipodi:arg2="1.5646853"
       inkscape:rounded="0"
       inkscape:randomized="0"
       transform="matrix(0.22024271,0,0,0.21920311,45.744836,29.368891)"
       inkscape:transform-center-x="-0.064717558"
       inkscape:transform-center-y="-5.2143255"
       d="m 273.87937,317.5972 -166.56872,1.01792 82.40282,-144.76171 z" />
    <path
       sodipodi:type="star"
       style="fill:#ffff00;fill-opacity:0;fill-rule:evenodd;stroke:#000000;stroke-opacity:1"
       id="path149-6"
       inkscape:flatsided="true"
       sodipodi:sides="3"
       sodipodi:cx="190.30116"
       sodipodi:cy="270.02191"
       sodipodi:r1="96.170296"
       sodipodi:r2="48.085148"
       sodipodi:arg1="0.51748774"
       sodipodi:arg2="1.5646853"
       inkscape:rounded="0"
       inkscape:randomized="0"
       transform="matrix(0.22024271,0,0,0.21920311,27.596217,61.101107)"
       inkscape:transform-center-x="-0.064718086"
       inkscape:transform-center-y="-5.214326"
       d="m 273.87937,317.5972 -166.56872,1.01792 82.40282,-144.76171 z" />
    <path
       sodipodi:type="star"
       style="fill:#ffff00;fill-opacity:0;fill-rule:evenodd;stroke:#000000;stroke-opacity:1"
       id="path149-68"
       inkscape:flatsided="true"
       sodipodi:sides="3"
       sodipodi:cx="190.30116"
       sodipodi:cy="270.02191"
       sodipodi:r1="96.170296"
       sodipodi:r2="48.085148"
       sodipodi:arg1="0.51748774"
       sodipodi:arg2="1.5646853"
       inkscape:rounded="0"
       inkscape:randomized="0"
       transform="matrix(0.22024271,0,0,0.21920311,64.281764,60.877976)"
       inkscape:transform-center-x="-0.064717418"
       inkscape:transform-center-y="-5.2143255"
       d="m 273.87937,317.5972 -166.56872,1.01792 82.40282,-144.76171 z" />
    <path
       sodipodi:type="star"
       style="fill:#ffff00;fill-opacity:0;fill-rule:evenodd;stroke:#000000;stroke-opacity:1"
       id="path149-1"
       inkscape:flatsided="true"
       sodipodi:sides="3"
       sodipodi:cx="190.30116"
       sodipodi:cy="270.02191"
       sodipodi:r1="96.170296"
       sodipodi:r2="48.085148"
       sodipodi:arg1="0.51748774"
       sodipodi:arg2="1.5646853"
       inkscape:rounded="0"
       inkscape:randomized="0"
       transform="matrix(0.22024271,0,0,0.21920311,27.207909,-2.1401947)"
       inkscape:transform-center-x="-0.064717615"
       inkscape:transform-center-y="-5.2143257"
       d="m 273.87937,317.5972 -166.56872,1.01792 82.40282,-144.76171 z" />
    <path
       sodipodi:type="star"
       style="fill:#ffff00;fill-opacity:0;fill-rule:evenodd;stroke:#000000;stroke-opacity:1"
       id="path149-9"
       inkscape:flatsided="true"
       sodipodi:sides="3"
       sodipodi:cx="190.30116"
       sodipodi:cy="270.02191"
       sodipodi:r1="96.170296"
       sodipodi:r2="48.085148"
       sodipodi:arg1="0.51748774"
       sodipodi:arg2="1.5646853"
       inkscape:rounded="0"
       inkscape:randomized="0"
       transform="matrix(0.22024271,0,0,0.21920311,100.96731,60.654844)"
       inkscape:transform-center-x="-0.064717998"
       inkscape:transform-center-y="-5.214326"
       d="m 273.87937,317.5972 -166.56872,1.01792 82.40282,-144.76171 z" />
    <path
       sodipodi:type="star"
       style="fill:#ffff00;fill-opacity:0;fill-rule:evenodd;stroke:#000000;stroke-opacity:1"
       id="path149-5"
       inkscape:flatsided="true"
       sodipodi:sides="3"
       sodipodi:cx="190.30116"
       sodipodi:cy="270.02191"
       sodipodi:r1="96.170296"
       sodipodi:r2="48.085148"
       sodipodi:arg1="0.51748774"
       sodipodi:arg2="1.5646853"
       inkscape:rounded="0"
       inkscape:randomized="0"
       transform="matrix(0.22024271,0,0,0.21920311,82.818692,92.387063)"
       inkscape:transform-center-x="-0.064718111"
       inkscape:transform-center-y="-5.2143262"
       d="m 273.87937,317.5972 -166.56872,1.01792 82.40282,-144.76171 z" />
    <path
       sodipodi:type="star"
       style="fill:#ffff00;fill-opacity:0;fill-rule:evenodd;stroke:#000000;stroke-opacity:1"
       id="path149-95"
       inkscape:flatsided="true"
       sodipodi:sides="3"
       sodipodi:cx="190.30116"
       sodipodi:cy="270.02191"
       sodipodi:r1="96.170296"
       sodipodi:r2="48.085148"
       sodipodi:arg1="0.51748774"
       sodipodi:arg2="1.5646853"
       inkscape:rounded="0"
       inkscape:randomized="0"
       transform="matrix(0.22024271,0,0,0.21920311,119.50424,92.16393)"
       inkscape:transform-center-x="-0.064717361"
       inkscape:transform-center-y="-5.2143257"
       d="m 273.87937,317.5972 -166.56872,1.01792 82.40282,-144.76171 z" />
    <path
       sodipodi:type="star"
       style="fill:#ffff00;fill-opacity:0;fill-rule:evenodd;stroke:#000000;stroke-opacity:1"
       id="path149-8"
       inkscape:flatsided="true"
       sodipodi:sides="3"
       sodipodi:cx="190.30116"
       sodipodi:cy="270.02191"
       sodipodi:r1="96.170296"
       sodipodi:r2="48.085148"
       sodipodi:arg1="0.51748774"
       sodipodi:arg2="1.5646853"
       inkscape:rounded="0"
       inkscape:randomized="0"
       transform="matrix(0.22024271,0,0,0.21920311,101.35562,123.89615)"
       inkscape:transform-center-x="-0.064718803"
       inkscape:transform-center-y="-5.2143212"
       d="m 273.87937,317.5972 -166.56872,1.01792 82.40282,-144.76171 z" />
    <path
       sodipodi:type="star"
       style="fill:#ffff00;fill-opacity:0;fill-rule:evenodd;stroke:#000000;stroke-opacity:1"
       id="path149-99"
       inkscape:flatsided="true"
       sodipodi:sides="3"
       sodipodi:cx="190.30116"
       sodipodi:cy="270.02191"
       sodipodi:r1="96.170296"
       sodipodi:r2="48.085148"
       sodipodi:arg1="0.51748774"
       sodipodi:arg2="1.5646853"
       inkscape:rounded="0"
       inkscape:randomized="0"
       transform="matrix(0.22024271,0,0,0.21920311,64.670072,124.11928)"
       inkscape:transform-center-x="-0.064717888"
       inkscape:transform-center-y="-5.2143268"
       d="m 273.87937,317.5972 -166.56872,1.01792 82.40282,-144.76171 z" />
    <path
       sodipodi:type="star"
       style="fill:#ffff00;fill-opacity:0;fill-rule:evenodd;stroke:#000000;stroke-opacity:1"
       id="path149-7"
       inkscape:flatsided="true"
       sodipodi:sides="3"
       sodipodi:cx="190.30116"
       sodipodi:cy="270.02191"
       sodipodi:r1="96.170296"
       sodipodi:r2="48.085148"
       sodipodi:arg1="0.51748774"
       sodipodi:arg2="1.5646853"
       inkscape:rounded="0"
       inkscape:randomized="0"
       transform="matrix(0.22024271,0,0,-0.21920314,27.596217,200.3377)"
       inkscape:transform-center-x="-0.064718086"
       inkscape:transform-center-y="5.2143239"
       d="m 273.87937,317.5972 -166.56872,1.01792 82.40282,-144.76171 z" />
    <path
       sodipodi:type="star"
       style="fill:#ffff00;fill-opacity:0;fill-rule:evenodd;stroke:#000000;stroke-opacity:1"
       id="path149-74"
       inkscape:flatsided="true"
       sodipodi:sides="3"
       sodipodi:cx="190.30116"
       sodipodi:cy="270.02191"
       sodipodi:r1="96.170296"
       sodipodi:r2="48.085148"
       sodipodi:arg1="0.51748774"
       sodipodi:arg2="1.5646853"
       inkscape:rounded="0"
       inkscape:randomized="0"
       transform="matrix(-0.22024271,0,0,-0.21920311,185.30994,263.35587)"
       inkscape:transform-center-x="0.064717422"
       inkscape:transform-center-y="5.2143332"
       d="m 273.87937,317.5972 -166.56872,1.01792 82.40282,-144.76171 z" />
    <path
       sodipodi:type="star"
       style="fill:#ffff00;fill-opacity:0;fill-rule:evenodd;stroke:#000000;stroke-opacity:1"
       id="path149-3"
       inkscape:flatsided="true"
       sodipodi:sides="3"
       sodipodi:cx="190.30116"
       sodipodi:cy="270.02191"
       sodipodi:r1="96.170296"
       sodipodi:r2="48.085148"
       sodipodi:arg1="0.51748774"
       sodipodi:arg2="1.5646853"
       inkscape:rounded="0"
       inkscape:randomized="0"
       transform="matrix(0.22024271,0,0,-0.21920311,63.893457,137.31952)"
       inkscape:transform-center-x="-0.064717948"
       inkscape:transform-center-y="5.2143264"
       d="m 273.87937,317.5972 -166.56872,1.01792 82.40282,-144.76171 z" />
    <path
       sodipodi:type="star"
       style="fill:#ffff00;fill-opacity:0;fill-rule:evenodd;stroke:#000000;stroke-opacity:1;image-rendering:auto"
       id="path149-66"
       inkscape:flatsided="true"
       sodipodi:sides="3"
       sodipodi:cx="190.30116"
       sodipodi:cy="270.02191"
       sodipodi:r1="96.170296"
       sodipodi:r2="48.085148"
       sodipodi:arg1="0.51748774"
       sodipodi:arg2="1.5646853"
       inkscape:rounded="0"
       inkscape:randomized="0"
       transform="matrix(0.21791149,0,0,-0.22075542,-8.8391663,137.81253)"
       inkscape:transform-center-x="-0.064032611"
       inkscape:transform-center-y="5.2512437"
       d="m 273.87937,317.5972 -166.56872,1.01792 82.40282,-144.76171 z" />
    <path
       sodipodi:type="star"
       style="fill:#ffff00;fill-opacity:0;fill-rule:evenodd;stroke:#000000;stroke-opacity:1"
       id="path149-97"
       inkscape:flatsided="true"
       sodipodi:sides="3"
       sodipodi:cx="190.30116"
       sodipodi:cy="270.02191"
       sodipodi:r1="96.170296"
       sodipodi:r2="48.085148"
       sodipodi:arg1="0.51748774"
       sodipodi:arg2="1.5646853"
       inkscape:rounded="0"
       inkscape:randomized="0"
       transform="matrix(0.22024271,0,0,-0.21920311,137.65286,200.11456)"
       inkscape:transform-center-x="-0.064719248"
       inkscape:transform-center-y="5.2143265"
       d="m 273.87937,317.5972 -166.56872,1.01792 82.40282,-144.76171 z" />
    <path
       sodipodi:type="star"
       style="fill:#ffff00;fill-opacity:0;stroke:#000000;stroke-opacity:1"
       id="path2571"
       inkscape:flatsided="false"
       sodipodi:sides="3"
       sodipodi:cx="207.0168"
       sodipodi:cy="240.44809"
       sodipodi:r1="99.016388"
       sodipodi:r2="49.508194"
       sodipodi:arg1="1.55781"
       sodipodi:arg2="2.6050076"
       inkscape:rounded="0"
       inkscape:randomized="0"
       transform="matrix(0.21653256,0,0,0.21207745,61.348781,90.237498)"
       inkscape:transform-center-x="0.13921011"
       inkscape:transform-center-y="5.1312624"
       d="m 208.30262,339.45613 -43.8361,-73.69926 -43.83611,-73.69924 85.74348,-1.11356 85.74348,-1.11356 -41.90738,74.81281 z" />
    <text
       xml:space="preserve"
       transform="scale(0.26458333)"
       id="text8329"
       style="font-style:normal;font-weight:normal;font-size:40px;line-height:1.25;font-family:sans-serif;white-space:pre;shape-inside:url(#rect8331);fill:#000000;fill-opacity:1;stroke:none"><tspan
         x="234.57617"
         y="280.97313"
         id="tspan73879"><tspan
           dx="0 22.88002"
           id="tspan73877">16</tspan></tspan></text>
    <text
       xml:space="preserve"
       style="font-style:normal;font-weight:normal;font-size:10.5833px;line-height:1.25;font-family:sans-serif;fill:#000000;fill-opacity:1;stroke:#000000;stroke-width:0.264583;stroke-opacity:1"
       x="63.027271"
       y="60.140522"
       id="text16033"><tspan
         sodipodi:role="line"
         id="tspan16031"
         style="stroke-width:0.264583;stroke:#000000;stroke-opacity:1"
         x="63.027271"
         y="60.140522">16</tspan></text>
    <text
       xml:space="preserve"
       style="font-style:normal;font-weight:normal;font-size:10.5833px;line-height:1.25;font-family:sans-serif;fill:#000000;fill-opacity:1;stroke:#000000;stroke-width:0.264583;stroke-opacity:1"
       x="-54.820927"
       y="74.87352"
       id="text16033-0"
       transform="rotate(-56.894424)"><tspan
         sodipodi:role="line"
         id="tspan16031-0"
         style="stroke-width:0.264583;stroke:#000000;stroke-opacity:1"
         x="-54.820927"
         y="74.87352">14</tspan></text>
    <text
       xml:space="preserve"
       style="font-style:normal;font-weight:normal;font-size:10.5833px;line-height:1.25;font-family:sans-serif;fill:#000000;fill-opacity:1;stroke:#000000;stroke-width:0.264583;stroke-opacity:1"
       x="99.726486"
       y="-2.3894784"
       id="text16033-7"
       transform="rotate(51.912042)"
       inkscape:transform-center-x="3.3678694"
       inkscape:transform-center-y="-6.4951767"><tspan
         sodipodi:role="line"
         id="tspan16031-7"
         style="stroke-width:0.264583;stroke:#000000;stroke-opacity:1"
         x="99.726486"
         y="-2.3894784">8</tspan></text>
    <text
       xml:space="preserve"
       style="font-style:normal;font-weight:normal;font-size:10.5833px;line-height:1.25;font-family:sans-serif;fill:#000000;fill-opacity:1;stroke:#000000;stroke-width:0.264583;stroke-opacity:1"
       x="-107.5789"
       y="1.2924405"
       id="text16033-09"
       transform="rotate(-121.62293)"><tspan
         sodipodi:role="line"
         id="tspan16031-4"
         style="stroke-width:0.264583;stroke:#000000;stroke-opacity:1"
         x="-107.5789"
         y="1.2924405">20</tspan></text>
    <text
       xml:space="preserve"
       style="font-style:normal;font-weight:normal;font-size:10.5833px;line-height:1.25;font-family:sans-serif;fill:#000000;fill-opacity:1;stroke:#000000;stroke-width:0.264583;stroke-opacity:1"
       x="0.73666775"
       y="135.86945"
       id="text16033-3"
       transform="rotate(-50.98734)"><tspan
         sodipodi:role="line"
         id="tspan16031-3"
         style="stroke-width:0.264583;stroke:#000000;stroke-opacity:1"
         x="0.73666775"
         y="135.86945">17</tspan></text>
    <text
       xml:space="preserve"
       style="font-style:normal;font-weight:normal;font-size:10.5833px;line-height:1.25;font-family:sans-serif;fill:#000000;fill-opacity:1;stroke:#000000;stroke-width:0.264583;stroke-opacity:1"
       x="81.288712"
       y="91.823967"
       id="text16033-34"><tspan
         sodipodi:role="line"
         id="tspan16031-01"
         style="stroke-width:0.264583;stroke:#000000;stroke-opacity:1"
         x="81.288712"
         y="91.823967">10</tspan><tspan
         sodipodi:role="line"
         style="stroke-width:0.264583;stroke:#000000;stroke-opacity:1"
         x="81.288712"
         y="105.05309"
         id="tspan30827" /></text>
    <text
       xml:space="preserve"
       style="font-style:normal;font-weight:normal;font-size:10.5833px;line-height:1.25;font-family:sans-serif;fill:#000000;fill-opacity:1;stroke:none;stroke-width:0.264583"
       x="140.72882"
       y="83.234482"
       id="text32961"><tspan
         sodipodi:role="line"
         id="tspan32959"
         style="stroke-width:0.264583"
         x="140.72882"
         y="83.234482" /></text>
    <text
       xml:space="preserve"
       style="font-style:normal;font-weight:normal;font-size:10.5833px;line-height:1.25;font-family:sans-serif;fill:#000000;fill-opacity:1;stroke:#000000;stroke-width:0.264583;stroke-opacity:1"
       x="53.285995"
       y="-120.43597"
       id="text16033-5"
       transform="rotate(125.76329)"><tspan
         sodipodi:role="line"
         id="tspan16031-8"
         style="stroke-width:0.264583;stroke:#000000;stroke-opacity:1"
         x="53.285995"
         y="-120.43597">2</tspan></text>
    <text
       xml:space="preserve"
       style="font-style:normal;font-weight:normal;font-size:10.5833px;line-height:1.25;font-family:sans-serif;fill:#000000;fill-opacity:1;stroke:#000000;stroke-width:0.264583;stroke-opacity:1"
       x="134.40854"
       y="-14.271304"
       id="text16033-70"
       transform="rotate(58.802298)"><tspan
         sodipodi:role="line"
         id="tspan16031-010"
         style="stroke-width:0.264583;stroke:#000000;stroke-opacity:1"
         x="134.40854"
         y="-14.271304">12</tspan></text>
    <text
       xml:space="preserve"
       style="font-style:normal;font-weight:normal;font-size:10.5833px;line-height:1.25;font-family:sans-serif;fill:#000000;fill-opacity:1;stroke:#000000;stroke-width:0.264583;stroke-opacity:1"
       x="-162.49884"
       y="39.965984"
       id="text16033-59"
       inkscape:transform-center-x="17.154022"
       inkscape:transform-center-y="-6.8317799"
       transform="rotate(-118.55125)"><tspan
         sodipodi:role="line"
         id="tspan16031-80"
         style="stroke-width:0.264583;stroke:#000000;stroke-opacity:1"
         x="-162.49884"
         y="39.965984">15</tspan><tspan
         sodipodi:role="line"
         style="stroke-width:0.264583;stroke:#000000;stroke-opacity:1"
         x="-162.49884"
         y="53.19511"
         id="tspan42037" /></text>
    <text
       xml:space="preserve"
       style="font-style:normal;font-weight:normal;font-size:10.5833px;line-height:1.25;font-family:sans-serif;fill:#000000;fill-opacity:1;stroke:#000000;stroke-width:0.264583;stroke-opacity:1"
       x="-79.624146"
       y="-134.87886"
       id="text43811"
       transform="rotate(-177.82145)"><tspan
         sodipodi:role="line"
         id="tspan43809"
         style="stroke-width:0.264583;stroke:#000000;stroke-opacity:1"
         x="-79.624146"
         y="-134.87886">18</tspan></text>
    <text
       xml:space="preserve"
       style="font-style:normal;font-weight:normal;font-size:10.5833px;line-height:1.25;font-family:sans-serif;fill:#000000;fill-opacity:1;stroke:#000000;stroke-width:0.264583;stroke-opacity:1"
       x="-57.566711"
       y="173.20502"
       id="text16033-55"
       transform="rotate(-55.288533)"><tspan
         sodipodi:role="line"
         id="tspan16031-81"
         style="stroke-width:0.264583;stroke:#000000;stroke-opacity:1"
         x="-57.566711"
         y="173.20502">5</tspan></text>
    <text
       xml:space="preserve"
       style="font-style:normal;font-weight:normal;font-size:10.5833px;line-height:1.25;font-family:sans-serif;fill:#000000;fill-opacity:1;stroke:#000000;stroke-width:0.264583;stroke-opacity:1"
       x="-196.72533"
       y="43.51825"
       id="text16033-2"
       transform="rotate(-117.96544)"><tspan
         sodipodi:role="line"
         id="tspan16031-2"
         style="stroke-width:0.264583;stroke:#000000;stroke-opacity:1"
         x="-196.72533"
         y="43.51825">13</tspan></text>
    <text
       xml:space="preserve"
       style="font-style:normal;font-weight:normal;font-size:10.5833px;line-height:1.25;font-family:sans-serif;fill:#000000;fill-opacity:1;stroke:#000000;stroke-width:0.264583;stroke-opacity:1"
       x="183.52303"
       y="-71.063728"
       id="text16033-26"
       transform="rotate(66.756858)"><tspan
         sodipodi:role="line"
         id="tspan16031-44"
         style="stroke-width:0.264583;stroke:#000000;stroke-opacity:1"
         x="183.52303"
         y="-71.063728">1</tspan></text>
    <text
       xml:space="preserve"
       style="font-style:normal;font-weight:normal;font-size:10.5833px;line-height:1.25;font-family:sans-serif;fill:#000000;fill-opacity:1;stroke:#000000;stroke-width:0.264583;stroke-opacity:1"
       x="139.77411"
       y="122.44388"
       id="text16033-02"><tspan
         sodipodi:role="line"
         id="tspan16031-9"
         style="stroke-width:0.264583;stroke:#000000;stroke-opacity:1"
         x="139.77411"
         y="122.44388">7</tspan></text>
    <text
       xml:space="preserve"
       style="font-style:normal;font-weight:normal;font-size:10.5833px;line-height:1.25;font-family:sans-serif;fill:#000000;fill-opacity:1;stroke:#000000;stroke-width:0.264583;stroke-opacity:1"
       x="52.784454"
       y="-207.78728"
       id="text16033-098"
       transform="rotate(117.53475)"
       inkscape:transform-center-x="3.4395833"
       inkscape:transform-center-y="-1.7197917"><tspan
         sodipodi:role="line"
         id="tspan16031-75"
         style="stroke-width:0.264583;stroke:#000000;stroke-opacity:1"
         x="52.784454"
         y="-207.78728">19</tspan></text>
    <text
       xml:space="preserve"
       style="font-style:normal;font-weight:normal;font-size:10.5833px;line-height:1.25;font-family:sans-serif;fill:#000000;fill-opacity:1;stroke:#000000;stroke-width:0.264583;stroke-opacity:1"
       x="212.09314"
       y="-76.453125"
       id="text16033-22"
       transform="rotate(58.477552)"
       inkscape:transform-center-x="-0.52916667"
       inkscape:transform-center-y="4.7625"><tspan
         sodipodi:role="line"
         id="tspan16031-88"
         style="stroke-width:0.264583;stroke:#000000;stroke-opacity:1"
         x="212.09314"
         y="-76.453125">3</tspan></text>
    <text
       xml:space="preserve"
       style="font-style:normal;font-weight:normal;font-size:10.5833px;line-height:1.25;font-family:sans-serif;fill:#000000;fill-opacity:1;stroke:#000000;stroke-width:0.264583;stroke-opacity:1"
       x="102.99702"
       y="187.53136"
       id="text16033-4"><tspan
         sodipodi:role="line"
         id="tspan16031-04"
         style="stroke-width:0.264583;stroke:#000000;stroke-opacity:1"
         x="102.99702"
         y="187.53136">4</tspan></text>
    <text
       xml:space="preserve"
       style="font-style:normal;font-weight:normal;font-size:10.5833px;line-height:1.25;font-family:sans-serif;fill:#000000;fill-opacity:1;stroke:#000000;stroke-width:0.264583;stroke-opacity:1"
       x="-131.34602"
       y="-166.84857"
       id="text16033-6"
       transform="rotate(-179.80425)"><tspan
         sodipodi:role="line"
         id="tspan16031-6"
         style="stroke-width:0.264583;stroke:#000000;stroke-opacity:1"
         x="-131.34602"
         y="-166.84857">11</tspan></text>
    <text
       xml:space="preserve"
       style="font-style:normal;font-weight:normal;font-size:10.5833px;line-height:1.25;font-family:sans-serif;fill:#000000;fill-opacity:1;stroke:#000000;stroke-width:0.264583;stroke-opacity:1"
       x="-233.31097"
       y="39.036007"
       id="text62687"
       transform="rotate(-119.15389)"
       inkscape:transform-center-x="1.7197917"
       inkscape:transform-center-y="-3.7041667"><tspan
         sodipodi:role="line"
         id="tspan62685"
         style="stroke-width:0.264583;stroke:#000000;stroke-opacity:1"
         x="-233.31097"
         y="39.036007">9</tspan></text>
    <text
       xml:space="preserve"
       style="font-style:normal;font-weight:normal;font-size:10.5833px;line-height:1.25;font-family:sans-serif;fill:#000000;fill-opacity:1;stroke:#000000;stroke-width:0.264583;stroke-opacity:1"
       x="230.09178"
       y="-82.628197"
       id="text16033-49"
       transform="rotate(75.085813)"
       inkscape:transform-center-x="-2.2489583"
       inkscape:transform-center-y="-1.984375"><tspan
         sodipodi:role="line"
         style="stroke-width:0.264583;stroke:#000000;stroke-opacity:1"
         x="230.09178"
         y="-82.628197"
         id="tspan65882">6</tspan></text>
    <text
       xml:space="preserve"
       style="font-style:normal;font-weight:normal;font-size:10.5833px;line-height:1.25;font-family:sans-serif;fill:#000000;fill-opacity:1;stroke:#000000;stroke-width:0.264583;stroke-opacity:1"
       x="244.46507"
       y="-16.55703"
       id="text16033-25"
       transform="rotate(59.574492)"
       inkscape:transform-center-x="4.1010417"
       inkscape:transform-center-y="-1.7197917"><tspan
         sodipodi:role="line"
         id="tspan16031-1"
         style="stroke-width:0.264583;stroke:#000000;stroke-opacity:1"
         x="244.46507"
         y="-16.55703">_</tspan></text>
    <text
       xml:space="preserve"
       style="font-style:normal;font-weight:normal;font-size:10.5833px;line-height:1.25;font-family:sans-serif;fill:#000000;fill-opacity:1;stroke:#000000;stroke-width:0.264583;stroke-opacity:1"
       x="228.01309"
       y="-37.21629"
       id="text16033-25-4"
       transform="rotate(59.574492)"
       inkscape:transform-center-x="4.1010417"
       inkscape:transform-center-y="-1.7197917"><tspan
         sodipodi:role="line"
         id="tspan16031-1-2"
         style="stroke-width:0.264583;stroke:#000000;stroke-opacity:1"
         x="228.01309"
         y="-37.21629">_</tspan></text>
    <path
       style="fill:none;stroke:#ff0000;stroke-width:0.264583px;stroke-linecap:butt;stroke-linejoin:miter;stroke-opacity:1"
       d="m 14.545056,67.476515 17.956522,31.95693 36.877645,-0.223129 -18.14862,31.732214 18.14862,31.28595 18.08997,-31.25989 18.983887,31.2599 -18.148621,31.73221 36.685541,-0.22313 18.53693,31.50909 18.14862,-31.73222 -18.53692,-31.50909 36.68554,-0.22313 18.14862,-31.28596 -36.68554,-0.22313 L 142.75032,98.764052 124.6017,130.49627 106.06477,98.987183 124.21339,67.701225 87.527843,67.478094 68.990916,35.969014 50.842296,67.701231 14.545056,67.476515"
       id="path73152"
       sodipodi:nodetypes="ccccccccccccccccccccccc" />
  </g>
</svg>
