<?xml version="1.0" encoding="UTF-8" standalone="no"?>
<!-- Created with Inkscape (http://www.inkscape.org/) -->

<svg
   width="841mm"
   height="1189mm"
   viewBox="0 0 841 1189"
   version="1.1"
   id="svg58"
   inkscape:version="1.1.1 (3bf5ae0d25, 2021-09-20)"
   sodipodi:docname="Découpe panneau solaire tout.svg"
   xmlns:inkscape="http://www.inkscape.org/namespaces/inkscape"
   xmlns:sodipodi="http://sodipodi.sourceforge.net/DTD/sodipodi-0.dtd"
   xmlns="http://www.w3.org/2000/svg"
   xmlns:svg="http://www.w3.org/2000/svg">
  <sodipodi:namedview
     id="namedview60"
     pagecolor="#ffffff"
     bordercolor="#666666"
     borderopacity="1.0"
     inkscape:pageshadow="2"
     inkscape:pageopacity="0.0"
     inkscape:pagecheckerboard="0"
     inkscape:document-units="mm"
     showgrid="false"
     inkscape:zoom="0.16013082"
     inkscape:cx="1117.836"
     inkscape:cy="1932.7947"
     inkscape:window-width="1274"
     inkscape:window-height="961"
     inkscape:window-x="-9"
     inkscape:window-y="1800"
     inkscape:window-maximized="0"
     inkscape:current-layer="layer1" />
  <defs
     id="defs55" />
  <g
     inkscape:label="Calque 1"
     inkscape:groupmode="layer"
     id="layer1">
    <path
       style="fill:none;stroke:#000000;stroke-width:0.264583px;stroke-linecap:butt;stroke-linejoin:miter;stroke-opacity:1"
       d="m 30.495131,15.211403 h 30 v 3 h 5 v -3 h 5 v 3 h 5 c 0.0127,3.64054 0.1444,3.36305 0,7 h -1.2 v 2.24971 h 1.2 v 4.75029 h 3"
       id="path857"
       sodipodi:nodetypes="cccccccccccccc"
       inkscape:export-filename="C:\Users\alexs\alex.stoesser\docs\imageprojetfinal\decoupe.png"
       inkscape:export-xdpi="96"
       inkscape:export-ydpi="96" />
    <path
       style="fill:none;stroke:#000000;stroke-width:0.264583px;stroke-linecap:butt;stroke-linejoin:miter;stroke-opacity:1"
       d="M 230.49513,15.211403 H 93.495131 v 3 h -5 v -3 h -5 v 3 h -5 c -0.0127,3.64054 -0.1444,3.36305 0,7 h 1.2 v 2.24971 h -1.2 v 4.75029"
       id="path857-9"
       sodipodi:nodetypes="ccccccccccccc"
       inkscape:export-filename="C:\Users\alexs\alex.stoesser\docs\imageprojetfinal\decoupe.png"
       inkscape:export-xdpi="96"
       inkscape:export-ydpi="96" />
    <path
       style="fill:none;stroke:#000000;stroke-width:0.264583px;stroke-linecap:butt;stroke-linejoin:miter;stroke-opacity:1"
       d="m 430.49513,15.211403 h -30 v 3 h -5 v -3 h -5 v 3 h -5 c -0.0127,3.64054 -0.1444,3.36305 0,7 h 1.2 v 2.24971 h -1.2 v 4.75029 h -3"
       id="path857-6"
       sodipodi:nodetypes="cccccccccccccc"
       inkscape:export-filename="C:\Users\alexs\alex.stoesser\docs\imageprojetfinal\decoupe.png"
       inkscape:export-xdpi="96"
       inkscape:export-ydpi="96" />
    <path
       style="fill:none;stroke:#000000;stroke-width:0.264583px;stroke-linecap:butt;stroke-linejoin:miter;stroke-opacity:1"
       d="m 230.49513,15.211403 h 137 v 3 h 5 v -3 h 5 v 3 h 5 c 0.0127,3.64054 0.1444,3.36305 0,7 h -1.2 v 2.24971 h 1.2 v 4.75029"
       id="path857-9-4"
       sodipodi:nodetypes="ccccccccccccc"
       inkscape:export-filename="C:\Users\alexs\alex.stoesser\docs\imageprojetfinal\decoupe.png"
       inkscape:export-xdpi="96"
       inkscape:export-ydpi="96" />
    <g
       id="g1305"
       transform="translate(14.457591,114.66829)"
       inkscape:export-filename="C:\Users\alexs\alex.stoesser\docs\imageprojetfinal\decoupe.png"
       inkscape:export-xdpi="96"
       inkscape:export-ydpi="96">
      <path
         style="fill:none;stroke:#000000;stroke-width:0.264583px;stroke-linecap:butt;stroke-linejoin:miter;stroke-opacity:1"
         d="m 16.037544,300.54311 h 30 v -3 h 5 v 3 h 5 v -3 h 5 c 0.0127,-3.64054 0.1444,-3.36305 0,-7 h -1.2 v -2.24971 h 1.2 v -4.75029 h 3"
         id="path857-62"
         sodipodi:nodetypes="cccccccccccccc" />
      <path
         style="fill:none;stroke:#000000;stroke-width:0.264583px;stroke-linecap:butt;stroke-linejoin:miter;stroke-opacity:1"
         d="M 216.03754,300.54311 H 79.037544 v -3 h -5 v 3 h -5 v -3 h -5 c -0.0127,-3.64054 -0.1444,-3.36305 0,-7 h 1.2 v -2.24971 h -1.2 v -4.75029"
         id="path857-9-3"
         sodipodi:nodetypes="ccccccccccccc" />
      <path
         style="fill:none;stroke:#000000;stroke-width:0.264583px;stroke-linecap:butt;stroke-linejoin:miter;stroke-opacity:1"
         d="m 416.03754,300.54311 h -30 v -3 h -5 v 3 h -5 v -3 h -5 c -0.0127,-3.64054 -0.1444,-3.36305 0,-7 h 1.2 v -2.24971 h -1.2 v -4.75029 h -3"
         id="path857-6-0"
         sodipodi:nodetypes="cccccccccccccc" />
      <path
         style="fill:none;stroke:#000000;stroke-width:0.264583px;stroke-linecap:butt;stroke-linejoin:miter;stroke-opacity:1"
         d="m 216.03754,300.54311 h 137 v -3 h 5 v 3 h 5 v -3 h 5 c 0.0127,-3.64054 0.1444,-3.36305 0,-7 h -1.2 v -2.24971 h 1.2 v -4.75029"
         id="path857-9-4-8"
         sodipodi:nodetypes="ccccccccccccc" />
    </g>
    <g
       id="g1305-1"
       transform="rotate(90,165.93219,165.10605)"
       inkscape:export-filename="C:\Users\alexs\alex.stoesser\docs\imageprojetfinal\decoupe.png"
       inkscape:export-xdpi="96"
       inkscape:export-ydpi="96">
      <path
         style="fill:none;stroke:#000000;stroke-width:0.264583px;stroke-linecap:butt;stroke-linejoin:miter;stroke-opacity:1"
         d="m 16.037544,300.54311 h 30 v -3 h 5 v 3 h 5 v -3 h 5 c 0.0127,-3.64054 0.1444,-3.36305 0,-7 h -1.2 v -2.24971 h 1.2 v -4.75029 h 3"
         id="path857-62-0"
         sodipodi:nodetypes="cccccccccccccc" />
      <path
         style="fill:none;stroke:#000000;stroke-width:0.264583px;stroke-linecap:butt;stroke-linejoin:miter;stroke-opacity:1"
         d="M 216.03754,300.54311 H 79.037544 v -3 h -5 v 3 h -5 v -3 h -5 c -0.0127,-3.64054 -0.1444,-3.36305 0,-7 h 1.2 v -2.24971 h -1.2 v -4.75029"
         id="path857-9-3-4"
         sodipodi:nodetypes="ccccccccccccc" />
      <path
         style="fill:none;stroke:#000000;stroke-width:0.264583px;stroke-linecap:butt;stroke-linejoin:miter;stroke-opacity:1"
         d="m 416.03754,300.54311 h -30 v -3 h -5 v 3 h -5 v -3 h -5 c -0.0127,-3.64054 -0.1444,-3.36305 0,-7 h 1.2 v -2.24971 h -1.2 v -4.75029 h -3"
         id="path857-6-0-9"
         sodipodi:nodetypes="cccccccccccccc" />
      <path
         style="fill:none;stroke:#000000;stroke-width:0.264583px;stroke-linecap:butt;stroke-linejoin:miter;stroke-opacity:1"
         d="m 216.03754,300.54311 h 137 v -3 h 5 v 3 h 5 v -3 h 5 c 0.0127,-3.64054 0.1444,-3.36305 0,-7 h -1.2 v -2.24971 h 1.2 v -4.75029"
         id="path857-9-4-8-9"
         sodipodi:nodetypes="ccccccccccccc" />
    </g>
    <g
       id="g1305-3"
       transform="rotate(-90,280.60048,150.64846)"
       inkscape:export-filename="C:\Users\alexs\alex.stoesser\docs\imageprojetfinal\decoupe.png"
       inkscape:export-xdpi="96"
       inkscape:export-ydpi="96">
      <path
         style="fill:none;stroke:#000000;stroke-width:0.264583px;stroke-linecap:butt;stroke-linejoin:miter;stroke-opacity:1"
         d="m 16.037544,300.54311 h 30 v -3 h 5 v 3 h 5 v -3 h 5 c 0.0127,-3.64054 0.1444,-3.36305 0,-7 h -1.2 v -2.24971 h 1.2 v -4.75029 h 3"
         id="path857-62-5"
         sodipodi:nodetypes="cccccccccccccc" />
      <path
         style="fill:none;stroke:#000000;stroke-width:0.264583px;stroke-linecap:butt;stroke-linejoin:miter;stroke-opacity:1"
         d="M 216.03754,300.54311 H 79.037544 v -3 h -5 v 3 h -5 v -3 h -5 c -0.0127,-3.64054 -0.1444,-3.36305 0,-7 h 1.2 v -2.24971 h -1.2 v -4.75029"
         id="path857-9-3-1"
         sodipodi:nodetypes="ccccccccccccc" />
      <path
         style="fill:none;stroke:#000000;stroke-width:0.264583px;stroke-linecap:butt;stroke-linejoin:miter;stroke-opacity:1"
         d="m 416.03754,300.54311 h -30 v -3 h -5 v 3 h -5 v -3 h -5 c -0.0127,-3.64054 -0.1444,-3.36305 0,-7 h 1.2 v -2.24971 h -1.2 v -4.75029 h -3"
         id="path857-6-0-6"
         sodipodi:nodetypes="cccccccccccccc" />
      <path
         style="fill:none;stroke:#000000;stroke-width:0.264583px;stroke-linecap:butt;stroke-linejoin:miter;stroke-opacity:1"
         d="m 216.03754,300.54311 h 137 v -3 h 5 v 3 h 5 v -3 h 5 c 0.0127,-3.64054 0.1444,-3.36305 0,-7 h -1.2 v -2.24971 h 1.2 v -4.75029"
         id="path857-9-4-8-8"
         sodipodi:nodetypes="ccccccccccccc" />
    </g>
    <path
       style="fill:none;stroke:#000000;stroke-width:0.264583px;stroke-linecap:butt;stroke-linejoin:miter;stroke-opacity:1"
       d="m 596.6911,19.450634 v 26.4997 h 4 v 6 h -4 v 4 h 4 v 14 h -4 v 4 h 4 v 6 h -4 V 216.45062"
       id="path9322"
       sodipodi:nodetypes="cccccccccccccc"
       inkscape:export-filename="C:\Users\alexs\alex.stoesser\docs\imageprojetfinal\decoupe.png"
       inkscape:export-xdpi="96"
       inkscape:export-ydpi="96" />
    <circle
       style="fill:none;fill-opacity:1;stroke:#000000;stroke-width:0.327139;stroke-opacity:1"
       id="path12478"
       cx="62.851345"
       cy="-598.1911"
       r="1.2364305"
       transform="rotate(90)"
       inkscape:export-filename="C:\Users\alexs\alex.stoesser\docs\imageprojetfinal\decoupe.png"
       inkscape:export-xdpi="96"
       inkscape:export-ydpi="96" />
    <path
       style="fill:none;stroke:#000000;stroke-width:0.264583px;stroke-linecap:butt;stroke-linejoin:miter;stroke-opacity:1"
       d="m 596.6911,416.45062 v -29.50029 h 4 v -6 h -4 v -4 h 4 v -14 h -4 v -4 h 4 v -6 h -4 V 216.45062"
       id="path9322-5"
       sodipodi:nodetypes="cccccccccccccc"
       inkscape:export-filename="C:\Users\alexs\alex.stoesser\docs\imageprojetfinal\decoupe.png"
       inkscape:export-xdpi="96"
       inkscape:export-ydpi="96" />
    <circle
       style="fill:none;fill-opacity:1;stroke:#000000;stroke-width:0.327139;stroke-opacity:1"
       id="path12478-2"
       cx="-369.94934"
       cy="-598.1911"
       r="1.2364305"
       transform="matrix(0,-1,-1,0,0,0)"
       inkscape:export-filename="C:\Users\alexs\alex.stoesser\docs\imageprojetfinal\decoupe.png"
       inkscape:export-xdpi="96"
       inkscape:export-ydpi="96" />
    <path
       style="fill:none;stroke:#000000;stroke-width:0.264583px;stroke-linecap:butt;stroke-linejoin:miter;stroke-opacity:1"
       d="m 556.69137,16.450634 h 6.99973 v 3 h 5 v -3 h 5 v 3 h 5 c 0.0127,3.64054 0.1444,3.36305 0,6.99999 h -1.2 v 2.24972 h 1.2 v 4.75028 h 3"
       id="path857-6-7"
       sodipodi:nodetypes="cccccccccccccc"
       inkscape:export-filename="C:\Users\alexs\alex.stoesser\docs\imageprojetfinal\decoupe.png"
       inkscape:export-xdpi="96"
       inkscape:export-ydpi="96" />
    <path
       style="fill:none;stroke:#000000;stroke-width:0.264583px;stroke-linecap:butt;stroke-linejoin:miter;stroke-opacity:1"
       d="m 596.6911,19.450634 h -5 v -3 h -5 v 3 h -5 c -0.0127,3.64054 -0.1444,3.36305 0,6.99999 h 1.2 v 2.24972 h -1.2 v 4.75028"
       id="path857-6-8"
       sodipodi:nodetypes="ccccccccccc"
       inkscape:export-filename="C:\Users\alexs\alex.stoesser\docs\imageprojetfinal\decoupe.png"
       inkscape:export-xdpi="96"
       inkscape:export-ydpi="96" />
    <g
       id="g4271"
       transform="rotate(180,442.53238,216.72601)"
       inkscape:export-filename="C:\Users\alexs\alex.stoesser\docs\imageprojetfinal\decoupe.png"
       inkscape:export-xdpi="96"
       inkscape:export-ydpi="96">
      <path
         style="fill:none;stroke:#000000;stroke-width:0.264583px;stroke-linecap:butt;stroke-linejoin:miter;stroke-opacity:1"
         d="m 288.37364,17.001392 h 6.0005 v 4 h 4 v -4 h 14 v 4 h 4 v -4 h 6 v 4 h 5.99924"
         id="path9322-58"
         sodipodi:nodetypes="cccccccccccc" />
      <circle
         style="fill:none;fill-opacity:1;stroke:#000000;stroke-width:0.327139;stroke-opacity:1"
         id="path12478-8"
         cx="305.27515"
         cy="19.501392"
         r="1.2364305" />
    </g>
    <path
       style="fill:none;stroke:#000000;stroke-width:0.264583px;stroke-linecap:butt;stroke-linejoin:miter;stroke-opacity:1"
       d="m 556.69137,16.450634 v 29.99999 h 3 v 5 h -3 v 5 h 3 v 5 c 3.64054,0.0127 3.36304,0.1444 7,0 v -1.2 h 2.2497 v 1.2 h 4.7503 v 3"
       id="path857-87"
       sodipodi:nodetypes="cccccccccccccc"
       inkscape:export-filename="C:\Users\alexs\alex.stoesser\docs\imageprojetfinal\decoupe.png"
       inkscape:export-xdpi="96"
       inkscape:export-ydpi="96" />
    <path
       style="fill:none;stroke:#000000;stroke-width:0.264583px;stroke-linecap:butt;stroke-linejoin:miter;stroke-opacity:1"
       d="M 556.69137,216.45062 V 79.450624 h 3 v -5 h -3 v -5 h 3 v -5 c 3.64054,-0.0127 3.36304,-0.14439 7,0 v 1.20001 h 2.2497 v -1.20001 h 4.7503"
       id="path857-9-65"
       sodipodi:nodetypes="ccccccccccccc"
       inkscape:export-filename="C:\Users\alexs\alex.stoesser\docs\imageprojetfinal\decoupe.png"
       inkscape:export-xdpi="96"
       inkscape:export-ydpi="96" />
    <path
       style="fill:none;stroke:#000000;stroke-width:0.264583px;stroke-linecap:butt;stroke-linejoin:miter;stroke-opacity:1"
       d="m 556.69136,412.45062 10e-6,-26 h 3 v -5 h -3 v -5 h 3 v -5 c 3.64054,-0.0127 3.36304,-0.1444 7,0 v 1.2 h 2.24971 v -1.2 h 4.75029 v -3"
       id="path857-8"
       sodipodi:nodetypes="cccccccccccccc"
       inkscape:export-filename="C:\Users\alexs\alex.stoesser\docs\imageprojetfinal\decoupe.png"
       inkscape:export-xdpi="96"
       inkscape:export-ydpi="96" />
    <path
       style="fill:none;stroke:#000000;stroke-width:0.264583px;stroke-linecap:butt;stroke-linejoin:miter;stroke-opacity:1"
       d="m 556.69137,216.45062 v 137 h 3 v 5 h -3 v 5 h 3 v 5 c 3.64054,0.0127 3.36304,0.14441 7,0 v -1.2 h 2.24971 v 1.2 h 4.75029"
       id="path857-9-6"
       sodipodi:nodetypes="ccccccccccccc"
       inkscape:export-filename="C:\Users\alexs\alex.stoesser\docs\imageprojetfinal\decoupe.png"
       inkscape:export-xdpi="96"
       inkscape:export-ydpi="96" />
    <path
       style="fill:none;stroke:#000000;stroke-width:0.264583px;stroke-linecap:butt;stroke-linejoin:miter;stroke-opacity:1"
       d="m 576.69139,116.65033 v 199.6 h -2.978 l -0.002,-199.6 z"
       id="path10751"
       sodipodi:nodetypes="ccccc"
       inkscape:export-filename="C:\Users\alexs\alex.stoesser\docs\imageprojetfinal\decoupe.png"
       inkscape:export-xdpi="96"
       inkscape:export-ydpi="96" />
    <path
       style="fill:none;stroke:#000000;stroke-width:0.264583px;stroke-linecap:butt;stroke-linejoin:miter;stroke-opacity:1"
       d="m 551.6911,19.450624 v 26.4997 h 4 v 6 h -4 v 4 h 4 v 14 h -4 v 4 h 4 v 6 h -4 V 216.45061"
       id="path9322-8"
       sodipodi:nodetypes="cccccccccccccc"
       inkscape:export-filename="C:\Users\alexs\alex.stoesser\docs\imageprojetfinal\decoupe.png"
       inkscape:export-xdpi="96"
       inkscape:export-ydpi="96" />
    <circle
       style="fill:none;fill-opacity:1;stroke:#000000;stroke-width:0.327139;stroke-opacity:1"
       id="path12478-5"
       cx="62.851315"
       cy="-553.1911"
       r="1.2364305"
       transform="rotate(90)"
       inkscape:export-filename="C:\Users\alexs\alex.stoesser\docs\imageprojetfinal\decoupe.png"
       inkscape:export-xdpi="96"
       inkscape:export-ydpi="96" />
    <path
       style="fill:none;stroke:#000000;stroke-width:0.264583px;stroke-linecap:butt;stroke-linejoin:miter;stroke-opacity:1"
       d="m 551.6911,416.45061 v -29.50029 h 4 v -6 h -4 v -4 h 4 v -14 h -4 v -4 h 4 v -6 h -4 V 216.45061"
       id="path9322-5-9"
       sodipodi:nodetypes="cccccccccccccc"
       inkscape:export-filename="C:\Users\alexs\alex.stoesser\docs\imageprojetfinal\decoupe.png"
       inkscape:export-xdpi="96"
       inkscape:export-ydpi="96" />
    <circle
       style="fill:none;fill-opacity:1;stroke:#000000;stroke-width:0.327139;stroke-opacity:1"
       id="path12478-2-4"
       cx="-369.94934"
       cy="-553.1911"
       r="1.2364305"
       transform="matrix(0,-1,-1,0,0,0)"
       inkscape:export-filename="C:\Users\alexs\alex.stoesser\docs\imageprojetfinal\decoupe.png"
       inkscape:export-xdpi="96"
       inkscape:export-ydpi="96" />
    <path
       style="fill:none;stroke:#000000;stroke-width:0.264583px;stroke-linecap:butt;stroke-linejoin:miter;stroke-opacity:1"
       d="m 511.69137,16.450624 h 6.99973 v 3 h 5 v -3 h 5 v 3 h 5 c 0.0127,3.64054 0.1444,3.36305 0,7 h -1.2 v 2.24971 h 1.2 v 4.75029 h 3"
       id="path857-6-3"
       sodipodi:nodetypes="cccccccccccccc"
       inkscape:export-filename="C:\Users\alexs\alex.stoesser\docs\imageprojetfinal\decoupe.png"
       inkscape:export-xdpi="96"
       inkscape:export-ydpi="96" />
    <path
       style="fill:none;stroke:#000000;stroke-width:0.264583px;stroke-linecap:butt;stroke-linejoin:miter;stroke-opacity:1"
       d="m 551.6911,19.450624 h -5 v -3 h -5 v 3 h -5 c -0.0127,3.64054 -0.1444,3.36305 0,7 h 1.2 v 2.24971 h -1.2 v 4.75029"
       id="path857-6-8-9"
       sodipodi:nodetypes="ccccccccccc"
       inkscape:export-filename="C:\Users\alexs\alex.stoesser\docs\imageprojetfinal\decoupe.png"
       inkscape:export-xdpi="96"
       inkscape:export-ydpi="96" />
    <g
       id="g4271-9"
       transform="rotate(180,420.03238,216.72601)"
       inkscape:export-filename="C:\Users\alexs\alex.stoesser\docs\imageprojetfinal\decoupe.png"
       inkscape:export-xdpi="96"
       inkscape:export-ydpi="96">
      <path
         style="fill:none;stroke:#000000;stroke-width:0.264583px;stroke-linecap:butt;stroke-linejoin:miter;stroke-opacity:1"
         d="m 288.37364,17.001392 h 6.0005 v 4 h 4 v -4 h 14 v 4 h 4 v -4 h 6 v 4 h 5.99924"
         id="path9322-58-3"
         sodipodi:nodetypes="cccccccccccc" />
      <circle
         style="fill:none;fill-opacity:1;stroke:#000000;stroke-width:0.327139;stroke-opacity:1"
         id="path12478-8-0"
         cx="305.27515"
         cy="19.501392"
         r="1.2364305" />
    </g>
    <path
       style="fill:none;stroke:#000000;stroke-width:0.264583px;stroke-linecap:butt;stroke-linejoin:miter;stroke-opacity:1"
       d="m 511.69137,16.450624 v 30 h 3 v 5 h -3 v 5 h 3 v 5 c 3.64054,0.0127 3.36304,0.1444 7,0 v -1.2 h 2.2497 v 1.2 h 4.7503 v 3"
       id="path857-2"
       sodipodi:nodetypes="cccccccccccccc"
       inkscape:export-filename="C:\Users\alexs\alex.stoesser\docs\imageprojetfinal\decoupe.png"
       inkscape:export-xdpi="96"
       inkscape:export-ydpi="96" />
    <path
       style="fill:none;stroke:#000000;stroke-width:0.264583px;stroke-linecap:butt;stroke-linejoin:miter;stroke-opacity:1"
       d="M 511.69137,216.45061 V 79.450624 h 3 v -5 h -3 v -5 h 3 v -5 c 3.64054,-0.0127 3.36304,-0.1444 7,0 v 1.2 h 2.2497 v -1.2 h 4.7503"
       id="path857-9-2"
       sodipodi:nodetypes="ccccccccccccc"
       inkscape:export-filename="C:\Users\alexs\alex.stoesser\docs\imageprojetfinal\decoupe.png"
       inkscape:export-xdpi="96"
       inkscape:export-ydpi="96" />
    <path
       style="fill:none;stroke:#000000;stroke-width:0.264583px;stroke-linecap:butt;stroke-linejoin:miter;stroke-opacity:1"
       d="m 511.69136,412.45061 1e-5,-26 h 3 v -5 h -3 v -5 h 3 v -5 c 3.64054,-0.0127 3.36304,-0.1444 7,0 v 1.2 h 2.24971 v -1.2 h 4.75029 v -3"
       id="path857-8-4"
       sodipodi:nodetypes="cccccccccccccc"
       inkscape:export-filename="C:\Users\alexs\alex.stoesser\docs\imageprojetfinal\decoupe.png"
       inkscape:export-xdpi="96"
       inkscape:export-ydpi="96" />
    <path
       style="fill:none;stroke:#000000;stroke-width:0.264583px;stroke-linecap:butt;stroke-linejoin:miter;stroke-opacity:1"
       d="m 511.69137,216.45061 v 137 h 3 v 5 h -3 v 5 h 3 v 5 c 3.64054,0.0127 3.36304,0.14441 7,0 v -1.2 h 2.24971 v 1.2 h 4.75029"
       id="path857-9-6-7"
       sodipodi:nodetypes="ccccccccccccc"
       inkscape:export-filename="C:\Users\alexs\alex.stoesser\docs\imageprojetfinal\decoupe.png"
       inkscape:export-xdpi="96"
       inkscape:export-ydpi="96" />
    <path
       style="fill:none;stroke:#000000;stroke-width:0.264583px;stroke-linecap:butt;stroke-linejoin:miter;stroke-opacity:1"
       d="m 531.6914,116.65032 v 199.6 h -2.978 l -0.002,-199.6 z"
       id="path10751-7"
       sodipodi:nodetypes="ccccc"
       inkscape:export-filename="C:\Users\alexs\alex.stoesser\docs\imageprojetfinal\decoupe.png"
       inkscape:export-xdpi="96"
       inkscape:export-ydpi="96" />
    <path
       style="fill:none;stroke:#000000;stroke-width:0.264583px;stroke-linecap:butt;stroke-linejoin:miter;stroke-opacity:1"
       d="m 506.6911,19.450634 v 26.4997 h 4 v 6 h -4 v 4 h 4 v 14 h -4 v 4 h 4 v 6 h -4 V 216.45062"
       id="path9322-0"
       sodipodi:nodetypes="cccccccccccccc"
       inkscape:export-filename="C:\Users\alexs\alex.stoesser\docs\imageprojetfinal\decoupe.png"
       inkscape:export-xdpi="96"
       inkscape:export-ydpi="96" />
    <circle
       style="fill:none;fill-opacity:1;stroke:#000000;stroke-width:0.327139;stroke-opacity:1"
       id="path12478-55"
       cx="62.851345"
       cy="-508.1911"
       r="1.2364305"
       transform="rotate(90)"
       inkscape:export-filename="C:\Users\alexs\alex.stoesser\docs\imageprojetfinal\decoupe.png"
       inkscape:export-xdpi="96"
       inkscape:export-ydpi="96" />
    <path
       style="fill:none;stroke:#000000;stroke-width:0.264583px;stroke-linecap:butt;stroke-linejoin:miter;stroke-opacity:1"
       d="m 506.6911,416.45062 v -29.50029 h 4 v -6 h -4 v -4 h 4 v -14 h -4 v -4 h 4 v -6 h -4 V 216.45062"
       id="path9322-5-4"
       sodipodi:nodetypes="cccccccccccccc"
       inkscape:export-filename="C:\Users\alexs\alex.stoesser\docs\imageprojetfinal\decoupe.png"
       inkscape:export-xdpi="96"
       inkscape:export-ydpi="96" />
    <circle
       style="fill:none;fill-opacity:1;stroke:#000000;stroke-width:0.327139;stroke-opacity:1"
       id="path12478-2-9"
       cx="-369.94934"
       cy="-508.1911"
       r="1.2364305"
       transform="matrix(0,-1,-1,0,0,0)"
       inkscape:export-filename="C:\Users\alexs\alex.stoesser\docs\imageprojetfinal\decoupe.png"
       inkscape:export-xdpi="96"
       inkscape:export-ydpi="96" />
    <path
       style="fill:none;stroke:#000000;stroke-width:0.264583px;stroke-linecap:butt;stroke-linejoin:miter;stroke-opacity:1"
       d="m 466.69137,16.450634 h 6.99973 v 3 h 5 v -3 h 5 v 3 h 5 c 0.0127,3.64054 0.1444,3.36305 0,7 h -1.19999 v 2.24971 h 1.19999 v 4.75029 h 3"
       id="path857-6-4"
       sodipodi:nodetypes="cccccccccccccc"
       inkscape:export-filename="C:\Users\alexs\alex.stoesser\docs\imageprojetfinal\decoupe.png"
       inkscape:export-xdpi="96"
       inkscape:export-ydpi="96" />
    <path
       style="fill:none;stroke:#000000;stroke-width:0.264583px;stroke-linecap:butt;stroke-linejoin:miter;stroke-opacity:1"
       d="m 506.6911,19.450634 h -5 v -3 h -5 v 3 h -5 c -0.0127,3.64054 -0.1444,3.36305 0,7 h 1.2 v 2.24971 h -1.2 v 4.75029"
       id="path857-6-8-2"
       sodipodi:nodetypes="ccccccccccc"
       inkscape:export-filename="C:\Users\alexs\alex.stoesser\docs\imageprojetfinal\decoupe.png"
       inkscape:export-xdpi="96"
       inkscape:export-ydpi="96" />
    <g
       id="g4271-4"
       transform="rotate(180,397.53238,216.72601)"
       inkscape:export-filename="C:\Users\alexs\alex.stoesser\docs\imageprojetfinal\decoupe.png"
       inkscape:export-xdpi="96"
       inkscape:export-ydpi="96">
      <path
         style="fill:none;stroke:#000000;stroke-width:0.264583px;stroke-linecap:butt;stroke-linejoin:miter;stroke-opacity:1"
         d="m 288.37364,17.001392 h 6.0005 v 4 h 4 v -4 h 14 v 4 h 4 v -4 h 6 v 4 h 5.99924"
         id="path9322-58-9"
         sodipodi:nodetypes="cccccccccccc" />
      <circle
         style="fill:none;fill-opacity:1;stroke:#000000;stroke-width:0.327139;stroke-opacity:1"
         id="path12478-8-2"
         cx="305.27515"
         cy="19.501392"
         r="1.2364305" />
    </g>
    <path
       style="fill:none;stroke:#000000;stroke-width:0.264583px;stroke-linecap:butt;stroke-linejoin:miter;stroke-opacity:1"
       d="m 466.69137,16.450634 v 30 h 3 v 5 h -3 v 5 h 3 v 5 c 3.64054,0.0127 3.36305,0.1444 7,0 v -1.2 h 2.24971 v 1.2 h 4.75029 v 3"
       id="path857-67"
       sodipodi:nodetypes="cccccccccccccc"
       inkscape:export-filename="C:\Users\alexs\alex.stoesser\docs\imageprojetfinal\decoupe.png"
       inkscape:export-xdpi="96"
       inkscape:export-ydpi="96" />
    <path
       style="fill:none;stroke:#000000;stroke-width:0.264583px;stroke-linecap:butt;stroke-linejoin:miter;stroke-opacity:1"
       d="M 466.69137,216.45062 V 79.450634 h 3 v -5 h -3 v -5 h 3 v -5 c 3.64054,-0.0127 3.36305,-0.1444 7,0 v 1.2 h 2.24971 v -1.2 h 4.75029"
       id="path857-9-9"
       sodipodi:nodetypes="ccccccccccccc"
       inkscape:export-filename="C:\Users\alexs\alex.stoesser\docs\imageprojetfinal\decoupe.png"
       inkscape:export-xdpi="96"
       inkscape:export-ydpi="96" />
    <path
       style="fill:none;stroke:#000000;stroke-width:0.264583px;stroke-linecap:butt;stroke-linejoin:miter;stroke-opacity:1"
       d="m 466.69136,412.45062 1e-5,-26 h 3 v -5 h -3 v -5 h 3 v -5 c 3.64054,-0.0127 3.36305,-0.1444 7,0 v 1.2 h 2.24971 v -1.2 h 4.75029 v -3"
       id="path857-8-6"
       sodipodi:nodetypes="cccccccccccccc"
       inkscape:export-filename="C:\Users\alexs\alex.stoesser\docs\imageprojetfinal\decoupe.png"
       inkscape:export-xdpi="96"
       inkscape:export-ydpi="96" />
    <path
       style="fill:none;stroke:#000000;stroke-width:0.264583px;stroke-linecap:butt;stroke-linejoin:miter;stroke-opacity:1"
       d="m 466.69137,216.45062 v 137 h 3 v 5 h -3 v 5 h 3 v 5 c 3.64054,0.0127 3.36305,0.14441 7,0 v -1.2 h 2.24971 v 1.2 h 4.75029"
       id="path857-9-6-3"
       sodipodi:nodetypes="ccccccccccccc"
       inkscape:export-filename="C:\Users\alexs\alex.stoesser\docs\imageprojetfinal\decoupe.png"
       inkscape:export-xdpi="96"
       inkscape:export-ydpi="96" />
    <path
       style="fill:none;stroke:#000000;stroke-width:0.264583px;stroke-linecap:butt;stroke-linejoin:miter;stroke-opacity:1"
       d="m 486.69139,116.65033 v 199.6 h -2.978 l -0.002,-199.6 z"
       id="path10751-3"
       sodipodi:nodetypes="ccccc"
       inkscape:export-filename="C:\Users\alexs\alex.stoesser\docs\imageprojetfinal\decoupe.png"
       inkscape:export-xdpi="96"
       inkscape:export-ydpi="96" />
    <path
       style="fill:none;stroke:#000000;stroke-width:0.264583px;stroke-linecap:butt;stroke-linejoin:miter;stroke-opacity:1"
       d="m 673.96093,21.102911 v 26.4997 h 4 v 6 h -4 v 4 h 4 v 14 h -4 v 4 h 4 v 6 h -4 V 218.1029"
       id="path9322-8-8"
       sodipodi:nodetypes="cccccccccccccc"
       inkscape:export-filename="C:\Users\alexs\alex.stoesser\docs\imageprojetfinal\decoupe.png"
       inkscape:export-xdpi="96"
       inkscape:export-ydpi="96" />
    <circle
       style="fill:none;fill-opacity:1;stroke:#000000;stroke-width:0.327139;stroke-opacity:1"
       id="path12478-5-3"
       cx="64.503609"
       cy="-675.46094"
       r="1.2364305"
       transform="rotate(90)"
       inkscape:export-filename="C:\Users\alexs\alex.stoesser\docs\imageprojetfinal\decoupe.png"
       inkscape:export-xdpi="96"
       inkscape:export-ydpi="96" />
    <path
       style="fill:none;stroke:#000000;stroke-width:0.264583px;stroke-linecap:butt;stroke-linejoin:miter;stroke-opacity:1"
       d="m 673.96093,418.1029 v -29.50029 h 4 v -6 h -4 v -4 h 4 v -14 h -4 v -4 h 4 v -6 h -4 V 218.1029"
       id="path9322-5-9-4"
       sodipodi:nodetypes="cccccccccccccc"
       inkscape:export-filename="C:\Users\alexs\alex.stoesser\docs\imageprojetfinal\decoupe.png"
       inkscape:export-xdpi="96"
       inkscape:export-ydpi="96" />
    <circle
       style="fill:none;fill-opacity:1;stroke:#000000;stroke-width:0.327139;stroke-opacity:1"
       id="path12478-2-4-6"
       cx="-371.60165"
       cy="-675.46094"
       r="1.2364305"
       transform="matrix(0,-1,-1,0,0,0)"
       inkscape:export-filename="C:\Users\alexs\alex.stoesser\docs\imageprojetfinal\decoupe.png"
       inkscape:export-xdpi="96"
       inkscape:export-ydpi="96" />
    <path
       style="fill:none;stroke:#000000;stroke-width:0.264583px;stroke-linecap:butt;stroke-linejoin:miter;stroke-opacity:1"
       d="m 633.9612,18.102911 h 6.99973 v 3 h 5 v -3 h 5 v 3 h 5 c 0.0127,3.64054 0.1444,3.36305 0,7 h -1.2 v 2.24971 h 1.2 v 4.75029 h 3"
       id="path857-6-3-7"
       sodipodi:nodetypes="cccccccccccccc"
       inkscape:export-filename="C:\Users\alexs\alex.stoesser\docs\imageprojetfinal\decoupe.png"
       inkscape:export-xdpi="96"
       inkscape:export-ydpi="96" />
    <path
       style="fill:none;stroke:#000000;stroke-width:0.264583px;stroke-linecap:butt;stroke-linejoin:miter;stroke-opacity:1"
       d="m 673.96093,21.102911 h -5 v -3 h -5 v 3 h -5 c -0.0127,3.64054 -0.1444,3.36305 0,7 h 1.2 v 2.24971 h -1.2 v 4.75029"
       id="path857-6-8-9-0"
       sodipodi:nodetypes="ccccccccccc"
       inkscape:export-filename="C:\Users\alexs\alex.stoesser\docs\imageprojetfinal\decoupe.png"
       inkscape:export-xdpi="96"
       inkscape:export-ydpi="96" />
    <g
       id="g4271-9-7"
       transform="rotate(180,481.16729,217.55216)"
       inkscape:export-filename="C:\Users\alexs\alex.stoesser\docs\imageprojetfinal\decoupe.png"
       inkscape:export-xdpi="96"
       inkscape:export-ydpi="96">
      <path
         style="fill:none;stroke:#000000;stroke-width:0.264583px;stroke-linecap:butt;stroke-linejoin:miter;stroke-opacity:1"
         d="m 288.37364,17.001392 h 6.0005 v 4 h 4 v -4 h 14 v 4 h 4 v -4 h 6 v 4 h 5.99924"
         id="path9322-58-3-9"
         sodipodi:nodetypes="cccccccccccc" />
      <circle
         style="fill:none;fill-opacity:1;stroke:#000000;stroke-width:0.327139;stroke-opacity:1"
         id="path12478-8-0-1"
         cx="305.27515"
         cy="19.501392"
         r="1.2364305" />
    </g>
    <path
       style="fill:none;stroke:#000000;stroke-width:0.264583px;stroke-linecap:butt;stroke-linejoin:miter;stroke-opacity:1"
       d="m 633.9612,18.102911 v 30 h 3 v 5 h -3 v 5 h 3 v 5 c 3.64054,0.0127 3.36304,0.1444 7,0 v -1.2 h 2.2497 v 1.2 h 4.7503 v 3"
       id="path857-2-0"
       sodipodi:nodetypes="cccccccccccccc"
       inkscape:export-filename="C:\Users\alexs\alex.stoesser\docs\imageprojetfinal\decoupe.png"
       inkscape:export-xdpi="96"
       inkscape:export-ydpi="96" />
    <path
       style="fill:none;stroke:#000000;stroke-width:0.264583px;stroke-linecap:butt;stroke-linejoin:miter;stroke-opacity:1"
       d="M 633.9612,218.1029 V 81.102911 h 3 v -5 h -3 v -5 h 3 v -5 c 3.64054,-0.0127 3.36304,-0.1444 7,0 v 1.2 h 2.2497 v -1.2 h 4.7503"
       id="path857-9-2-1"
       sodipodi:nodetypes="ccccccccccccc"
       inkscape:export-filename="C:\Users\alexs\alex.stoesser\docs\imageprojetfinal\decoupe.png"
       inkscape:export-xdpi="96"
       inkscape:export-ydpi="96" />
    <path
       style="fill:none;stroke:#000000;stroke-width:0.264583px;stroke-linecap:butt;stroke-linejoin:miter;stroke-opacity:1"
       d="m 633.96119,414.1029 10e-6,-26 h 3 v -5 h -3 v -5 h 3 v -5 c 3.64054,-0.0127 3.36304,-0.1444 7,0 v 1.2 h 2.24971 v -1.2 h 4.75029 v -3"
       id="path857-8-4-2"
       sodipodi:nodetypes="cccccccccccccc"
       inkscape:export-filename="C:\Users\alexs\alex.stoesser\docs\imageprojetfinal\decoupe.png"
       inkscape:export-xdpi="96"
       inkscape:export-ydpi="96" />
    <path
       style="fill:none;stroke:#000000;stroke-width:0.264583px;stroke-linecap:butt;stroke-linejoin:miter;stroke-opacity:1"
       d="m 633.9612,218.1029 v 137 h 3 v 5 h -3 v 5 h 3 v 5 c 3.64054,0.0127 3.36304,0.14441 7,0 v -1.2 h 2.24971 v 1.2 h 4.75029"
       id="path857-9-6-7-5"
       sodipodi:nodetypes="ccccccccccccc"
       inkscape:export-filename="C:\Users\alexs\alex.stoesser\docs\imageprojetfinal\decoupe.png"
       inkscape:export-xdpi="96"
       inkscape:export-ydpi="96" />
    <path
       style="fill:none;stroke:#000000;stroke-width:0.264583px;stroke-linecap:butt;stroke-linejoin:miter;stroke-opacity:1"
       d="m 653.96122,118.30261 v 199.6 h -2.978 l -0.002,-199.6 z"
       id="path10751-7-9"
       sodipodi:nodetypes="ccccc"
       inkscape:export-filename="C:\Users\alexs\alex.stoesser\docs\imageprojetfinal\decoupe.png"
       inkscape:export-xdpi="96"
       inkscape:export-ydpi="96" />
    <circle
       style="fill:none;stroke:#000000;stroke-width:0.27808;stroke-opacity:1"
       id="path224"
       cx="643.82886"
       cy="34.102623"
       r="5.86096"
       inkscape:export-filename="C:\Users\alexs\alex.stoesser\docs\imageprojetfinal\decoupe.png"
       inkscape:export-xdpi="96"
       inkscape:export-ydpi="96" />
    <circle
       style="fill:none;stroke:#000000;stroke-width:0.27808;stroke-opacity:1"
       id="path224-7"
       cx="643.82886"
       cy="402.1026"
       r="5.86096"
       inkscape:export-filename="C:\Users\alexs\alex.stoesser\docs\imageprojetfinal\decoupe.png"
       inkscape:export-xdpi="96"
       inkscape:export-ydpi="96" />
    <path
       style="fill:none;stroke:#000000;stroke-width:0.264583px;stroke-linecap:butt;stroke-linejoin:miter;stroke-opacity:1"
       d="m 434.17664,457.30876 v 26.5 h -4 v 6 h 4 v 4 h -4 v 14 h 4 v 4 h -4 v 6 h 4 v 136.5"
       id="path9322-5-9-4-3"
       sodipodi:nodetypes="cccccccccccccc"
       inkscape:export-filename="C:\Users\alexs\alex.stoesser\docs\imageprojetfinal\decoupe.png"
       inkscape:export-xdpi="96"
       inkscape:export-ydpi="96" />
    <circle
       style="fill:none;fill-opacity:1;stroke:#000000;stroke-width:0.327139;stroke-opacity:1"
       id="path12478-7"
       cx="432.67636"
       cy="500.80875"
       r="1.2364305"
       inkscape:export-filename="C:\Users\alexs\alex.stoesser\docs\imageprojetfinal\decoupe.png"
       inkscape:export-xdpi="96"
       inkscape:export-ydpi="96" />
    <path
       style="fill:none;stroke:#000000;stroke-width:0.264583px;stroke-linecap:butt;stroke-linejoin:miter;stroke-opacity:1"
       d="m 434.17664,851.30874 v -26.5 h -4 v -6 h 4 v -4 h -4 v -14 h 4 v -4 h -4 v -6 h 4 V 654.30876"
       id="path9322-5-9-4-3-5"
       sodipodi:nodetypes="cccccccccccccc"
       inkscape:export-filename="C:\Users\alexs\alex.stoesser\docs\imageprojetfinal\decoupe.png"
       inkscape:export-xdpi="96"
       inkscape:export-ydpi="96" />
    <circle
       style="fill:none;fill-opacity:1;stroke:#000000;stroke-width:0.327139;stroke-opacity:1"
       id="path12478-6"
       cx="432.67633"
       cy="-807.80878"
       r="1.2364305"
       transform="scale(1,-1)"
       inkscape:export-filename="C:\Users\alexs\alex.stoesser\docs\imageprojetfinal\decoupe.png"
       inkscape:export-xdpi="96"
       inkscape:export-ydpi="96" />
    <g
       id="g32944"
       transform="matrix(-1,0,0,1,871.51777,452.97737)"
       inkscape:export-filename="C:\Users\alexs\alex.stoesser\docs\imageprojetfinal\decoupe.png"
       inkscape:export-xdpi="96"
       inkscape:export-ydpi="96">
      <path
         style="fill:none;stroke:#000000;stroke-width:0.264583px;stroke-linecap:butt;stroke-linejoin:miter;stroke-opacity:1"
         d="M 43.341146,4.3313803 V 30.83138 h -4 v 6 h 4 v 4 h -4 v 14 h 4 v 4 h -4 v 6 h 4 v 136.5"
         id="path9322-5-9-4-3-1"
         sodipodi:nodetypes="cccccccccccccc" />
      <circle
         style="fill:none;fill-opacity:1;stroke:#000000;stroke-width:0.327139;stroke-opacity:1"
         id="path12478-2-8"
         cx="41.840855"
         cy="47.831379"
         r="1.2364305" />
      <path
         style="fill:none;stroke:#000000;stroke-width:0.264583px;stroke-linecap:butt;stroke-linejoin:miter;stroke-opacity:1"
         d="m 43.341146,398.33138 v -26.5 h -4 v -6 h 4 v -4 h -4 v -14 h 4 v -4 h -4 v -6 h 4 v -136.5"
         id="path9322-5-9-4-3-5-8"
         sodipodi:nodetypes="cccccccccccccc" />
      <circle
         style="fill:none;fill-opacity:1;stroke:#000000;stroke-width:0.327139;stroke-opacity:1"
         id="path12478-6-5"
         cx="41.840851"
         cy="-354.83139"
         transform="scale(1,-1)"
         r="1.2364305" />
    </g>
    <g
       id="g32944-0"
       transform="matrix(0,1,1,0,429.84526,413.96761)"
       inkscape:export-filename="C:\Users\alexs\alex.stoesser\docs\imageprojetfinal\decoupe.png"
       inkscape:export-xdpi="96"
       inkscape:export-ydpi="96">
      <path
         style="fill:none;stroke:#000000;stroke-width:0.264583px;stroke-linecap:butt;stroke-linejoin:miter;stroke-opacity:1"
         d="M 43.341146,4.3313803 V 30.83138 h -4 v 6 h 4 v 4 h -4 v 14 h 4 v 4 h -4 v 6 h 4 v 136.5"
         id="path9322-5-9-4-3-1-0"
         sodipodi:nodetypes="cccccccccccccc" />
      <circle
         style="fill:none;fill-opacity:1;stroke:#000000;stroke-width:0.327139;stroke-opacity:1"
         id="path12478-2-4-1"
         cx="41.840855"
         cy="47.831379"
         r="1.2364305" />
      <path
         style="fill:none;stroke:#000000;stroke-width:0.264583px;stroke-linecap:butt;stroke-linejoin:miter;stroke-opacity:1"
         d="m 43.341146,398.33138 v -26.5 h -4 v -6 h 4 v -4 h -4 v -14 h 4 v -4 h -4 v -6 h 4 v -136.5"
         id="path9322-5-9-4-3-5-8-2"
         sodipodi:nodetypes="cccccccccccccc" />
      <circle
         style="fill:none;fill-opacity:1;stroke:#000000;stroke-width:0.327139;stroke-opacity:1"
         id="path12478-6-5-7"
         cx="41.840851"
         cy="-354.83139"
         transform="scale(1,-1)"
         r="1.2364305" />
    </g>
    <g
       id="g32944-8"
       transform="matrix(0,-1,-1,0,832.508,894.64994)"
       inkscape:export-filename="C:\Users\alexs\alex.stoesser\docs\imageprojetfinal\decoupe.png"
       inkscape:export-xdpi="96"
       inkscape:export-ydpi="96">
      <path
         style="fill:none;stroke:#000000;stroke-width:0.264583px;stroke-linecap:butt;stroke-linejoin:miter;stroke-opacity:1"
         d="M 43.341146,4.3313803 V 30.83138 h -4 v 6 h 4 v 4 h -4 v 14 h 4 v 4 h -4 v 6 h 4 v 136.5"
         id="path9322-5-9-4-3-1-5"
         sodipodi:nodetypes="cccccccccccccc" />
      <circle
         style="fill:none;fill-opacity:1;stroke:#000000;stroke-width:0.327139;stroke-opacity:1"
         id="path12478-2-48"
         cx="41.840855"
         cy="47.831379"
         r="1.2364305" />
      <path
         style="fill:none;stroke:#000000;stroke-width:0.264583px;stroke-linecap:butt;stroke-linejoin:miter;stroke-opacity:1"
         d="m 43.341146,398.33138 v -26.5 h -4 v -6 h 4 v -4 h -4 v -14 h 4 v -4 h -4 v -6 h 4 v -136.5"
         id="path9322-5-9-4-3-5-8-6"
         sodipodi:nodetypes="cccccccccccccc" />
      <circle
         style="fill:none;fill-opacity:1;stroke:#000000;stroke-width:0.327139;stroke-opacity:1"
         id="path12478-6-5-8"
         cx="41.840851"
         cy="-354.83139"
         transform="scale(1,-1)"
         r="1.2364305" />
    </g>
    <path
       style="fill:none;stroke:#000000;stroke-width:0.264583px;stroke-linecap:butt;stroke-linejoin:miter;stroke-opacity:1"
       d="m 199.58016,473.30895 h 4 v 2 h -4 z"
       id="path1986"
       sodipodi:nodetypes="ccccc"
       inkscape:export-filename="C:\Users\alexs\alex.stoesser\docs\imageprojetfinal\decoupe.png"
       inkscape:export-xdpi="96"
       inkscape:export-ydpi="96" />
    <path
       style="fill:none;stroke:#000000;stroke-width:0.264583px;stroke-linecap:butt;stroke-linejoin:miter;stroke-opacity:1"
       d="m 199.58045,485.30895 h 4 v 2 h -4 z"
       id="path1986-2"
       sodipodi:nodetypes="ccccc"
       inkscape:export-filename="C:\Users\alexs\alex.stoesser\docs\imageprojetfinal\decoupe.png"
       inkscape:export-xdpi="96"
       inkscape:export-ydpi="96" />
    <path
       style="fill:none;stroke:#000000;stroke-width:0.264583px;stroke-linecap:butt;stroke-linejoin:miter;stroke-opacity:1"
       d="m 199.58045,497.30895 h 4 v 2 h -4 z"
       id="path1986-8"
       sodipodi:nodetypes="ccccc"
       inkscape:export-filename="C:\Users\alexs\alex.stoesser\docs\imageprojetfinal\decoupe.png"
       inkscape:export-xdpi="96"
       inkscape:export-ydpi="96" />
    <path
       style="fill:none;stroke:#000000;stroke-width:0.264583px;stroke-linecap:butt;stroke-linejoin:miter;stroke-opacity:1"
       d="m 199.58074,509.30895 h 4 v 2 h -4 z"
       id="path1986-2-2"
       sodipodi:nodetypes="ccccc"
       inkscape:export-filename="C:\Users\alexs\alex.stoesser\docs\imageprojetfinal\decoupe.png"
       inkscape:export-xdpi="96"
       inkscape:export-ydpi="96" />
    <path
       style="fill:none;stroke:#000000;stroke-width:0.264583px;stroke-linecap:butt;stroke-linejoin:miter;stroke-opacity:1"
       d="m 199.58045,521.30895 h 4 v 2 h -4 z"
       id="path1986-0"
       sodipodi:nodetypes="ccccc"
       inkscape:export-filename="C:\Users\alexs\alex.stoesser\docs\imageprojetfinal\decoupe.png"
       inkscape:export-xdpi="96"
       inkscape:export-ydpi="96" />
    <path
       style="fill:none;stroke:#000000;stroke-width:0.264583px;stroke-linecap:butt;stroke-linejoin:miter;stroke-opacity:1"
       d="m 199.58074,533.30895 h 4 v 2 h -4 z"
       id="path1986-2-21"
       sodipodi:nodetypes="ccccc"
       inkscape:export-filename="C:\Users\alexs\alex.stoesser\docs\imageprojetfinal\decoupe.png"
       inkscape:export-xdpi="96"
       inkscape:export-ydpi="96" />
    <path
       style="fill:none;stroke:#000000;stroke-width:0.264583px;stroke-linecap:butt;stroke-linejoin:miter;stroke-opacity:1"
       d="m 199.58074,545.30895 h 4 v 2 h -4 z"
       id="path1986-8-2"
       sodipodi:nodetypes="ccccc"
       inkscape:export-filename="C:\Users\alexs\alex.stoesser\docs\imageprojetfinal\decoupe.png"
       inkscape:export-xdpi="96"
       inkscape:export-ydpi="96" />
    <path
       style="fill:none;stroke:#000000;stroke-width:0.264583px;stroke-linecap:butt;stroke-linejoin:miter;stroke-opacity:1"
       d="m 199.58045,557.30896 h 4 v 2 h -4 z"
       id="path1986-2-2-1"
       sodipodi:nodetypes="ccccc"
       inkscape:export-filename="C:\Users\alexs\alex.stoesser\docs\imageprojetfinal\decoupe.png"
       inkscape:export-xdpi="96"
       inkscape:export-ydpi="96" />
    <path
       style="fill:none;stroke:#000000;stroke-width:0.264583px;stroke-linecap:butt;stroke-linejoin:miter;stroke-opacity:1"
       d="m 199.58045,569.30895 h 4 v 2 h -4 z"
       id="path1986-4"
       sodipodi:nodetypes="ccccc"
       inkscape:export-filename="C:\Users\alexs\alex.stoesser\docs\imageprojetfinal\decoupe.png"
       inkscape:export-xdpi="96"
       inkscape:export-ydpi="96" />
    <path
       style="fill:none;stroke:#000000;stroke-width:0.264583px;stroke-linecap:butt;stroke-linejoin:miter;stroke-opacity:1"
       d="m 199.58074,581.30895 h 4 v 1.99999 h -4 z"
       id="path1986-2-5"
       sodipodi:nodetypes="ccccc"
       inkscape:export-filename="C:\Users\alexs\alex.stoesser\docs\imageprojetfinal\decoupe.png"
       inkscape:export-xdpi="96"
       inkscape:export-ydpi="96" />
    <path
       style="fill:none;stroke:#000000;stroke-width:0.264583px;stroke-linecap:butt;stroke-linejoin:miter;stroke-opacity:1"
       d="m 199.58074,593.30894 h 4 v 2 h -4 z"
       id="path1986-8-4"
       sodipodi:nodetypes="ccccc"
       inkscape:export-filename="C:\Users\alexs\alex.stoesser\docs\imageprojetfinal\decoupe.png"
       inkscape:export-xdpi="96"
       inkscape:export-ydpi="96" />
    <path
       style="fill:none;stroke:#000000;stroke-width:0.264583px;stroke-linecap:butt;stroke-linejoin:miter;stroke-opacity:1"
       d="m 199.58045,605.30894 h 4 v 2 h -4 z"
       id="path1986-2-2-8"
       sodipodi:nodetypes="ccccc"
       inkscape:export-filename="C:\Users\alexs\alex.stoesser\docs\imageprojetfinal\decoupe.png"
       inkscape:export-xdpi="96"
       inkscape:export-ydpi="96" />
    <path
       style="fill:none;stroke:#000000;stroke-width:0.264583px;stroke-linecap:butt;stroke-linejoin:miter;stroke-opacity:1"
       d="m 199.58103,701.30895 h 4 v 2 h -4 z"
       id="path1986-2-2-4"
       sodipodi:nodetypes="ccccc"
       inkscape:export-filename="C:\Users\alexs\alex.stoesser\docs\imageprojetfinal\decoupe.png"
       inkscape:export-xdpi="96"
       inkscape:export-ydpi="96" />
    <path
       style="fill:none;stroke:#000000;stroke-width:0.264583px;stroke-linecap:butt;stroke-linejoin:miter;stroke-opacity:1"
       d="m 199.58074,713.30895 h 4 v 2 h -4 z"
       id="path1986-0-9"
       sodipodi:nodetypes="ccccc"
       inkscape:export-filename="C:\Users\alexs\alex.stoesser\docs\imageprojetfinal\decoupe.png"
       inkscape:export-xdpi="96"
       inkscape:export-ydpi="96" />
    <path
       style="fill:none;stroke:#000000;stroke-width:0.264583px;stroke-linecap:butt;stroke-linejoin:miter;stroke-opacity:1"
       d="m 199.58103,725.30895 h 4 v 2 h -4 z"
       id="path1986-2-21-0"
       sodipodi:nodetypes="ccccc"
       inkscape:export-filename="C:\Users\alexs\alex.stoesser\docs\imageprojetfinal\decoupe.png"
       inkscape:export-xdpi="96"
       inkscape:export-ydpi="96" />
    <path
       style="fill:none;stroke:#000000;stroke-width:0.264583px;stroke-linecap:butt;stroke-linejoin:miter;stroke-opacity:1"
       d="m 199.58103,737.30895 h 4 v 2 h -4 z"
       id="path1986-8-2-94"
       sodipodi:nodetypes="ccccc"
       inkscape:export-filename="C:\Users\alexs\alex.stoesser\docs\imageprojetfinal\decoupe.png"
       inkscape:export-xdpi="96"
       inkscape:export-ydpi="96" />
    <path
       style="fill:none;stroke:#000000;stroke-width:0.264583px;stroke-linecap:butt;stroke-linejoin:miter;stroke-opacity:1"
       d="m 199.58074,749.30896 h 4 v 2 h -4 z"
       id="path1986-2-2-1-2"
       sodipodi:nodetypes="ccccc"
       inkscape:export-filename="C:\Users\alexs\alex.stoesser\docs\imageprojetfinal\decoupe.png"
       inkscape:export-xdpi="96"
       inkscape:export-ydpi="96" />
    <path
       style="fill:none;stroke:#000000;stroke-width:0.264583px;stroke-linecap:butt;stroke-linejoin:miter;stroke-opacity:1"
       d="m 199.58074,761.30895 h 4 v 2 h -4 z"
       id="path1986-4-6"
       sodipodi:nodetypes="ccccc"
       inkscape:export-filename="C:\Users\alexs\alex.stoesser\docs\imageprojetfinal\decoupe.png"
       inkscape:export-xdpi="96"
       inkscape:export-ydpi="96" />
    <path
       style="fill:none;stroke:#000000;stroke-width:0.264583px;stroke-linecap:butt;stroke-linejoin:miter;stroke-opacity:1"
       d="m 199.58103,773.30895 h 4 v 1.99999 h -4 z"
       id="path1986-2-5-2"
       sodipodi:nodetypes="ccccc"
       inkscape:export-filename="C:\Users\alexs\alex.stoesser\docs\imageprojetfinal\decoupe.png"
       inkscape:export-xdpi="96"
       inkscape:export-ydpi="96" />
    <path
       style="fill:none;stroke:#000000;stroke-width:0.264583px;stroke-linecap:butt;stroke-linejoin:miter;stroke-opacity:1"
       d="m 199.58103,785.30894 h 4 v 2 h -4 z"
       id="path1986-8-4-4"
       sodipodi:nodetypes="ccccc"
       inkscape:export-filename="C:\Users\alexs\alex.stoesser\docs\imageprojetfinal\decoupe.png"
       inkscape:export-xdpi="96"
       inkscape:export-ydpi="96" />
    <path
       style="fill:none;stroke:#000000;stroke-width:0.264583px;stroke-linecap:butt;stroke-linejoin:miter;stroke-opacity:1"
       d="m 199.58074,797.30894 h 4 v 2 h -4 z"
       id="path1986-2-2-8-8"
       sodipodi:nodetypes="ccccc"
       inkscape:export-filename="C:\Users\alexs\alex.stoesser\docs\imageprojetfinal\decoupe.png"
       inkscape:export-xdpi="96"
       inkscape:export-ydpi="96" />
    <path
       style="fill:none;stroke:#000000;stroke-width:0.264583px;stroke-linecap:butt;stroke-linejoin:miter;stroke-opacity:1"
       d="m 199.58103,809.30894 h 4 v 2 h -4 z"
       id="path1986-0-8-6"
       sodipodi:nodetypes="ccccc"
       inkscape:export-filename="C:\Users\alexs\alex.stoesser\docs\imageprojetfinal\decoupe.png"
       inkscape:export-xdpi="96"
       inkscape:export-ydpi="96" />
    <path
       style="fill:none;stroke:#000000;stroke-width:0.264583px;stroke-linecap:butt;stroke-linejoin:miter;stroke-opacity:1"
       d="m 199.58074,821.30894 h 4 v 2 h -4 z"
       id="path1986-2-21-7-1"
       sodipodi:nodetypes="ccccc"
       inkscape:export-filename="C:\Users\alexs\alex.stoesser\docs\imageprojetfinal\decoupe.png"
       inkscape:export-xdpi="96"
       inkscape:export-ydpi="96" />
    <path
       style="fill:none;stroke:#000000;stroke-width:0.264583px;stroke-linecap:butt;stroke-linejoin:miter;stroke-opacity:1"
       d="m 199.58074,833.30894 h 4 v 2 h -4 z"
       id="path1986-8-2-9-2"
       sodipodi:nodetypes="ccccc"
       inkscape:export-filename="C:\Users\alexs\alex.stoesser\docs\imageprojetfinal\decoupe.png"
       inkscape:export-xdpi="96"
       inkscape:export-ydpi="96" />
    <path
       style="fill:none;stroke:#000000;stroke-width:0.264583px;stroke-linecap:butt;stroke-linejoin:miter;stroke-opacity:1"
       d="m 382.58016,652.30895 v 4 h -2 v -4 z"
       id="path1986-6"
       sodipodi:nodetypes="ccccc"
       inkscape:export-filename="C:\Users\alexs\alex.stoesser\docs\imageprojetfinal\decoupe.png"
       inkscape:export-xdpi="96"
       inkscape:export-ydpi="96" />
    <path
       style="fill:none;stroke:#000000;stroke-width:0.264583px;stroke-linecap:butt;stroke-linejoin:miter;stroke-opacity:1"
       d="m 370.58016,652.30924 v 4 h -2 v -4 z"
       id="path1986-2-8"
       sodipodi:nodetypes="ccccc"
       inkscape:export-filename="C:\Users\alexs\alex.stoesser\docs\imageprojetfinal\decoupe.png"
       inkscape:export-xdpi="96"
       inkscape:export-ydpi="96" />
    <path
       style="fill:none;stroke:#000000;stroke-width:0.264583px;stroke-linecap:butt;stroke-linejoin:miter;stroke-opacity:1"
       d="m 358.58015,652.30924 v 4 h -2 v -4 z"
       id="path1986-8-0"
       sodipodi:nodetypes="ccccc"
       inkscape:export-filename="C:\Users\alexs\alex.stoesser\docs\imageprojetfinal\decoupe.png"
       inkscape:export-xdpi="96"
       inkscape:export-ydpi="96" />
    <path
       style="fill:none;stroke:#000000;stroke-width:0.264583px;stroke-linecap:butt;stroke-linejoin:miter;stroke-opacity:1"
       d="m 346.58015,652.30953 v 4 h -2 v -4 z"
       id="path1986-2-2-3"
       sodipodi:nodetypes="ccccc"
       inkscape:export-filename="C:\Users\alexs\alex.stoesser\docs\imageprojetfinal\decoupe.png"
       inkscape:export-xdpi="96"
       inkscape:export-ydpi="96" />
    <path
       style="fill:none;stroke:#000000;stroke-width:0.264583px;stroke-linecap:butt;stroke-linejoin:miter;stroke-opacity:1"
       d="m 334.58015,652.30924 v 4 h -2 v -4 z"
       id="path1986-0-3"
       sodipodi:nodetypes="ccccc"
       inkscape:export-filename="C:\Users\alexs\alex.stoesser\docs\imageprojetfinal\decoupe.png"
       inkscape:export-xdpi="96"
       inkscape:export-ydpi="96" />
    <path
       style="fill:none;stroke:#000000;stroke-width:0.264583px;stroke-linecap:butt;stroke-linejoin:miter;stroke-opacity:1"
       d="m 322.58015,652.30953 v 4 h -2 v -4 z"
       id="path1986-2-21-2"
       sodipodi:nodetypes="ccccc"
       inkscape:export-filename="C:\Users\alexs\alex.stoesser\docs\imageprojetfinal\decoupe.png"
       inkscape:export-xdpi="96"
       inkscape:export-ydpi="96" />
    <path
       style="fill:none;stroke:#000000;stroke-width:0.264583px;stroke-linecap:butt;stroke-linejoin:miter;stroke-opacity:1"
       d="m 310.58015,652.30953 v 4 h -2 v -4 z"
       id="path1986-8-2-3"
       sodipodi:nodetypes="ccccc"
       inkscape:export-filename="C:\Users\alexs\alex.stoesser\docs\imageprojetfinal\decoupe.png"
       inkscape:export-xdpi="96"
       inkscape:export-ydpi="96" />
    <path
       style="fill:none;stroke:#000000;stroke-width:0.264583px;stroke-linecap:butt;stroke-linejoin:miter;stroke-opacity:1"
       d="m 298.58015,652.30924 v 4 h -2 v -4 z"
       id="path1986-2-2-1-0"
       sodipodi:nodetypes="ccccc"
       inkscape:export-filename="C:\Users\alexs\alex.stoesser\docs\imageprojetfinal\decoupe.png"
       inkscape:export-xdpi="96"
       inkscape:export-ydpi="96" />
    <path
       style="fill:none;stroke:#000000;stroke-width:0.264583px;stroke-linecap:butt;stroke-linejoin:miter;stroke-opacity:1"
       d="m 286.58016,652.30924 v 4 h -2 v -4 z"
       id="path1986-4-0"
       sodipodi:nodetypes="ccccc"
       inkscape:export-filename="C:\Users\alexs\alex.stoesser\docs\imageprojetfinal\decoupe.png"
       inkscape:export-xdpi="96"
       inkscape:export-ydpi="96" />
    <path
       style="fill:none;stroke:#000000;stroke-width:0.264583px;stroke-linecap:butt;stroke-linejoin:miter;stroke-opacity:1"
       d="m 274.58016,652.30953 v 4 h -1.99999 v -4 z"
       id="path1986-2-5-5"
       sodipodi:nodetypes="ccccc"
       inkscape:export-filename="C:\Users\alexs\alex.stoesser\docs\imageprojetfinal\decoupe.png"
       inkscape:export-xdpi="96"
       inkscape:export-ydpi="96" />
    <path
       style="fill:none;stroke:#000000;stroke-width:0.264583px;stroke-linecap:butt;stroke-linejoin:miter;stroke-opacity:1"
       d="m 262.58017,652.30953 v 4 h -2 v -4 z"
       id="path1986-8-4-7"
       sodipodi:nodetypes="ccccc"
       inkscape:export-filename="C:\Users\alexs\alex.stoesser\docs\imageprojetfinal\decoupe.png"
       inkscape:export-xdpi="96"
       inkscape:export-ydpi="96" />
    <path
       style="fill:none;stroke:#000000;stroke-width:0.264583px;stroke-linecap:butt;stroke-linejoin:miter;stroke-opacity:1"
       d="m 250.58017,652.30924 v 4 h -2 v -4 z"
       id="path1986-2-2-8-9"
       sodipodi:nodetypes="ccccc"
       inkscape:export-filename="C:\Users\alexs\alex.stoesser\docs\imageprojetfinal\decoupe.png"
       inkscape:export-xdpi="96"
       inkscape:export-ydpi="96" />
    <path
       style="fill:none;stroke:#000000;stroke-width:0.264583px;stroke-linecap:butt;stroke-linejoin:miter;stroke-opacity:1"
       d="m 154.58016,652.30982 v 4 h -2 v -4 z"
       id="path1986-2-2-4-0"
       sodipodi:nodetypes="ccccc"
       inkscape:export-filename="C:\Users\alexs\alex.stoesser\docs\imageprojetfinal\decoupe.png"
       inkscape:export-xdpi="96"
       inkscape:export-ydpi="96" />
    <path
       style="fill:none;stroke:#000000;stroke-width:0.264583px;stroke-linecap:butt;stroke-linejoin:miter;stroke-opacity:1"
       d="m 142.58016,652.30953 v 4 h -2 v -4 z"
       id="path1986-0-9-3"
       sodipodi:nodetypes="ccccc"
       inkscape:export-filename="C:\Users\alexs\alex.stoesser\docs\imageprojetfinal\decoupe.png"
       inkscape:export-xdpi="96"
       inkscape:export-ydpi="96" />
    <path
       style="fill:none;stroke:#000000;stroke-width:0.264583px;stroke-linecap:butt;stroke-linejoin:miter;stroke-opacity:1"
       d="m 130.58016,652.30982 v 4 h -2 v -4 z"
       id="path1986-2-21-0-0"
       sodipodi:nodetypes="ccccc"
       inkscape:export-filename="C:\Users\alexs\alex.stoesser\docs\imageprojetfinal\decoupe.png"
       inkscape:export-xdpi="96"
       inkscape:export-ydpi="96" />
    <path
       style="fill:none;stroke:#000000;stroke-width:0.264583px;stroke-linecap:butt;stroke-linejoin:miter;stroke-opacity:1"
       d="m 118.58016,652.30982 v 4 h -2 v -4 z"
       id="path1986-8-2-94-3"
       sodipodi:nodetypes="ccccc"
       inkscape:export-filename="C:\Users\alexs\alex.stoesser\docs\imageprojetfinal\decoupe.png"
       inkscape:export-xdpi="96"
       inkscape:export-ydpi="96" />
    <path
       style="fill:none;stroke:#000000;stroke-width:0.264583px;stroke-linecap:butt;stroke-linejoin:miter;stroke-opacity:1"
       d="m 106.58015,652.30953 v 4 h -2 v -4 z"
       id="path1986-2-2-1-2-2"
       sodipodi:nodetypes="ccccc"
       inkscape:export-filename="C:\Users\alexs\alex.stoesser\docs\imageprojetfinal\decoupe.png"
       inkscape:export-xdpi="96"
       inkscape:export-ydpi="96" />
    <path
       style="fill:none;stroke:#000000;stroke-width:0.264583px;stroke-linecap:butt;stroke-linejoin:miter;stroke-opacity:1"
       d="m 94.580159,652.30953 v 4 h -2 v -4 z"
       id="path1986-4-6-1"
       sodipodi:nodetypes="ccccc"
       inkscape:export-filename="C:\Users\alexs\alex.stoesser\docs\imageprojetfinal\decoupe.png"
       inkscape:export-xdpi="96"
       inkscape:export-ydpi="96" />
    <path
       style="fill:none;stroke:#000000;stroke-width:0.264583px;stroke-linecap:butt;stroke-linejoin:miter;stroke-opacity:1"
       d="m 82.580159,652.30982 v 4 h -1.99999 v -4 z"
       id="path1986-2-5-2-0"
       sodipodi:nodetypes="ccccc"
       inkscape:export-filename="C:\Users\alexs\alex.stoesser\docs\imageprojetfinal\decoupe.png"
       inkscape:export-xdpi="96"
       inkscape:export-ydpi="96" />
    <path
       style="fill:none;stroke:#000000;stroke-width:0.264583px;stroke-linecap:butt;stroke-linejoin:miter;stroke-opacity:1"
       d="m 70.580169,652.30982 v 4 h -2 v -4 z"
       id="path1986-8-4-4-0"
       sodipodi:nodetypes="ccccc"
       inkscape:export-filename="C:\Users\alexs\alex.stoesser\docs\imageprojetfinal\decoupe.png"
       inkscape:export-xdpi="96"
       inkscape:export-ydpi="96" />
    <path
       style="fill:none;stroke:#000000;stroke-width:0.264583px;stroke-linecap:butt;stroke-linejoin:miter;stroke-opacity:1"
       d="m 58.580169,652.30953 v 4 h -2 v -4 z"
       id="path1986-2-2-8-8-8"
       sodipodi:nodetypes="ccccc"
       inkscape:export-filename="C:\Users\alexs\alex.stoesser\docs\imageprojetfinal\decoupe.png"
       inkscape:export-xdpi="96"
       inkscape:export-ydpi="96" />
    <path
       style="fill:none;stroke:#000000;stroke-width:0.264583px;stroke-linecap:butt;stroke-linejoin:miter;stroke-opacity:1"
       d="m 46.580169,652.30982 v 4 h -2 v -4 z"
       id="path1986-0-8-6-2"
       sodipodi:nodetypes="ccccc"
       inkscape:export-filename="C:\Users\alexs\alex.stoesser\docs\imageprojetfinal\decoupe.png"
       inkscape:export-xdpi="96"
       inkscape:export-ydpi="96" />
    <path
       style="fill:none;stroke:#000000;stroke-width:0.264583px;stroke-linecap:butt;stroke-linejoin:miter;stroke-opacity:1"
       d="m 34.580169,652.30953 v 4 h -2 v -4 z"
       id="path1986-2-21-7-1-4"
       sodipodi:nodetypes="ccccc"
       inkscape:export-filename="C:\Users\alexs\alex.stoesser\docs\imageprojetfinal\decoupe.png"
       inkscape:export-xdpi="96"
       inkscape:export-ydpi="96" />
    <path
       style="fill:none;stroke:#000000;stroke-width:0.264583px;stroke-linecap:butt;stroke-linejoin:miter;stroke-opacity:1"
       d="m 22.580169,652.30953 v 4 h -2 v -4 z"
       id="path1986-8-2-9-2-5"
       sodipodi:nodetypes="ccccc"
       inkscape:export-filename="C:\Users\alexs\alex.stoesser\docs\imageprojetfinal\decoupe.png"
       inkscape:export-xdpi="96"
       inkscape:export-ydpi="96" />
    <path
       style="fill:none;stroke:#000000;stroke-width:0.264583px;stroke-linecap:butt;stroke-linejoin:miter;stroke-opacity:1"
       d="m 398.57988,851.30867 -97.00009,-10e-6 v 3 h -200 v -3 l -96.9997165,10e-6"
       id="path15152"
       sodipodi:nodetypes="cccccc"
       inkscape:export-filename="C:\Users\alexs\alex.stoesser\docs\imageprojetfinal\decoupe.png"
       inkscape:export-xdpi="96"
       inkscape:export-ydpi="96" />
    <path
       style="fill:none;stroke:#000000;stroke-width:0.264583px;stroke-linecap:butt;stroke-linejoin:miter;stroke-opacity:1"
       d="m 4.5800675,851.30866 1.1e-5,-97.00008 h -3 v -200 h 3 l -1.1e-5,-96.99972"
       id="path15152-7"
       sodipodi:nodetypes="cccccc"
       inkscape:export-filename="C:\Users\alexs\alex.stoesser\docs\imageprojetfinal\decoupe.png"
       inkscape:export-xdpi="96"
       inkscape:export-ydpi="96" />
    <path
       style="fill:none;stroke:#000000;stroke-width:0.264583px;stroke-linecap:butt;stroke-linejoin:miter;stroke-opacity:1"
       d="m 398.57988,851.30866 -10e-6,-97.00008 h 3 v -200 h -3 l 10e-6,-96.99972"
       id="path15152-7-3"
       sodipodi:nodetypes="cccccc"
       inkscape:export-filename="C:\Users\alexs\alex.stoesser\docs\imageprojetfinal\decoupe.png"
       inkscape:export-xdpi="96"
       inkscape:export-ydpi="96" />
    <path
       style="fill:none;stroke:#000000;stroke-width:0.264583px;stroke-linecap:butt;stroke-linejoin:miter;stroke-opacity:1"
       d="m 398.57988,457.30886 -97.00009,1e-5 v -3 h -200 v 3 l -96.9997215,-1e-5"
       id="path15152-2"
       sodipodi:nodetypes="cccccc"
       inkscape:export-filename="C:\Users\alexs\alex.stoesser\docs\imageprojetfinal\decoupe.png"
       inkscape:export-xdpi="96"
       inkscape:export-ydpi="96" />
  </g>
</svg>
