solid OpenSCAD_Model
  facet normal 0 0 -1
    outer loop
      vertex 23.1981 -19.1322 0
      vertex 20.9593 -14.1199 0
      vertex 22.95 -13.9444 0
    endloop
  endfacet
  facet normal 0 0 -1
    outer loop
      vertex 31.9741 -14.2358 0
      vertex 30.897 -13.0834 0
      vertex 32.4118 -12.8886 0
    endloop
  endfacet
  facet normal 0 0 -1
    outer loop
      vertex 28.9129 -13.3224 0
      vertex 28.8968 -19.2613 0
      vertex 26.247 -18.4363 0
    endloop
  endfacet
  facet normal 0 0 -1
    outer loop
      vertex 26.247 -18.4363 0
      vertex 24.9393 -13.7529 0
      vertex 26.927 -13.5456 0
    endloop
  endfacet
  facet normal 0 0 -1
    outer loop
      vertex 26.247 -18.4363 0
      vertex 24.5549 -18.0501 0
      vertex 24.9393 -13.7529 0
    endloop
  endfacet
  facet normal 0 0 -1
    outer loop
      vertex 20.9492 -20.0877 0
      vertex 23.1981 -19.1322 0
      vertex 22.9386 -19.9059 0
    endloop
  endfacet
  facet normal 0 0 -1
    outer loop
      vertex 22.95 -13.9444 0
      vertex 24.5549 -18.0501 0
      vertex 23.1981 -19.1322 0
    endloop
  endfacet
  facet normal 0 0 -1
    outer loop
      vertex 24.9393 -13.7529 0
      vertex 24.5549 -18.0501 0
      vertex 22.95 -13.9444 0
    endloop
  endfacet
  facet normal 0 -0 -1
    outer loop
      vertex 26.927 -13.5456 0
      vertex 28.9129 -13.3224 0
      vertex 26.247 -18.4363 0
    endloop
  endfacet
  facet normal 0 -0 -1
    outer loop
      vertex 23.1981 -19.1322 0
      vertex 23.1981 -19.88 0
      vertex 22.9386 -19.9059 0
    endloop
  endfacet
  facet normal 0 0 -1
    outer loop
      vertex 20.9492 -20.0877 0
      vertex 20.9593 -14.1199 0
      vertex 23.1981 -19.1322 0
    endloop
  endfacet
  facet normal 0 0 -1
    outer loop
      vertex 20.9492 -20.0877 0
      vertex 18.9672 -14.2794 0
      vertex 20.9593 -14.1199 0
    endloop
  endfacet
  facet normal -0 0 -1
    outer loop
      vertex 20.9492 -20.0877 0
      vertex 18.9584 -20.2531 0
      vertex 18.9672 -14.2794 0
    endloop
  endfacet
  facet normal 0 0 -1
    outer loop
      vertex 18.9672 -14.2794 0
      vertex 18.9584 -20.2531 0
      vertex 16.9739 -14.4231 0
    endloop
  endfacet
  facet normal 0 -0 -1
    outer loop
      vertex 28.9129 -13.3224 0
      vertex 29.0863 -19.2376 0
      vertex 28.8968 -19.2613 0
    endloop
  endfacet
  facet normal 0 0 -1
    outer loop
      vertex 26.7634 -19.5087 0
      vertex 26.247 -18.4363 0
      vertex 26.9125 -19.4926 0
    endloop
  endfacet
  facet normal 0 0 -1
    outer loop
      vertex 26.9125 -19.4926 0
      vertex 26.247 -18.4363 0
      vertex 28.8968 -19.2613 0
    endloop
  endfacet
  facet normal 0 0 -1
    outer loop
      vertex 28.9129 -13.3224 0
      vertex 31.9741 -14.2358 0
      vertex 29.0863 -19.2376 0
    endloop
  endfacet
  facet normal 0 0 -1
    outer loop
      vertex 28.9129 -13.3224 0
      vertex 30.897 -13.0834 0
      vertex 31.9741 -14.2358 0
    endloop
  endfacet
  facet normal 0 -0 -1
    outer loop
      vertex 16.9739 -14.4231 0
      vertex 18.9584 -20.2531 0
      vertex 16.9663 -20.402 0
    endloop
  endfacet
  facet normal 0 0 -1
    outer loop
      vertex 14.9795 -14.5508 0
      vertex 16.9739 -14.4231 0
      vertex 16.9663 -20.402 0
    endloop
  endfacet
  facet normal 0 0 -1
    outer loop
      vertex 14.973 -20.5344 0
      vertex 14.9795 -14.5508 0
      vertex 16.9663 -20.402 0
    endloop
  endfacet
  facet normal 0 0 -1
    outer loop
      vertex 14.973 -20.5344 0
      vertex 12.9842 -14.6626 0
      vertex 14.9795 -14.5508 0
    endloop
  endfacet
  facet normal -0 0 -1
    outer loop
      vertex 14.973 -20.5344 0
      vertex 12.9787 -20.6503 0
      vertex 12.9842 -14.6626 0
    endloop
  endfacet
  facet normal 0 0 -1
    outer loop
      vertex 12.9842 -14.6626 0
      vertex 12.9787 -20.6503 0
      vertex 10.988 -14.7584 0
    endloop
  endfacet
  facet normal 0 -0 -1
    outer loop
      vertex 10.988 -14.7584 0
      vertex 12.9787 -20.6503 0
      vertex 10.9835 -20.7496 0
    endloop
  endfacet
  facet normal 0 0 -1
    outer loop
      vertex 8.99117 -14.8383 0
      vertex 10.988 -14.7584 0
      vertex 10.9835 -20.7496 0
    endloop
  endfacet
  facet normal 0 0 -1
    outer loop
      vertex 8.9875 -20.8324 0
      vertex 8.99117 -14.8383 0
      vertex 10.9835 -20.7496 0
    endloop
  endfacet
  facet normal 0 0 -1
    outer loop
      vertex 8.9875 -20.8324 0
      vertex 6.99371 -14.9021 0
      vertex 8.99117 -14.8383 0
    endloop
  endfacet
  facet normal -0 0 -1
    outer loop
      vertex 8.9875 -20.8324 0
      vertex 6.99092 -20.8986 0
      vertex 6.99371 -14.9021 0
    endloop
  endfacet
  facet normal 0 0 -1
    outer loop
      vertex 6.99371 -14.9021 0
      vertex 6.99092 -20.8986 0
      vertex 4.99583 -14.9501 0
    endloop
  endfacet
  facet normal 0 -0 -1
    outer loop
      vertex 4.99583 -14.9501 0
      vertex 6.99092 -20.8986 0
      vertex 4.99385 -20.9482 0
    endloop
  endfacet
  facet normal 0 0 -1
    outer loop
      vertex 2.99762 -14.982 0
      vertex 4.99583 -14.9501 0
      vertex 4.99385 -20.9482 0
    endloop
  endfacet
  facet normal 0 0 -1
    outer loop
      vertex 2.99644 -20.9814 0
      vertex 2.99762 -14.982 0
      vertex 4.99385 -20.9482 0
    endloop
  endfacet
  facet normal 0 0 -1
    outer loop
      vertex 2.99644 -20.9814 0
      vertex 0.999222 -14.998 0
      vertex 2.99762 -14.982 0
    endloop
  endfacet
  facet normal -0 0 -1
    outer loop
      vertex 2.99644 -20.9814 0
      vertex 0.99884 -20.9979 0
      vertex 0.999222 -14.998 0
    endloop
  endfacet
  facet normal -0 0 -1
    outer loop
      vertex 0.999222 -14.998 0
      vertex 0.99884 -20.9979 0
      vertex -0.999222 -14.998 0
    endloop
  endfacet
  facet normal 0 0 -1
    outer loop
      vertex -2.99644 -20.9814 0
      vertex -4.99385 -20.9482 0
      vertex -2.99762 -14.982 0
    endloop
  endfacet
  facet normal 0 0 -1
    outer loop
      vertex -6.99092 -20.8986 0
      vertex -6.99371 -14.9021 0
      vertex -4.99583 -14.9501 0
    endloop
  endfacet
  facet normal 0 0 -1
    outer loop
      vertex -10.9835 -20.7496 0
      vertex -8.99117 -14.8383 0
      vertex -8.9875 -20.8324 0
    endloop
  endfacet
  facet normal 0 0 -1
    outer loop
      vertex -12.9842 -14.6626 0
      vertex -10.988 -14.7584 0
      vertex -12.9787 -20.6503 0
    endloop
  endfacet
  facet normal 0 -0 -1
    outer loop
      vertex -14.9795 -14.5508 0
      vertex -14.973 -20.5344 0
      vertex -16.9663 -20.402 0
    endloop
  endfacet
  facet normal -0 0 -1
    outer loop
      vertex -16.9739 -14.4231 0
      vertex -18.9584 -20.2531 0
      vertex -18.9672 -14.2794 0
    endloop
  endfacet
  facet normal 0 0 -1
    outer loop
      vertex -23.0507 -19.8947 0
      vertex -23.753 -18.4363 0
      vertex -20.9492 -20.0877 0
    endloop
  endfacet
  facet normal -0 0 -1
    outer loop
      vertex -20.9593 -14.1199 0
      vertex -23.753 -18.4363 0
      vertex -22.95 -13.9444 0
    endloop
  endfacet
  facet normal -0 0 -1
    outer loop
      vertex -22.95 -13.9444 0
      vertex -25.445 -18.0501 0
      vertex -24.9393 -13.7529 0
    endloop
  endfacet
  facet normal -0 0 -1
    outer loop
      vertex -24.9393 -13.7529 0
      vertex -25.445 -18.0501 0
      vertex -26.927 -13.5456 0
    endloop
  endfacet
  facet normal 0 -0 -1
    outer loop
      vertex -26.8019 -19.1322 0
      vertex -26.8019 -19.5046 0
      vertex -28.8968 -19.2613 0
    endloop
  endfacet
  facet normal 0 0 -1
    outer loop
      vertex -28.9129 -13.3224 0
      vertex -26.927 -13.5456 0
      vertex -28.8968 -19.2613 0
    endloop
  endfacet
  facet normal 0 0 -1
    outer loop
      vertex -29.0863 -19.2376 0
      vertex -28.9129 -13.3224 0
      vertex -28.8968 -19.2613 0
    endloop
  endfacet
  facet normal 0 0 -1
    outer loop
      vertex -29.0863 -19.2376 0
      vertex -31.9741 -14.2358 0
      vertex -28.9129 -13.3224 0
    endloop
  endfacet
  facet normal -0 0 -1
    outer loop
      vertex -28.9129 -13.3224 0
      vertex -31.9741 -14.2358 0
      vertex -30.897 -13.0834 0
    endloop
  endfacet
  facet normal -0 0 -1
    outer loop
      vertex -30.897 -13.0834 0
      vertex -31.9741 -14.2358 0
      vertex -32.4118 -12.8886 0
    endloop
  endfacet
  facet normal 0 0 -1
    outer loop
      vertex -26.927 -13.5456 0
      vertex -25.445 -18.0501 0
      vertex -26.8019 -19.1322 0
    endloop
  endfacet
  facet normal 0 0 -1
    outer loop
      vertex -20.9492 -20.0877 0
      vertex -23.753 -18.4363 0
      vertex -20.9593 -14.1199 0
    endloop
  endfacet
  facet normal -0 0 -1
    outer loop
      vertex -18.9672 -14.2794 0
      vertex -20.9492 -20.0877 0
      vertex -20.9593 -14.1199 0
    endloop
  endfacet
  facet normal 0 -0 -1
    outer loop
      vertex -16.9739 -14.4231 0
      vertex -16.9663 -20.402 0
      vertex -18.9584 -20.2531 0
    endloop
  endfacet
  facet normal 0 0 -1
    outer loop
      vertex -16.9739 -14.4231 0
      vertex -14.9795 -14.5508 0
      vertex -16.9663 -20.402 0
    endloop
  endfacet
  facet normal 0 -0 -1
    outer loop
      vertex -26.927 -13.5456 0
      vertex -26.8019 -19.1322 0
      vertex -28.8968 -19.2613 0
    endloop
  endfacet
  facet normal 0 0 -1
    outer loop
      vertex -22.95 -13.9444 0
      vertex -23.753 -18.4363 0
      vertex -25.445 -18.0501 0
    endloop
  endfacet
  facet normal 0 -0 -1
    outer loop
      vertex -18.9672 -14.2794 0
      vertex -18.9584 -20.2531 0
      vertex -20.9492 -20.0877 0
    endloop
  endfacet
  facet normal 0 0 -1
    outer loop
      vertex -14.9795 -14.5508 0
      vertex -12.9842 -14.6626 0
      vertex -14.973 -20.5344 0
    endloop
  endfacet
  facet normal 0 0 -1
    outer loop
      vertex -14.973 -20.5344 0
      vertex -12.9842 -14.6626 0
      vertex -12.9787 -20.6503 0
    endloop
  endfacet
  facet normal 0 0 -1
    outer loop
      vertex -12.9787 -20.6503 0
      vertex -10.988 -14.7584 0
      vertex -10.9835 -20.7496 0
    endloop
  endfacet
  facet normal 0 0 -1
    outer loop
      vertex -10.9835 -20.7496 0
      vertex -10.988 -14.7584 0
      vertex -8.99117 -14.8383 0
    endloop
  endfacet
  facet normal 0 0 -1
    outer loop
      vertex -8.9875 -20.8324 0
      vertex -8.99117 -14.8383 0
      vertex -6.99371 -14.9021 0
    endloop
  endfacet
  facet normal 0 0 -1
    outer loop
      vertex -6.99092 -20.8986 0
      vertex -8.9875 -20.8324 0
      vertex -6.99371 -14.9021 0
    endloop
  endfacet
  facet normal 0 0 -1
    outer loop
      vertex -4.99385 -20.9482 0
      vertex -6.99092 -20.8986 0
      vertex -4.99583 -14.9501 0
    endloop
  endfacet
  facet normal -0 0 -1
    outer loop
      vertex -2.99762 -14.982 0
      vertex -4.99385 -20.9482 0
      vertex -4.99583 -14.9501 0
    endloop
  endfacet
  facet normal -0 0 -1
    outer loop
      vertex -0.999222 -14.998 0
      vertex -2.99644 -20.9814 0
      vertex -2.99762 -14.982 0
    endloop
  endfacet
  facet normal 0 -0 -1
    outer loop
      vertex -0.999222 -14.998 0
      vertex -0.99884 -20.9979 0
      vertex -2.99644 -20.9814 0
    endloop
  endfacet
  facet normal 0 0 -1
    outer loop
      vertex -0.999222 -14.998 0
      vertex 0.99884 -20.9979 0
      vertex -0.99884 -20.9979 0
    endloop
  endfacet
  facet normal 0 0 1
    outer loop
      vertex 22.95 -13.9444 10
      vertex 20.9593 -14.1199 10
      vertex 23.1981 -19.1322 10
    endloop
  endfacet
  facet normal 0 0 1
    outer loop
      vertex 32.4118 -12.8886 10
      vertex 30.897 -13.0834 10
      vertex 31.9741 -14.2358 10
    endloop
  endfacet
  facet normal -0 0 1
    outer loop
      vertex 26.247 -18.4363 10
      vertex 28.8968 -19.2613 10
      vertex 28.9129 -13.3224 10
    endloop
  endfacet
  facet normal 0 0 1
    outer loop
      vertex 26.927 -13.5456 10
      vertex 24.9393 -13.7529 10
      vertex 26.247 -18.4363 10
    endloop
  endfacet
  facet normal 0 0 1
    outer loop
      vertex 24.9393 -13.7529 10
      vertex 24.5549 -18.0501 10
      vertex 26.247 -18.4363 10
    endloop
  endfacet
  facet normal 0 -0 1
    outer loop
      vertex 22.9386 -19.9059 10
      vertex 23.1981 -19.1322 10
      vertex 20.9492 -20.0877 10
    endloop
  endfacet
  facet normal 0 -0 1
    outer loop
      vertex 23.1981 -19.1322 10
      vertex 24.5549 -18.0501 10
      vertex 22.95 -13.9444 10
    endloop
  endfacet
  facet normal -0 0 1
    outer loop
      vertex 22.95 -13.9444 10
      vertex 24.5549 -18.0501 10
      vertex 24.9393 -13.7529 10
    endloop
  endfacet
  facet normal 0 0 1
    outer loop
      vertex 26.247 -18.4363 10
      vertex 28.9129 -13.3224 10
      vertex 26.927 -13.5456 10
    endloop
  endfacet
  facet normal 0 0 1
    outer loop
      vertex 22.9386 -19.9059 10
      vertex 23.1981 -19.88 10
      vertex 23.1981 -19.1322 10
    endloop
  endfacet
  facet normal 0 0 1
    outer loop
      vertex 23.1981 -19.1322 10
      vertex 20.9593 -14.1199 10
      vertex 20.9492 -20.0877 10
    endloop
  endfacet
  facet normal 0 0 1
    outer loop
      vertex 20.9593 -14.1199 10
      vertex 18.9672 -14.2794 10
      vertex 20.9492 -20.0877 10
    endloop
  endfacet
  facet normal 0 0 1
    outer loop
      vertex 18.9672 -14.2794 10
      vertex 18.9584 -20.2531 10
      vertex 20.9492 -20.0877 10
    endloop
  endfacet
  facet normal -0 0 1
    outer loop
      vertex 16.9739 -14.4231 10
      vertex 18.9584 -20.2531 10
      vertex 18.9672 -14.2794 10
    endloop
  endfacet
  facet normal 0 0 1
    outer loop
      vertex 28.8968 -19.2613 10
      vertex 29.0863 -19.2376 10
      vertex 28.9129 -13.3224 10
    endloop
  endfacet
  facet normal 0 0 1
    outer loop
      vertex 26.9125 -19.4926 10
      vertex 26.247 -18.4363 10
      vertex 26.7634 -19.5087 10
    endloop
  endfacet
  facet normal 0 0 1
    outer loop
      vertex 28.8968 -19.2613 10
      vertex 26.247 -18.4363 10
      vertex 26.9125 -19.4926 10
    endloop
  endfacet
  facet normal 0 -0 1
    outer loop
      vertex 29.0863 -19.2376 10
      vertex 31.9741 -14.2358 10
      vertex 28.9129 -13.3224 10
    endloop
  endfacet
  facet normal 0 0 1
    outer loop
      vertex 31.9741 -14.2358 10
      vertex 30.897 -13.0834 10
      vertex 28.9129 -13.3224 10
    endloop
  endfacet
  facet normal 0 0 1
    outer loop
      vertex 16.9663 -20.402 10
      vertex 18.9584 -20.2531 10
      vertex 16.9739 -14.4231 10
    endloop
  endfacet
  facet normal 0 -0 1
    outer loop
      vertex 16.9663 -20.402 10
      vertex 16.9739 -14.4231 10
      vertex 14.9795 -14.5508 10
    endloop
  endfacet
  facet normal 0 0 1
    outer loop
      vertex 16.9663 -20.402 10
      vertex 14.9795 -14.5508 10
      vertex 14.973 -20.5344 10
    endloop
  endfacet
  facet normal 0 0 1
    outer loop
      vertex 14.9795 -14.5508 10
      vertex 12.9842 -14.6626 10
      vertex 14.973 -20.5344 10
    endloop
  endfacet
  facet normal 0 0 1
    outer loop
      vertex 12.9842 -14.6626 10
      vertex 12.9787 -20.6503 10
      vertex 14.973 -20.5344 10
    endloop
  endfacet
  facet normal -0 0 1
    outer loop
      vertex 10.988 -14.7584 10
      vertex 12.9787 -20.6503 10
      vertex 12.9842 -14.6626 10
    endloop
  endfacet
  facet normal 0 0 1
    outer loop
      vertex 10.9835 -20.7496 10
      vertex 12.9787 -20.6503 10
      vertex 10.988 -14.7584 10
    endloop
  endfacet
  facet normal 0 -0 1
    outer loop
      vertex 10.9835 -20.7496 10
      vertex 10.988 -14.7584 10
      vertex 8.99117 -14.8383 10
    endloop
  endfacet
  facet normal 0 0 1
    outer loop
      vertex 10.9835 -20.7496 10
      vertex 8.99117 -14.8383 10
      vertex 8.9875 -20.8324 10
    endloop
  endfacet
  facet normal 0 0 1
    outer loop
      vertex 8.99117 -14.8383 10
      vertex 6.99371 -14.9021 10
      vertex 8.9875 -20.8324 10
    endloop
  endfacet
  facet normal 0 0 1
    outer loop
      vertex 6.99371 -14.9021 10
      vertex 6.99092 -20.8986 10
      vertex 8.9875 -20.8324 10
    endloop
  endfacet
  facet normal -0 0 1
    outer loop
      vertex 4.99583 -14.9501 10
      vertex 6.99092 -20.8986 10
      vertex 6.99371 -14.9021 10
    endloop
  endfacet
  facet normal 0 0 1
    outer loop
      vertex 4.99385 -20.9482 10
      vertex 6.99092 -20.8986 10
      vertex 4.99583 -14.9501 10
    endloop
  endfacet
  facet normal 0 -0 1
    outer loop
      vertex 4.99385 -20.9482 10
      vertex 4.99583 -14.9501 10
      vertex 2.99762 -14.982 10
    endloop
  endfacet
  facet normal 0 0 1
    outer loop
      vertex 4.99385 -20.9482 10
      vertex 2.99762 -14.982 10
      vertex 2.99644 -20.9814 10
    endloop
  endfacet
  facet normal 0 0 1
    outer loop
      vertex 2.99762 -14.982 10
      vertex 0.999222 -14.998 10
      vertex 2.99644 -20.9814 10
    endloop
  endfacet
  facet normal 0 0 1
    outer loop
      vertex 0.999222 -14.998 10
      vertex 0.99884 -20.9979 10
      vertex 2.99644 -20.9814 10
    endloop
  endfacet
  facet normal -0 0 1
    outer loop
      vertex -0.999222 -14.998 10
      vertex 0.99884 -20.9979 10
      vertex 0.999222 -14.998 10
    endloop
  endfacet
  facet normal 0 0 1
    outer loop
      vertex -2.99762 -14.982 10
      vertex -4.99385 -20.9482 10
      vertex -2.99644 -20.9814 10
    endloop
  endfacet
  facet normal 0 0 1
    outer loop
      vertex -4.99583 -14.9501 10
      vertex -6.99371 -14.9021 10
      vertex -6.99092 -20.8986 10
    endloop
  endfacet
  facet normal 0 0 1
    outer loop
      vertex -8.9875 -20.8324 10
      vertex -8.99117 -14.8383 10
      vertex -10.9835 -20.7496 10
    endloop
  endfacet
  facet normal 0 -0 1
    outer loop
      vertex -12.9787 -20.6503 10
      vertex -10.988 -14.7584 10
      vertex -12.9842 -14.6626 10
    endloop
  endfacet
  facet normal -0 0 1
    outer loop
      vertex -16.9663 -20.402 10
      vertex -14.973 -20.5344 10
      vertex -14.9795 -14.5508 10
    endloop
  endfacet
  facet normal 0 0 1
    outer loop
      vertex -18.9672 -14.2794 10
      vertex -18.9584 -20.2531 10
      vertex -16.9739 -14.4231 10
    endloop
  endfacet
  facet normal 0 0 1
    outer loop
      vertex -20.9492 -20.0877 10
      vertex -23.753 -18.4363 10
      vertex -23.0507 -19.8947 10
    endloop
  endfacet
  facet normal 0 0 1
    outer loop
      vertex -22.95 -13.9444 10
      vertex -23.753 -18.4363 10
      vertex -20.9593 -14.1199 10
    endloop
  endfacet
  facet normal 0 0 1
    outer loop
      vertex -24.9393 -13.7529 10
      vertex -25.445 -18.0501 10
      vertex -22.95 -13.9444 10
    endloop
  endfacet
  facet normal 0 0 1
    outer loop
      vertex -26.927 -13.5456 10
      vertex -25.445 -18.0501 10
      vertex -24.9393 -13.7529 10
    endloop
  endfacet
  facet normal -0 0 1
    outer loop
      vertex -28.8968 -19.2613 10
      vertex -26.8019 -19.5046 10
      vertex -26.8019 -19.1322 10
    endloop
  endfacet
  facet normal 0 -0 1
    outer loop
      vertex -28.8968 -19.2613 10
      vertex -26.927 -13.5456 10
      vertex -28.9129 -13.3224 10
    endloop
  endfacet
  facet normal 0 0 1
    outer loop
      vertex -28.8968 -19.2613 10
      vertex -28.9129 -13.3224 10
      vertex -29.0863 -19.2376 10
    endloop
  endfacet
  facet normal 0 0 1
    outer loop
      vertex -28.9129 -13.3224 10
      vertex -31.9741 -14.2358 10
      vertex -29.0863 -19.2376 10
    endloop
  endfacet
  facet normal 0 0 1
    outer loop
      vertex -30.897 -13.0834 10
      vertex -31.9741 -14.2358 10
      vertex -28.9129 -13.3224 10
    endloop
  endfacet
  facet normal 0 0 1
    outer loop
      vertex -32.4118 -12.8886 10
      vertex -31.9741 -14.2358 10
      vertex -30.897 -13.0834 10
    endloop
  endfacet
  facet normal 0 -0 1
    outer loop
      vertex -26.8019 -19.1322 10
      vertex -25.445 -18.0501 10
      vertex -26.927 -13.5456 10
    endloop
  endfacet
  facet normal 0 0 1
    outer loop
      vertex -20.9593 -14.1199 10
      vertex -23.753 -18.4363 10
      vertex -20.9492 -20.0877 10
    endloop
  endfacet
  facet normal 0 0 1
    outer loop
      vertex -20.9593 -14.1199 10
      vertex -20.9492 -20.0877 10
      vertex -18.9672 -14.2794 10
    endloop
  endfacet
  facet normal -0 0 1
    outer loop
      vertex -18.9584 -20.2531 10
      vertex -16.9663 -20.402 10
      vertex -16.9739 -14.4231 10
    endloop
  endfacet
  facet normal 0 -0 1
    outer loop
      vertex -16.9663 -20.402 10
      vertex -14.9795 -14.5508 10
      vertex -16.9739 -14.4231 10
    endloop
  endfacet
  facet normal 0 0 1
    outer loop
      vertex -28.8968 -19.2613 10
      vertex -26.8019 -19.1322 10
      vertex -26.927 -13.5456 10
    endloop
  endfacet
  facet normal -0 0 1
    outer loop
      vertex -25.445 -18.0501 10
      vertex -23.753 -18.4363 10
      vertex -22.95 -13.9444 10
    endloop
  endfacet
  facet normal -0 0 1
    outer loop
      vertex -20.9492 -20.0877 10
      vertex -18.9584 -20.2531 10
      vertex -18.9672 -14.2794 10
    endloop
  endfacet
  facet normal 0 -0 1
    outer loop
      vertex -14.973 -20.5344 10
      vertex -12.9842 -14.6626 10
      vertex -14.9795 -14.5508 10
    endloop
  endfacet
  facet normal 0 0 1
    outer loop
      vertex -12.9787 -20.6503 10
      vertex -12.9842 -14.6626 10
      vertex -14.973 -20.5344 10
    endloop
  endfacet
  facet normal 0 0 1
    outer loop
      vertex -10.9835 -20.7496 10
      vertex -10.988 -14.7584 10
      vertex -12.9787 -20.6503 10
    endloop
  endfacet
  facet normal 0 0 1
    outer loop
      vertex -8.99117 -14.8383 10
      vertex -10.988 -14.7584 10
      vertex -10.9835 -20.7496 10
    endloop
  endfacet
  facet normal 0 0 1
    outer loop
      vertex -6.99371 -14.9021 10
      vertex -8.99117 -14.8383 10
      vertex -8.9875 -20.8324 10
    endloop
  endfacet
  facet normal 0 0 1
    outer loop
      vertex -6.99371 -14.9021 10
      vertex -8.9875 -20.8324 10
      vertex -6.99092 -20.8986 10
    endloop
  endfacet
  facet normal 0 0 1
    outer loop
      vertex -4.99583 -14.9501 10
      vertex -6.99092 -20.8986 10
      vertex -4.99385 -20.9482 10
    endloop
  endfacet
  facet normal 0 0 1
    outer loop
      vertex -4.99583 -14.9501 10
      vertex -4.99385 -20.9482 10
      vertex -2.99762 -14.982 10
    endloop
  endfacet
  facet normal 0 0 1
    outer loop
      vertex -2.99762 -14.982 10
      vertex -2.99644 -20.9814 10
      vertex -0.999222 -14.998 10
    endloop
  endfacet
  facet normal -0 0 1
    outer loop
      vertex -2.99644 -20.9814 10
      vertex -0.99884 -20.9979 10
      vertex -0.999222 -14.998 10
    endloop
  endfacet
  facet normal 0 -0 1
    outer loop
      vertex -0.99884 -20.9979 10
      vertex 0.99884 -20.9979 10
      vertex -0.999222 -14.998 10
    endloop
  endfacet
  facet normal 0.0165826 -0.999862 0
    outer loop
      vertex 4.99385 -20.9482 0
      vertex 2.99644 -20.9814 10
      vertex 2.99644 -20.9814 0
    endloop
  endfacet
  facet normal 0.0165826 -0.999862 0
    outer loop
      vertex 4.99385 -20.9482 0
      vertex 4.99385 -20.9482 10
      vertex 2.99644 -20.9814 10
    endloop
  endfacet
  facet normal 0.0248624 -0.999691 0
    outer loop
      vertex 6.99092 -20.8986 0
      vertex 4.99385 -20.9482 10
      vertex 4.99385 -20.9482 0
    endloop
  endfacet
  facet normal 0.0248624 -0.999691 0
    outer loop
      vertex 6.99092 -20.8986 0
      vertex 6.99092 -20.8986 10
      vertex 4.99385 -20.9482 10
    endloop
  endfacet
  facet normal 0.03315 -0.99945 0
    outer loop
      vertex 8.9875 -20.8324 0
      vertex 6.99092 -20.8986 10
      vertex 6.99092 -20.8986 0
    endloop
  endfacet
  facet normal 0.03315 -0.99945 0
    outer loop
      vertex 8.9875 -20.8324 0
      vertex 8.9875 -20.8324 10
      vertex 6.99092 -20.8986 10
    endloop
  endfacet
  facet normal 0.0414374 -0.999141 0
    outer loop
      vertex 10.9835 -20.7496 0
      vertex 8.9875 -20.8324 10
      vertex 8.9875 -20.8324 0
    endloop
  endfacet
  facet normal 0.0414374 -0.999141 0
    outer loop
      vertex 10.9835 -20.7496 0
      vertex 10.9835 -20.7496 10
      vertex 8.9875 -20.8324 10
    endloop
  endfacet
  facet normal 0.0497098 -0.998764 0
    outer loop
      vertex 12.9787 -20.6503 0
      vertex 10.9835 -20.7496 10
      vertex 10.9835 -20.7496 0
    endloop
  endfacet
  facet normal 0.0497098 -0.998764 0
    outer loop
      vertex 12.9787 -20.6503 0
      vertex 12.9787 -20.6503 10
      vertex 10.9835 -20.7496 10
    endloop
  endfacet
  facet normal 0.0579971 -0.998317 0
    outer loop
      vertex 14.973 -20.5344 0
      vertex 12.9787 -20.6503 10
      vertex 12.9787 -20.6503 0
    endloop
  endfacet
  facet normal 0.0579971 -0.998317 0
    outer loop
      vertex 14.973 -20.5344 0
      vertex 14.973 -20.5344 10
      vertex 12.9787 -20.6503 10
    endloop
  endfacet
  facet normal 0.066262 -0.997802 0
    outer loop
      vertex 16.9663 -20.402 0
      vertex 14.973 -20.5344 10
      vertex 14.973 -20.5344 0
    endloop
  endfacet
  facet normal 0.066262 -0.997802 0
    outer loop
      vertex 16.9663 -20.402 0
      vertex 16.9663 -20.402 10
      vertex 14.973 -20.5344 10
    endloop
  endfacet
  facet normal 0.074534 -0.997218 0
    outer loop
      vertex 18.9584 -20.2531 0
      vertex 16.9663 -20.402 10
      vertex 16.9663 -20.402 0
    endloop
  endfacet
  facet normal 0.074534 -0.997218 0
    outer loop
      vertex 18.9584 -20.2531 0
      vertex 18.9584 -20.2531 10
      vertex 16.9663 -20.402 10
    endloop
  endfacet
  facet normal 0.0827983 -0.996566 0
    outer loop
      vertex 20.9492 -20.0877 0
      vertex 18.9584 -20.2531 10
      vertex 18.9584 -20.2531 0
    endloop
  endfacet
  facet normal 0.0827983 -0.996566 0
    outer loop
      vertex 20.9492 -20.0877 0
      vertex 20.9492 -20.0877 10
      vertex 18.9584 -20.2531 10
    endloop
  endfacet
  facet normal 0.0910481 -0.995846 0
    outer loop
      vertex 22.9386 -19.9059 0
      vertex 20.9492 -20.0877 10
      vertex 20.9492 -20.0877 0
    endloop
  endfacet
  facet normal 0.0910481 -0.995846 0
    outer loop
      vertex 22.9386 -19.9059 0
      vertex 22.9386 -19.9059 10
      vertex 20.9492 -20.0877 10
    endloop
  endfacet
  facet normal 0.0993183 -0.995056 0
    outer loop
      vertex 23.1981 -19.88 0
      vertex 22.9386 -19.9059 10
      vertex 22.9386 -19.9059 0
    endloop
  endfacet
  facet normal 0.0993183 -0.995056 0
    outer loop
      vertex 23.1981 -19.88 0
      vertex 23.1981 -19.88 10
      vertex 22.9386 -19.9059 10
    endloop
  endfacet
  facet normal 1 0 0
    outer loop
      vertex 23.1981 -19.1322 0
      vertex 23.1981 -19.88 10
      vertex 23.1981 -19.88 0
    endloop
  endfacet
  facet normal 1 0 -0
    outer loop
      vertex 23.1981 -19.1322 0
      vertex 23.1981 -19.1322 10
      vertex 23.1981 -19.88 10
    endloop
  endfacet
  facet normal 0.623488 -0.781833 0
    outer loop
      vertex 24.5549 -18.0501 0
      vertex 23.1981 -19.1322 10
      vertex 23.1981 -19.1322 0
    endloop
  endfacet
  facet normal 0.623488 -0.781833 0
    outer loop
      vertex 24.5549 -18.0501 0
      vertex 24.5549 -18.0501 10
      vertex 23.1981 -19.1322 10
    endloop
  endfacet
  facet normal -0.222515 -0.974929 0
    outer loop
      vertex 26.247 -18.4363 0
      vertex 24.5549 -18.0501 10
      vertex 24.5549 -18.0501 0
    endloop
  endfacet
  facet normal -0.222515 -0.974929 0
    outer loop
      vertex 26.247 -18.4363 0
      vertex 26.247 -18.4363 10
      vertex 24.5549 -18.0501 10
    endloop
  endfacet
  facet normal -0.900969 -0.433883 0
    outer loop
      vertex 26.7634 -19.5087 0
      vertex 26.247 -18.4363 10
      vertex 26.247 -18.4363 0
    endloop
  endfacet
  facet normal -0.900969 -0.433883 0
    outer loop
      vertex 26.7634 -19.5087 0
      vertex 26.7634 -19.5087 10
      vertex 26.247 -18.4363 10
    endloop
  endfacet
  facet normal 0.107539 -0.994201 0
    outer loop
      vertex 26.9125 -19.4926 0
      vertex 26.7634 -19.5087 10
      vertex 26.7634 -19.5087 0
    endloop
  endfacet
  facet normal 0.107539 -0.994201 0
    outer loop
      vertex 26.9125 -19.4926 0
      vertex 26.9125 -19.4926 10
      vertex 26.7634 -19.5087 10
    endloop
  endfacet
  facet normal 0.115789 -0.993274 0
    outer loop
      vertex 28.8968 -19.2613 0
      vertex 26.9125 -19.4926 10
      vertex 26.9125 -19.4926 0
    endloop
  endfacet
  facet normal 0.115789 -0.993274 0
    outer loop
      vertex 28.8968 -19.2613 0
      vertex 28.8968 -19.2613 10
      vertex 26.9125 -19.4926 10
    endloop
  endfacet
  facet normal 0.124015 -0.99228 0
    outer loop
      vertex 29.0863 -19.2376 0
      vertex 28.8968 -19.2613 10
      vertex 28.8968 -19.2613 0
    endloop
  endfacet
  facet normal 0.124015 -0.99228 0
    outer loop
      vertex 29.0863 -19.2376 0
      vertex 29.0863 -19.2376 10
      vertex 28.8968 -19.2613 10
    endloop
  endfacet
  facet normal 0.866024 -0.500002 0
    outer loop
      vertex 31.9741 -14.2358 0
      vertex 29.0863 -19.2376 10
      vertex 29.0863 -19.2376 0
    endloop
  endfacet
  facet normal 0.866024 -0.500002 0
    outer loop
      vertex 31.9741 -14.2358 0
      vertex 31.9741 -14.2358 10
      vertex 29.0863 -19.2376 10
    endloop
  endfacet
  facet normal 0.951057 -0.309015 0
    outer loop
      vertex 32.4118 -12.8886 0
      vertex 31.9741 -14.2358 10
      vertex 31.9741 -14.2358 0
    endloop
  endfacet
  facet normal 0.951057 -0.309015 0
    outer loop
      vertex 32.4118 -12.8886 0
      vertex 32.4118 -12.8886 10
      vertex 31.9741 -14.2358 10
    endloop
  endfacet
  facet normal -0.127556 0.991831 0
    outer loop
      vertex 30.897 -13.0834 0
      vertex 32.4118 -12.8886 10
      vertex 32.4118 -12.8886 0
    endloop
  endfacet
  facet normal -0.127556 0.991831 0
    outer loop
      vertex 30.897 -13.0834 0
      vertex 30.897 -13.0834 10
      vertex 32.4118 -12.8886 10
    endloop
  endfacet
  facet normal -0.119622 0.992819 0
    outer loop
      vertex 28.9129 -13.3224 0
      vertex 30.897 -13.0834 10
      vertex 30.897 -13.0834 0
    endloop
  endfacet
  facet normal -0.119622 0.992819 0
    outer loop
      vertex 28.9129 -13.3224 0
      vertex 28.9129 -13.3224 10
      vertex 30.897 -13.0834 10
    endloop
  endfacet
  facet normal -0.111681 0.993744 0
    outer loop
      vertex 26.927 -13.5456 0
      vertex 28.9129 -13.3224 10
      vertex 28.9129 -13.3224 0
    endloop
  endfacet
  facet normal -0.111681 0.993744 0
    outer loop
      vertex 26.927 -13.5456 0
      vertex 26.927 -13.5456 10
      vertex 28.9129 -13.3224 10
    endloop
  endfacet
  facet normal -0.103732 0.994605 0
    outer loop
      vertex 24.9393 -13.7529 0
      vertex 26.927 -13.5456 10
      vertex 26.927 -13.5456 0
    endloop
  endfacet
  facet normal -0.103732 0.994605 0
    outer loop
      vertex 24.9393 -13.7529 0
      vertex 24.9393 -13.7529 10
      vertex 26.927 -13.5456 10
    endloop
  endfacet
  facet normal -0.0957769 0.995403 0
    outer loop
      vertex 22.95 -13.9444 0
      vertex 24.9393 -13.7529 10
      vertex 24.9393 -13.7529 0
    endloop
  endfacet
  facet normal -0.0957769 0.995403 0
    outer loop
      vertex 22.95 -13.9444 0
      vertex 22.95 -13.9444 10
      vertex 24.9393 -13.7529 10
    endloop
  endfacet
  facet normal -0.0878209 0.996136 0
    outer loop
      vertex 20.9593 -14.1199 0
      vertex 22.95 -13.9444 10
      vertex 22.95 -13.9444 0
    endloop
  endfacet
  facet normal -0.0878209 0.996136 0
    outer loop
      vertex 20.9593 -14.1199 0
      vertex 20.9593 -14.1199 10
      vertex 22.95 -13.9444 10
    endloop
  endfacet
  facet normal -0.0798566 0.996806 0
    outer loop
      vertex 18.9672 -14.2794 0
      vertex 20.9593 -14.1199 10
      vertex 20.9593 -14.1199 0
    endloop
  endfacet
  facet normal -0.0798566 0.996806 0
    outer loop
      vertex 18.9672 -14.2794 0
      vertex 18.9672 -14.2794 10
      vertex 20.9593 -14.1199 10
    endloop
  endfacet
  facet normal -0.0718786 0.997413 0
    outer loop
      vertex 16.9739 -14.4231 0
      vertex 18.9672 -14.2794 10
      vertex 18.9672 -14.2794 0
    endloop
  endfacet
  facet normal -0.0718786 0.997413 0
    outer loop
      vertex 16.9739 -14.4231 0
      vertex 16.9739 -14.4231 10
      vertex 18.9672 -14.2794 10
    endloop
  endfacet
  facet normal -0.0639069 0.997956 0
    outer loop
      vertex 14.9795 -14.5508 0
      vertex 16.9739 -14.4231 10
      vertex 16.9739 -14.4231 0
    endloop
  endfacet
  facet normal -0.0639069 0.997956 0
    outer loop
      vertex 14.9795 -14.5508 0
      vertex 14.9795 -14.5508 10
      vertex 16.9739 -14.4231 10
    endloop
  endfacet
  facet normal -0.0559284 0.998435 0
    outer loop
      vertex 12.9842 -14.6626 0
      vertex 14.9795 -14.5508 10
      vertex 14.9795 -14.5508 0
    endloop
  endfacet
  facet normal -0.0559284 0.998435 0
    outer loop
      vertex 12.9842 -14.6626 0
      vertex 12.9842 -14.6626 10
      vertex 14.9795 -14.5508 10
    endloop
  endfacet
  facet normal -0.0479493 0.99885 0
    outer loop
      vertex 10.988 -14.7584 0
      vertex 12.9842 -14.6626 10
      vertex 12.9842 -14.6626 0
    endloop
  endfacet
  facet normal -0.0479493 0.99885 0
    outer loop
      vertex 10.988 -14.7584 0
      vertex 10.988 -14.7584 10
      vertex 12.9842 -14.6626 10
    endloop
  endfacet
  facet normal -0.0399555 0.999201 0
    outer loop
      vertex 8.99117 -14.8383 0
      vertex 10.988 -14.7584 10
      vertex 10.988 -14.7584 0
    endloop
  endfacet
  facet normal -0.0399555 0.999201 0
    outer loop
      vertex 8.99117 -14.8383 0
      vertex 8.99117 -14.8383 10
      vertex 10.988 -14.7584 10
    endloop
  endfacet
  facet normal -0.0319687 0.999489 0
    outer loop
      vertex 6.99371 -14.9021 0
      vertex 8.99117 -14.8383 10
      vertex 8.99117 -14.8383 0
    endloop
  endfacet
  facet normal -0.0319687 0.999489 0
    outer loop
      vertex 6.99371 -14.9021 0
      vertex 6.99371 -14.9021 10
      vertex 8.99117 -14.8383 10
    endloop
  endfacet
  facet normal -0.0239825 0.999712 0
    outer loop
      vertex 4.99583 -14.9501 0
      vertex 6.99371 -14.9021 10
      vertex 6.99371 -14.9021 0
    endloop
  endfacet
  facet normal -0.0239825 0.999712 0
    outer loop
      vertex 4.99583 -14.9501 0
      vertex 4.99583 -14.9501 10
      vertex 6.99371 -14.9021 10
    endloop
  endfacet
  facet normal -0.0159882 0.999872 0
    outer loop
      vertex 2.99762 -14.982 0
      vertex 4.99583 -14.9501 10
      vertex 4.99583 -14.9501 0
    endloop
  endfacet
  facet normal -0.0159882 0.999872 0
    outer loop
      vertex 2.99762 -14.982 0
      vertex 2.99762 -14.982 10
      vertex 4.99583 -14.9501 10
    endloop
  endfacet
  facet normal -0.00799412 0.999968 0
    outer loop
      vertex 0.999222 -14.998 0
      vertex 2.99762 -14.982 10
      vertex 2.99762 -14.982 0
    endloop
  endfacet
  facet normal -0.00799412 0.999968 0
    outer loop
      vertex 0.999222 -14.998 0
      vertex 0.999222 -14.998 10
      vertex 2.99762 -14.982 10
    endloop
  endfacet
  facet normal 0 1 0
    outer loop
      vertex -0.999222 -14.998 0
      vertex 0.999222 -14.998 10
      vertex 0.999222 -14.998 0
    endloop
  endfacet
  facet normal 0 1 0
    outer loop
      vertex -0.999222 -14.998 0
      vertex -0.999222 -14.998 10
      vertex 0.999222 -14.998 10
    endloop
  endfacet
  facet normal 0.00799412 0.999968 0
    outer loop
      vertex -2.99762 -14.982 0
      vertex -0.999222 -14.998 10
      vertex -0.999222 -14.998 0
    endloop
  endfacet
  facet normal 0.00799412 0.999968 -0
    outer loop
      vertex -2.99762 -14.982 0
      vertex -2.99762 -14.982 10
      vertex -0.999222 -14.998 10
    endloop
  endfacet
  facet normal 0.0159882 0.999872 0
    outer loop
      vertex -4.99583 -14.9501 0
      vertex -2.99762 -14.982 10
      vertex -2.99762 -14.982 0
    endloop
  endfacet
  facet normal 0.0159882 0.999872 -0
    outer loop
      vertex -4.99583 -14.9501 0
      vertex -4.99583 -14.9501 10
      vertex -2.99762 -14.982 10
    endloop
  endfacet
  facet normal 0.0239825 0.999712 0
    outer loop
      vertex -6.99371 -14.9021 0
      vertex -4.99583 -14.9501 10
      vertex -4.99583 -14.9501 0
    endloop
  endfacet
  facet normal 0.0239825 0.999712 -0
    outer loop
      vertex -6.99371 -14.9021 0
      vertex -6.99371 -14.9021 10
      vertex -4.99583 -14.9501 10
    endloop
  endfacet
  facet normal 0.0319687 0.999489 0
    outer loop
      vertex -8.99117 -14.8383 0
      vertex -6.99371 -14.9021 10
      vertex -6.99371 -14.9021 0
    endloop
  endfacet
  facet normal 0.0319687 0.999489 -0
    outer loop
      vertex -8.99117 -14.8383 0
      vertex -8.99117 -14.8383 10
      vertex -6.99371 -14.9021 10
    endloop
  endfacet
  facet normal 0.0399555 0.999201 0
    outer loop
      vertex -10.988 -14.7584 0
      vertex -8.99117 -14.8383 10
      vertex -8.99117 -14.8383 0
    endloop
  endfacet
  facet normal 0.0399555 0.999201 -0
    outer loop
      vertex -10.988 -14.7584 0
      vertex -10.988 -14.7584 10
      vertex -8.99117 -14.8383 10
    endloop
  endfacet
  facet normal 0.0479493 0.99885 0
    outer loop
      vertex -12.9842 -14.6626 0
      vertex -10.988 -14.7584 10
      vertex -10.988 -14.7584 0
    endloop
  endfacet
  facet normal 0.0479493 0.99885 -0
    outer loop
      vertex -12.9842 -14.6626 0
      vertex -12.9842 -14.6626 10
      vertex -10.988 -14.7584 10
    endloop
  endfacet
  facet normal 0.0559284 0.998435 0
    outer loop
      vertex -14.9795 -14.5508 0
      vertex -12.9842 -14.6626 10
      vertex -12.9842 -14.6626 0
    endloop
  endfacet
  facet normal 0.0559284 0.998435 -0
    outer loop
      vertex -14.9795 -14.5508 0
      vertex -14.9795 -14.5508 10
      vertex -12.9842 -14.6626 10
    endloop
  endfacet
  facet normal 0.0639069 0.997956 0
    outer loop
      vertex -16.9739 -14.4231 0
      vertex -14.9795 -14.5508 10
      vertex -14.9795 -14.5508 0
    endloop
  endfacet
  facet normal 0.0639069 0.997956 -0
    outer loop
      vertex -16.9739 -14.4231 0
      vertex -16.9739 -14.4231 10
      vertex -14.9795 -14.5508 10
    endloop
  endfacet
  facet normal 0.0718786 0.997413 0
    outer loop
      vertex -18.9672 -14.2794 0
      vertex -16.9739 -14.4231 10
      vertex -16.9739 -14.4231 0
    endloop
  endfacet
  facet normal 0.0718786 0.997413 -0
    outer loop
      vertex -18.9672 -14.2794 0
      vertex -18.9672 -14.2794 10
      vertex -16.9739 -14.4231 10
    endloop
  endfacet
  facet normal 0.0798566 0.996806 0
    outer loop
      vertex -20.9593 -14.1199 0
      vertex -18.9672 -14.2794 10
      vertex -18.9672 -14.2794 0
    endloop
  endfacet
  facet normal 0.0798566 0.996806 -0
    outer loop
      vertex -20.9593 -14.1199 0
      vertex -20.9593 -14.1199 10
      vertex -18.9672 -14.2794 10
    endloop
  endfacet
  facet normal 0.0878209 0.996136 0
    outer loop
      vertex -22.95 -13.9444 0
      vertex -20.9593 -14.1199 10
      vertex -20.9593 -14.1199 0
    endloop
  endfacet
  facet normal 0.0878209 0.996136 -0
    outer loop
      vertex -22.95 -13.9444 0
      vertex -22.95 -13.9444 10
      vertex -20.9593 -14.1199 10
    endloop
  endfacet
  facet normal 0.0957769 0.995403 0
    outer loop
      vertex -24.9393 -13.7529 0
      vertex -22.95 -13.9444 10
      vertex -22.95 -13.9444 0
    endloop
  endfacet
  facet normal 0.0957769 0.995403 -0
    outer loop
      vertex -24.9393 -13.7529 0
      vertex -24.9393 -13.7529 10
      vertex -22.95 -13.9444 10
    endloop
  endfacet
  facet normal 0.103732 0.994605 0
    outer loop
      vertex -26.927 -13.5456 0
      vertex -24.9393 -13.7529 10
      vertex -24.9393 -13.7529 0
    endloop
  endfacet
  facet normal 0.103732 0.994605 -0
    outer loop
      vertex -26.927 -13.5456 0
      vertex -26.927 -13.5456 10
      vertex -24.9393 -13.7529 10
    endloop
  endfacet
  facet normal 0.111681 0.993744 0
    outer loop
      vertex -28.9129 -13.3224 0
      vertex -26.927 -13.5456 10
      vertex -26.927 -13.5456 0
    endloop
  endfacet
  facet normal 0.111681 0.993744 -0
    outer loop
      vertex -28.9129 -13.3224 0
      vertex -28.9129 -13.3224 10
      vertex -26.927 -13.5456 10
    endloop
  endfacet
  facet normal 0.119622 0.992819 0
    outer loop
      vertex -30.897 -13.0834 0
      vertex -28.9129 -13.3224 10
      vertex -28.9129 -13.3224 0
    endloop
  endfacet
  facet normal 0.119622 0.992819 -0
    outer loop
      vertex -30.897 -13.0834 0
      vertex -30.897 -13.0834 10
      vertex -28.9129 -13.3224 10
    endloop
  endfacet
  facet normal 0.127556 0.991831 0
    outer loop
      vertex -32.4118 -12.8886 0
      vertex -30.897 -13.0834 10
      vertex -30.897 -13.0834 0
    endloop
  endfacet
  facet normal 0.127556 0.991831 -0
    outer loop
      vertex -32.4118 -12.8886 0
      vertex -32.4118 -12.8886 10
      vertex -30.897 -13.0834 10
    endloop
  endfacet
  facet normal -0.951057 -0.309015 0
    outer loop
      vertex -31.9741 -14.2358 0
      vertex -32.4118 -12.8886 10
      vertex -32.4118 -12.8886 0
    endloop
  endfacet
  facet normal -0.951057 -0.309015 0
    outer loop
      vertex -31.9741 -14.2358 0
      vertex -31.9741 -14.2358 10
      vertex -32.4118 -12.8886 10
    endloop
  endfacet
  facet normal -0.866024 -0.500002 0
    outer loop
      vertex -29.0863 -19.2376 0
      vertex -31.9741 -14.2358 10
      vertex -31.9741 -14.2358 0
    endloop
  endfacet
  facet normal -0.866024 -0.500002 0
    outer loop
      vertex -29.0863 -19.2376 0
      vertex -29.0863 -19.2376 10
      vertex -31.9741 -14.2358 10
    endloop
  endfacet
  facet normal -0.124015 -0.99228 0
    outer loop
      vertex -28.8968 -19.2613 0
      vertex -29.0863 -19.2376 10
      vertex -29.0863 -19.2376 0
    endloop
  endfacet
  facet normal -0.124015 -0.99228 0
    outer loop
      vertex -28.8968 -19.2613 0
      vertex -28.8968 -19.2613 10
      vertex -29.0863 -19.2376 10
    endloop
  endfacet
  facet normal -0.115353 -0.993325 0
    outer loop
      vertex -26.8019 -19.5046 0
      vertex -28.8968 -19.2613 10
      vertex -28.8968 -19.2613 0
    endloop
  endfacet
  facet normal -0.115353 -0.993325 0
    outer loop
      vertex -26.8019 -19.5046 0
      vertex -26.8019 -19.5046 10
      vertex -28.8968 -19.2613 10
    endloop
  endfacet
  facet normal 1 0 0
    outer loop
      vertex -26.8019 -19.1322 0
      vertex -26.8019 -19.5046 10
      vertex -26.8019 -19.5046 0
    endloop
  endfacet
  facet normal 1 0 -0
    outer loop
      vertex -26.8019 -19.1322 0
      vertex -26.8019 -19.1322 10
      vertex -26.8019 -19.5046 10
    endloop
  endfacet
  facet normal 0.623488 -0.781833 0
    outer loop
      vertex -25.445 -18.0501 0
      vertex -26.8019 -19.1322 10
      vertex -26.8019 -19.1322 0
    endloop
  endfacet
  facet normal 0.623488 -0.781833 0
    outer loop
      vertex -25.445 -18.0501 0
      vertex -25.445 -18.0501 10
      vertex -26.8019 -19.1322 10
    endloop
  endfacet
  facet normal -0.222515 -0.974929 0
    outer loop
      vertex -23.753 -18.4363 0
      vertex -25.445 -18.0501 10
      vertex -25.445 -18.0501 0
    endloop
  endfacet
  facet normal -0.222515 -0.974929 0
    outer loop
      vertex -23.753 -18.4363 0
      vertex -23.753 -18.4363 10
      vertex -25.445 -18.0501 10
    endloop
  endfacet
  facet normal -0.900973 -0.433876 0
    outer loop
      vertex -23.0507 -19.8947 0
      vertex -23.753 -18.4363 10
      vertex -23.753 -18.4363 0
    endloop
  endfacet
  facet normal -0.900973 -0.433876 0
    outer loop
      vertex -23.0507 -19.8947 0
      vertex -23.0507 -19.8947 10
      vertex -23.753 -18.4363 10
    endloop
  endfacet
  facet normal -0.0914882 -0.995806 0
    outer loop
      vertex -20.9492 -20.0877 0
      vertex -23.0507 -19.8947 10
      vertex -23.0507 -19.8947 0
    endloop
  endfacet
  facet normal -0.0914882 -0.995806 0
    outer loop
      vertex -20.9492 -20.0877 0
      vertex -20.9492 -20.0877 10
      vertex -23.0507 -19.8947 10
    endloop
  endfacet
  facet normal -0.0827983 -0.996566 0
    outer loop
      vertex -18.9584 -20.2531 0
      vertex -20.9492 -20.0877 10
      vertex -20.9492 -20.0877 0
    endloop
  endfacet
  facet normal -0.0827983 -0.996566 0
    outer loop
      vertex -18.9584 -20.2531 0
      vertex -18.9584 -20.2531 10
      vertex -20.9492 -20.0877 10
    endloop
  endfacet
  facet normal -0.074534 -0.997218 0
    outer loop
      vertex -16.9663 -20.402 0
      vertex -18.9584 -20.2531 10
      vertex -18.9584 -20.2531 0
    endloop
  endfacet
  facet normal -0.074534 -0.997218 0
    outer loop
      vertex -16.9663 -20.402 0
      vertex -16.9663 -20.402 10
      vertex -18.9584 -20.2531 10
    endloop
  endfacet
  facet normal -0.066262 -0.997802 0
    outer loop
      vertex -14.973 -20.5344 0
      vertex -16.9663 -20.402 10
      vertex -16.9663 -20.402 0
    endloop
  endfacet
  facet normal -0.066262 -0.997802 0
    outer loop
      vertex -14.973 -20.5344 0
      vertex -14.973 -20.5344 10
      vertex -16.9663 -20.402 10
    endloop
  endfacet
  facet normal -0.0579971 -0.998317 0
    outer loop
      vertex -12.9787 -20.6503 0
      vertex -14.973 -20.5344 10
      vertex -14.973 -20.5344 0
    endloop
  endfacet
  facet normal -0.0579971 -0.998317 0
    outer loop
      vertex -12.9787 -20.6503 0
      vertex -12.9787 -20.6503 10
      vertex -14.973 -20.5344 10
    endloop
  endfacet
  facet normal -0.0497098 -0.998764 0
    outer loop
      vertex -10.9835 -20.7496 0
      vertex -12.9787 -20.6503 10
      vertex -12.9787 -20.6503 0
    endloop
  endfacet
  facet normal -0.0497098 -0.998764 0
    outer loop
      vertex -10.9835 -20.7496 0
      vertex -10.9835 -20.7496 10
      vertex -12.9787 -20.6503 10
    endloop
  endfacet
  facet normal -0.0414374 -0.999141 0
    outer loop
      vertex -8.9875 -20.8324 0
      vertex -10.9835 -20.7496 10
      vertex -10.9835 -20.7496 0
    endloop
  endfacet
  facet normal -0.0414374 -0.999141 0
    outer loop
      vertex -8.9875 -20.8324 0
      vertex -8.9875 -20.8324 10
      vertex -10.9835 -20.7496 10
    endloop
  endfacet
  facet normal -0.03315 -0.99945 0
    outer loop
      vertex -6.99092 -20.8986 0
      vertex -8.9875 -20.8324 10
      vertex -8.9875 -20.8324 0
    endloop
  endfacet
  facet normal -0.03315 -0.99945 0
    outer loop
      vertex -6.99092 -20.8986 0
      vertex -6.99092 -20.8986 10
      vertex -8.9875 -20.8324 10
    endloop
  endfacet
  facet normal -0.0248624 -0.999691 0
    outer loop
      vertex -4.99385 -20.9482 0
      vertex -6.99092 -20.8986 10
      vertex -6.99092 -20.8986 0
    endloop
  endfacet
  facet normal -0.0248624 -0.999691 0
    outer loop
      vertex -4.99385 -20.9482 0
      vertex -4.99385 -20.9482 10
      vertex -6.99092 -20.8986 10
    endloop
  endfacet
  facet normal -0.0165826 -0.999862 0
    outer loop
      vertex -2.99644 -20.9814 0
      vertex -4.99385 -20.9482 10
      vertex -4.99385 -20.9482 0
    endloop
  endfacet
  facet normal -0.0165826 -0.999862 0
    outer loop
      vertex -2.99644 -20.9814 0
      vertex -2.99644 -20.9814 10
      vertex -4.99385 -20.9482 10
    endloop
  endfacet
  facet normal -0.00828754 -0.999966 0
    outer loop
      vertex -0.99884 -20.9979 0
      vertex -2.99644 -20.9814 10
      vertex -2.99644 -20.9814 0
    endloop
  endfacet
  facet normal -0.00828754 -0.999966 0
    outer loop
      vertex -0.99884 -20.9979 0
      vertex -0.99884 -20.9979 10
      vertex -2.99644 -20.9814 10
    endloop
  endfacet
  facet normal 0 -1 0
    outer loop
      vertex 0.99884 -20.9979 0
      vertex -0.99884 -20.9979 10
      vertex -0.99884 -20.9979 0
    endloop
  endfacet
  facet normal 0 -1 0
    outer loop
      vertex 0.99884 -20.9979 0
      vertex 0.99884 -20.9979 10
      vertex -0.99884 -20.9979 10
    endloop
  endfacet
  facet normal 0.00828754 -0.999966 0
    outer loop
      vertex 2.99644 -20.9814 0
      vertex 0.99884 -20.9979 10
      vertex 0.99884 -20.9979 0
    endloop
  endfacet
  facet normal 0.00828754 -0.999966 0
    outer loop
      vertex 2.99644 -20.9814 0
      vertex 2.99644 -20.9814 10
      vertex 0.99884 -20.9979 10
    endloop
  endfacet
endsolid OpenSCAD_Model
